make[2]: Entering directory `/home/krzysztof/src/pdfedit-0.3.1/src/utils'
make[2]: `libutils.a' is up to date.
make[2]: Leaving directory `/home/krzysztof/src/pdfedit-0.3.1/src/utils'
cd kernel && qmake && make staticlib
make[2]: Entering directory `/home/krzysztof/src/pdfedit-0.3.1/src/kernel'
make[2]: Nothing to be done for `staticlib'.
make[2]: Leaving directory `/home/krzysztof/src/pdfedit-0.3.1/src/kernel'
cd kpdf-kde-3.3.2 && qmake && make staticlib
make[2]: Entering directory `/home/krzysztof/src/pdfedit-0.3.1/src/kpdf-kde-3.3.2'
g++ -c -pipe -O2 -DNDEBUG -Wall -W -O2 -D_REENTRANT -DQT_NO_DEBUG -DQT_THREAD_SUPPORT -I/usr/share/qt3/mkspecs/default -I. -I../xpdf -I../xpdf/xpdf -I../xpdf/goo -I../xpdf/splash -I../xpdf/fofi -I/usr/share/qt3/include -o QOutputDevPixmap.o QOutputDevPixmap.cpp
QOutputDevPixmap.cpp:26:21: error: qpixmap.h: No such file or directory
QOutputDevPixmap.cpp:27:20: error: qimage.h: No such file or directory
QOutputDevPixmap.h:40: error: âQImageâ does not name a type
QOutputDevPixmap.h:43: error: âQImageâ does not name a type
QOutputDevPixmap.cpp: In constructor âQOutputDevPixmap::QOutputDevPixmap(Guchar*)â:
QOutputDevPixmap.cpp:40: error: class âQOutputDevPixmapâ does not have any field named âm_imageâ
QOutputDevPixmap.cpp: In member function âvirtual void QOutputDevPixmap::endPage()â:
QOutputDevPixmap.cpp:63: error: âm_imageâ was not declared in this scope
QOutputDevPixmap.cpp:79: error: âm_imageâ was not declared in this scope
QOutputDevPixmap.cpp:79: error: âucharâ was not declared in this scope
QOutputDevPixmap.cpp:79: error: expected primary-expression before â)â token
QOutputDevPixmap.cpp:79: error: âQImageâ has not been declared
QOutputDevPixmap.cpp:79: error: âQImageâ was not declared in this scope
make[2]: *** [QOutputDevPixmap.o] Error 1
make[2]: Leaving directory `/home/krzysztof/src/pdfedit-0.3.1/src/kpdf-kde-3.3.2'
make[1]: *** [qoutputdevices] Error 2
make[1]: Leaving directory `/home/krzysztof/src/pdfedit-0.3.1/src'
make: *** [src] Error 2