All pastes #516221 Raw Edit

Mine

public text v1 · immutable
#516221 ·published 2007-05-28 16:21 UTC
rendered paste body
In file included from /usr/local/include/mythtv/libmythtv/programinfo.h:4,
                 from recordingselector.cpp:22:
/usr/local/include/mythtv/libmythtv/recordingtypes.h:4:21: error: mythexp.h: No such file or directory
In file included from recordingselector.cpp:22:
/usr/local/include/mythtv/libmythtv/programinfo.h:5:23: error: mythdbcon.h: No such file or directory
/usr/local/include/mythtv/libmythtv/programinfo.h:372: error: MSqlBindings has not been declared
/usr/local/include/mythtv/libmythtv/programinfo.h:374: error: MSqlBindings has not been declared
/usr/local/include/mythtv/libmythtv/programinfo.h:381: error: MSqlBindings has not been declared
recordingselector.cpp: In member function void RecordingSelector::OKPressed():
recordingselector.cpp:323: error: MSqlQuery was not declared in this scope
recordingselector.cpp:323: error: expected `;' before query
recordingselector.cpp:324: error: query was not declared in this scope
recordingselector.cpp: In member function void RecordingSelector::updateSelectedList():
recordingselector.cpp:473: error: MSqlQuery was not declared in this scope
recordingselector.cpp:473: error: expected `;' before query
recordingselector.cpp:474: error: query was not declared in this scope
make[2]: *** [recordingselector.o] Error 1
make[2]: Leaving directory `/media/builds/trunk/mythplugins/mytharchive/mytharchive'
make[1]: *** [sub-mytharchive] Error 2
make[1]: Leaving directory `/media/builds/trunk/mythplugins/mytharchive'
make: *** [sub-mytharchive] Error 2
mythtv@linux-n4ir:~/media/builds/trunk/mythplugins>