make[1]: Leaving directory `/home/sheik/anope/src/tools'
*** All done, now (g)make install to install Anope/Modules/Tools
(cd src/modules ; ./configure ; make 'CFLAGS=-pipe -g -O2 -I/usr/include/mysql -pthread -export-dynamic' 'CC=gcc' 'ANOPELIBS=-lnsl -lresolv -lbsd -lmysqlclient -ldl' 'LDFLAGS=-L/usr/lib ' 'BINDEST=/home/sheik/services' 'INSTALL=/usr/bin/install' 'INCLUDEDIR=../include' 'RM=/bin/rm' 'CP=/bin/cp' 'TOUCH=/bin/touch' 'SHELL=/bin/sh' 'DATDEST=/home/sheik/services' 'RUNGROUP=' 'MODULE_PATH=/home/sheik/services/modules/' 'RDB=rdb.c ' 'MYSQL=mysql.c ' 'SHARED=-shared' 'MODULEFLAGS=-fPIC -DPIC -shared' all; )
make[1]: Entering directory `/home/sheik/anope/src/modules'
gcc -pipe -g -O2 -I/usr/include/mysql -pthread -export-dynamic -rdynamic -Wall -fPIC -DPIC -shared -I../../include -c anope_convert.c
anope_convert.c:26:25: ../services.h: No such file or directory
anope_convert.c:27:23: ../pseudo.h: No such file or directory
anope_convert.c:37: error: syntax error before '*' token
anope_convert.c:37: warning: type defaults to `int' in declaration of `nalists'
anope_convert.c:37: warning: data definition has no type or storage class
anope_convert.c:38: error: syntax error before '*' token
anope_convert.c:38: warning: type defaults to `int' in declaration of `chanlists'
anope_convert.c:38: warning: data definition has no type or storage class
anope_convert.c:39: error: syntax error before "akills"
anope_convert.c:39: warning: type defaults to `int' in declaration of `akills'
anope_convert.c:39: warning: data definition has no type or storage class
anope_convert.c:41: error: syntax error before '*' token
anope_convert.c:41: warning: type defaults to `int' in declaration of `f'
anope_convert.c:41: warning: data definition has no type or storage class
anope_convert.c: In function `write_accounts':
anope_convert.c:46: error: `NickAlias' undeclared (first use in this function)
anope_convert.c:46: error: (Each undeclared identifier is reported only once
anope_convert.c:46: error: for each function it appears in.)
anope_convert.c:46: error: `na' undeclared (first use in this function)
anope_convert.c:56: error: `NS_VERBOTEN' undeclared (first use in this function)
anope_convert.c:60: error: `NS_NO_EXPIRE' undeclared (first use in this function)
anope_convert.c:62: error: `NI_HIDE_EMAIL' undeclared (first use in this function)
anope_convert.c:64: error: `NI_ENCRYPTEDPW' undeclared (first use in this function)
anope_convert.c:70: warning: implicit declaration of function `strcpy'
anope_convert.c:75: warning: implicit declaration of function `sprintf'
anope_convert.c:86: warning: implicit declaration of function `fprintf'
anope_convert.c:89: error: `NULL' undeclared (first use in this function)
anope_convert.c: In function `convert_mlock':
anope_convert.c:111: error: `CMODE_i' undeclared (first use in this function)
anope_convert.c:112: error: `CMODE_m' undeclared (first use in this function)
anope_convert.c:113: error: `CMODE_n' undeclared (first use in this function)
anope_convert.c:114: error: `CMODE_p' undeclared (first use in this function)
anope_convert.c:115: error: `CMODE_s' undeclared (first use in this function)
anope_convert.c:116: error: `CMODE_t' undeclared (first use in this function)
anope_convert.c:117: error: `CMODE_k' undeclared (first use in this function)
anope_convert.c:118: error: `CMODE_l' undeclared (first use in this function)
anope_convert.c: In function `write_channels':
anope_convert.c:126: error: `ChannelInfo' undeclared (first use in this function)
anope_convert.c:126: error: `ci' undeclared (first use in this function)
anope_convert.c:137: error: `CI_NO_EXPIRE' undeclared (first use in this function)
anope_convert.c:139: error: `CI_SECUREOPS' undeclared (first use in this function)
anope_convert.c:141: error: `CI_KEEPTOPIC' undeclared (first use in this function)
anope_convert.c:143: error: `CI_OPNOTICE' undeclared (first use in this function)
anope_convert.c:150: error: `CI_VERBOTEN' undeclared (first use in this function)
anope_convert.c:173: error: `NULL' undeclared (first use in this function)
anope_convert.c:179: error: `ACCESS_VOP' undeclared (first use in this function)
anope_convert.c:180: error: `ACCESS_HOP' undeclared (first use in this function)
anope_convert.c:181: error: `ACCESS_AOP' undeclared (first use in this function)
anope_convert.c:182: error: `ACCESS_SOP' undeclared (first use in this function)
anope_convert.c:202: error: `AK_ISNICK' undeclared (first use in this function)
anope_convert.c:235: warning: implicit declaration of function `time'
anope_convert.c: In function `write_akills':
anope_convert.c:244: error: `Akill' undeclared (first use in this function)
anope_convert.c:244: error: `ak' undeclared (first use in this function)
anope_convert.c:249: error: request for member `count' in something not a structure or union
anope_convert.c:252: error: request for member `count' in something not a structure or union
anope_convert.c:253: error: request for member `list' in something not a structure or union
anope_convert.c: In function `AnopeInit':
anope_convert.c:262: error: `time_t' undeclared (first use in this function)
anope_convert.c:262: error: syntax error before "ts"
anope_convert.c:264: warning: implicit declaration of function `fopen'
anope_convert.c:264: warning: assignment makes pointer from integer without a cast
anope_convert.c:267: warning: implicit declaration of function `alog'
anope_convert.c:267: error: `errno' undeclared (first use in this function)
anope_convert.c:267: warning: implicit declaration of function `strerror'
anope_convert.c:269: error: `ts' undeclared (first use in this function)
anope_convert.c:270: warning: implicit declaration of function `ctime'
anope_convert.c:270: warning: format argument is not a pointer (arg 3)
anope_convert.c:278: warning: implicit declaration of function `fclose'
make[1]: *** [anope_convert.o] Error 1
make[1]: Leaving directory `/home/sheik/anope/src/modules'
make: *** [modules] Error 2
sheik@shellshed.com [~/anope]#