All pastes #51612 Raw Edit

shaun

public text v1 · immutable
#51612 ·published 2006-04-26 22:00 UTC
rendered paste body
config.status: executing depfiles commands
make  all-am
make[1]: Entering directory `/var/tmp/portage/xsetroot-1.0.1/work/xsetroot-1.0.1'
if x86_64-pc-linux-gnu-gcc -DHAVE_CONFIG_H -I. -I. -I.     -march=k8 -Os -pipe -MT xsetroot-xsetroot.o -MD -MP -MF ".deps/xsetroot-xsetroot.Tpo" \
  -c -o xsetroot-xsetroot.o `test -f 'xsetroot.c' || echo './'`xsetroot.c; \
then mv -f ".deps/xsetroot-xsetroot.Tpo" ".deps/xsetroot-xsetroot.Po"; \
else rm -f ".deps/xsetroot-xsetroot.Tpo"; exit 1; \
fi
sed -e 's|__vendorversion__|"xsetroot 1.0.1" "X Version 11"|' -e 's|__xorgversion__|"xsetroot 1.0.1" "X Version 11"|' -e 's|__xservername__|Xorg|g' -e 's|__xconfigfile__|xorg.conf|g' -e 's|__projectroot__|/usr|g' -e 's|__apploaddir__||' -e 's|__appmansuffix__|1x|g' -e 's|__libmansuffix__|3x|g' -e 's|__adminmansuffix__|8|g' -e 's|__miscmansuffix__|7|g' -e 's|__filemansuffix__|5x|g' < xsetroot.man > xsetroot.1x
xsetroot.c:44:28: X11/bitmaps/gray: No such file or directory
xsetroot.c: In function `main':
xsetroot.c:230: error: `gray_bits' undeclared (first use in this function)
xsetroot.c:230: error: (Each undeclared identifier is reported only once
xsetroot.c:230: error: for each function it appears in.)
xsetroot.c:231: error: `gray_width' undeclared (first use in this function)
xsetroot.c:231: error: `gray_height' undeclared (first use in this function)
make[1]: *** [xsetroot-xsetroot.o] Error 1
make[1]: Leaving directory `/var/tmp/portage/xsetroot-1.0.1/work/xsetroot-1.0.1'
make: *** [all] Error 2

!!! ERROR: x11-apps/xsetroot-1.0.1 failed.
Call stack:
  ebuild.sh, line 1525:   Called dyn_compile
  ebuild.sh, line 928:   Called src_compile
  ebuild.sh, line 1237:   Called x-modular_src_compile
  x-modular.eclass, line 320:   Called x-modular_src_make
  x-modular.eclass, line 315:   Called die

!!! emake failed
!!! If you need support, post the topmost build error, and the call stack if relevant.

slacker ~ #