rendered paste bodyi686-pc-linux-gnu-g++ -march=pentium2 -O2 -fomit-frame-pointer -pipe -Wl,--as-needed -shared-libgcc -o .libs/sabcmd sabcmd.o -lm -L/usr/i686-pc-linux-gnu/bin -L/usr/i686-pc-linux-gnu/lib -L/usr/lib/gcc/i686-pc-linux-gnu/4.1.0 -L/usr/lib/gcc/i686-pc-linux-gnu/4.1.0/../../../../i686-pc-linux-gnu/lib -lgcc_s -lc ../engine/.libs/libsablot.so /usr/lib/gcc/i686-pc-linux-gnu/4.1.0/libstdc++.so /usr/lib/libexpat.so
../engine/.libs/libsablot.so: undefined reference to `XML_ParserCreateNS'
../engine/.libs/libsablot.so: undefined reference to `XML_SetElementHandler'
../engine/.libs/libsablot.so: undefined reference to `XML_Parse'
../engine/.libs/libsablot.so: undefined reference to `XML_ParserFree'
../engine/.libs/libsablot.so: undefined reference to `XML_SetEntityDeclHandler'
../engine/.libs/libsablot.so: undefined reference to `XML_SetExternalEntityRefHandler'
../engine/.libs/libsablot.so: undefined reference to `XML_SetCharacterDataHandler'
../engine/.libs/libsablot.so: undefined reference to `XML_ErrorString'
../engine/.libs/libsablot.so: undefined reference to `XML_ExternalEntityParserCreate'
../engine/.libs/libsablot.so: undefined reference to `XML_SetParamEntityParsing'../engine/.libs/libsablot.so: undefined reference to `XML_SetBase'
../engine/.libs/libsablot.so: undefined reference to `XML_SetReturnNSTriplet'
../engine/.libs/libsablot.so: undefined reference to `XML_SetUserData'
../engine/.libs/libsablot.so: undefined reference to `XML_SetProcessingInstructionHandler'
../engine/.libs/libsablot.so: undefined reference to `XML_SetEncoding'
../engine/.libs/libsablot.so: undefined reference to `XML_GetErrorCode'
../engine/.libs/libsablot.so: undefined reference to `XML_SetCommentHandler'
../engine/.libs/libsablot.so: undefined reference to `XML_GetCurrentLineNumber'
../engine/.libs/libsablot.so: undefined reference to `XML_SetNamespaceDeclHandler'
collect2: ld returned 1 exit status
make[2]: *** [sabcmd] Error 1
make[2]: Leaving directory `/var/tmp/portage/sablotron-1.0.2/work/Sablot-1.0.2/src/command'
make[1]: *** [all-recursive] Error 1
make[1]: Leaving directory `/var/tmp/portage/sablotron-1.0.2/work/Sablot-1.0.2/src'
make: *** [all-recursive] Error 1
!!! ERROR: app-text/sablotron-1.0.2 failed.