rendered paste bodyif g++ -DHAVE_CONFIG_H -I. -I. -I../.. -I. -I./../../dep/include -I./../framework -I./../shared -DENABLE_RA -DENABLE_CLI -g -DMANGOS_DEBUG -g -O2 -MT DBCStores.o -MD -MP -MF ".deps/DBCStores.Tpo" -c -o DBCStores.o `test -f 'Database/DBCStores.cpp' || echo './'`Database/DBCStores.cpp; \
then mv -f ".deps/DBCStores.Tpo" ".deps/DBCStores.Po"; else rm -f ".deps/DBCStores.Tpo"; exit 1; fi
if g++ -DHAVE_CONFIG_H -I. -I. -I../.. -I. -I./../../dep/include -I./../framework -I./../shared -DENABLE_RA -DENABLE_CLI -g -DMANGOS_DEBUG -g -O2 -MT DBCfmt.o -MD -MP -MF ".deps/DBCfmt.Tpo" -c -o DBCfmt.o `test -f 'Database/DBCfmt.cpp' || echo './'`Database/DBCfmt.cpp; \
then mv -f ".deps/DBCfmt.Tpo" ".deps/DBCfmt.Po"; else rm -f ".deps/DBCfmt.Tpo"; exit 1; fi
if g++ -DHAVE_CONFIG_H -I. -I. -I../.. -I. -I./../../dep/include -I./../framework -I./../shared -DENABLE_RA -DENABLE_CLI -g -DMANGOS_DEBUG -g -O2 -MT Database.o -MD -MP -MF ".deps/Database.Tpo" -c -o Database.o `test -f 'Database/Database.cpp' || echo './'`Database/Database.cpp; \
then mv -f ".deps/Database.Tpo" ".deps/Database.Po"; else rm -f ".deps/Database.Tpo"; exit 1; fi
In file included from Database/DatabaseEnv.h:29,
from Database/Database.cpp:19:
./Database/QueryResultMysql.h:27:19: error: mysql.h: No such file or directory
./Database/QueryResultMysql.h:33: error: expected `)' before '*' token
./Database/QueryResultMysql.h:40: error: 'enum_field_types' has not been declared
./Database/QueryResultMysql.h:43: error: ISO C++ forbids declaration of 'MYSQL_RES' with no type
./Database/QueryResultMysql.h:43: error: expected ';' before '*' token
./Database/DatabaseMysql.h:67: error: ISO C++ forbids declaration of 'MYSQL' with no type
./Database/DatabaseMysql.h:67: error: expected ';' before '*' token
./Database/DatabaseMysql.h: In member function 'virtual DatabaseMysql::operator bool() const':
./Database/DatabaseMysql.h:52: error: 'mMysql' was not declared in this scope
make[3]: *** [Database.o] Error 1
make[2]: *** [all-recursive] Error 1
make[1]: *** [all-recursive] Error 1
make: *** [all] Error 2
jesus:~/Mangos andrewnorthall$