All pastes #508295 Raw Edit

Stuff

public text v1 · immutable
·published 2007-05-24 22:59 UTC
rendered paste body
dev3:~/eresi# make
Building e2dbg-libc ..
make[1]: Entering directory `/root/eresi/elibc'
ar rc libcelfsh32.a memcpy.32.o strlen.32.o
ranlib libcelfsh32.a
make[1]: Leaving directory `/root/eresi/elibc'
Libc-elfsh has been built successfully.
Building liballocproxy ..
make[1]: Entering directory `/root/eresi/liballocproxy'
cc -D__STD_C -DMALLOC_DEBUG -DUSE_ARENAS -DSHARED -DUSE_TLS -fPIC -g3 -Iinclude -I../libelfsh/include/   -c -o aproxy_malloc.o aproxy_malloc.c
In file included from /usr/include/asm/bitops.h:8,
                 from /usr/include/linux/bitops.h:9,
                 from /usr/include/asm-i486/cpufeature.h:10,
                 from /usr/include/asm/cpufeature.h:8,
                 from /usr/include/asm-i486/processor.h:16,
                 from /usr/include/asm/processor.h:8,
                 from /usr/include/asm-i486/atomic.h:5,
                 from /usr/include/asm/atomic.h:8,
                 from include/aproxy-machine.h:27,
                 from aproxy_malloc.c:278:
/usr/include/asm-i486/bitops.h:244: error: expected '=', ',', ';', 'asm' or '__attribute__' before 'int'
In file included from /usr/include/asm/system.h:8,
                 from /usr/include/asm-i486/processor.h:18,
                 from /usr/include/asm/processor.h:8,
                 from /usr/include/asm-i486/atomic.h:5,
                 from /usr/include/asm/atomic.h:8,
                 from include/aproxy-machine.h:27,
                 from aproxy_malloc.c:278:
/usr/include/asm-i486/system.h:306: error: expected declaration specifiers or '...' before 'u8'
/usr/include/asm-i486/system.h:306: error: expected declaration specifiers or '...' before 'u8'
/usr/include/asm-i486/system.h:307: error: expected declaration specifiers or '...' before 'u16'
/usr/include/asm-i486/system.h:307: error: expected declaration specifiers or '...' before 'u16'
/usr/include/asm-i486/system.h:308: error: expected declaration specifiers or '...' before 'u32'
/usr/include/asm-i486/system.h:308: error: expected declaration specifiers or '...' before 'u32'
/usr/include/asm-i486/system.h: In function 'cmpxchg_386':
/usr/include/asm-i486/system.h:315: error: too many arguments to function 'cmpxchg_386_u8'
/usr/include/asm-i486/system.h:317: error: too many arguments to function 'cmpxchg_386_u16'
/usr/include/asm-i486/system.h:319: error: too many arguments to function 'cmpxchg_386_u32'
In file included from /usr/include/linux/cpumask.h:86,
                 from /usr/include/asm-i486/processor.h:22,
                 from /usr/include/asm/processor.h:8,
                 from /usr/include/asm-i486/atomic.h:5,
                 from /usr/include/asm/atomic.h:8,
                 from include/aproxy-machine.h:27,
                 from aproxy_malloc.c:278:
/usr/include/linux/bitmap.h: In function 'bitmap_zero':
/usr/include/linux/bitmap.h:131: error: 'BITS_PER_LONG' undeclared (first use in this function)
/usr/include/linux/bitmap.h:131: error: (Each undeclared identifier is reported only once
/usr/include/linux/bitmap.h:131: error: for each function it appears in.)
/usr/include/linux/bitmap.h: In function 'bitmap_fill':
/usr/include/linux/bitmap.h:146: error: 'BITS_PER_LONG' undeclared (first use in this function)
/usr/include/linux/bitmap.h: In function 'bitmap_copy':
/usr/include/linux/bitmap.h:152: error: 'BITS_PER_LONG' undeclared (first use in this function)
/usr/include/linux/bitmap.h: In function 'bitmap_and':
/usr/include/linux/bitmap.h:163: error: 'BITS_PER_LONG' undeclared (first use in this function)
/usr/include/linux/bitmap.h: In function 'bitmap_or':
/usr/include/linux/bitmap.h:172: error: 'BITS_PER_LONG' undeclared (first use in this function)
/usr/include/linux/bitmap.h: In function 'bitmap_or':
/usr/include/linux/bitmap.h:172: error: 'BITS_PER_LONG' undeclared (first use in this function)
/usr/include/linux/bitmap.h: In function 'bitmap_xor':
/usr/include/linux/bitmap.h:181: error: 'BITS_PER_LONG' undeclared (first use in this function)
/usr/include/linux/bitmap.h: In function 'bitmap_andnot':
/usr/include/linux/bitmap.h:190: error: 'BITS_PER_LONG' undeclared (first use in this function)
/usr/include/linux/bitmap.h: In function 'bitmap_complement':
/usr/include/linux/bitmap.h:199: error: 'BITS_PER_LONG' undeclared (first use in this function)
/usr/include/linux/bitmap.h: In function 'bitmap_equal':
/usr/include/linux/bitmap.h:208: error: 'BITS_PER_LONG' undeclared (first use in this function)
/usr/include/linux/bitmap.h: In function 'bitmap_intersects':
/usr/include/linux/bitmap.h:217: error: 'BITS_PER_LONG' undeclared (first use in this function)
/usr/include/linux/bitmap.h: In function 'bitmap_subset':
/usr/include/linux/bitmap.h:226: error: 'BITS_PER_LONG' undeclared (first use in this function)
/usr/include/linux/bitmap.h: In function 'bitmap_empty':
/usr/include/linux/bitmap.h:234: error: 'BITS_PER_LONG' undeclared (first use in this function)
/usr/include/linux/bitmap.h: In function 'bitmap_full':
/usr/include/linux/bitmap.h:242: error: 'BITS_PER_LONG' undeclared (first use in this function)
/usr/include/linux/bitmap.h: In function 'bitmap_weight':
/usr/include/linux/bitmap.h:250: error: 'BITS_PER_LONG' undeclared (first use in this function)
/usr/include/linux/bitmap.h: In function 'bitmap_shift_right':
/usr/include/linux/bitmap.h:258: error: 'BITS_PER_LONG' undeclared (first use in this function)
/usr/include/linux/bitmap.h: In function 'bitmap_shift_left':
/usr/include/linux/bitmap.h:267: error: 'BITS_PER_LONG' undeclared (first use in this function)
In file included from /usr/include/asm-i486/processor.h:22,
                 from /usr/include/asm/processor.h:8,
                 from /usr/include/asm-i486/atomic.h:5,
                 from /usr/include/asm/atomic.h:8,
                 from include/aproxy-machine.h:27,
                 from aproxy_malloc.c:278:
/usr/include/linux/cpumask.h: At top level:
/usr/include/linux/cpumask.h:88: error: expected specifier-qualifier-list before 'DECLARE_BITMAP'
/usr/include/linux/cpumask.h: In function '__cpu_set':
/usr/include/linux/cpumask.h:94: error: 'cpumask_t' has no member named 'bits'
/usr/include/linux/cpumask.h: In function '__cpu_clear':
/usr/include/linux/cpumask.h:100: error: 'cpumask_t' has no member named 'bits'
/usr/include/linux/cpumask.h: In function '__cpus_setall':
/usr/include/linux/cpumask.h:106: error: 'cpumask_t' has no member named 'bits'
/usr/include/linux/cpumask.h: In function '__cpus_clear':
/usr/include/linux/cpumask.h:112: error: 'cpumask_t' has no member named 'bits'
/usr/include/linux/cpumask.h: In function '__cpu_test_and_set':
/usr/include/linux/cpumask.h:121: error: 'cpumask_t' has no member named 'bits'
/usr/include/linux/cpumask.h: In function '__cpus_and':
/usr/include/linux/cpumask.h:128: error: 'cpumask_t' has no member named 'bits'
/usr/include/linux/cpumask.h:128: error: 'cpumask_t' has no member named 'bits'
/usr/include/linux/cpumask.h:128: error: 'cpumask_t' has no member named 'bits'
/usr/include/linux/cpumask.h: In function '__cpus_or':
/usr/include/linux/cpumask.h:135: error: 'cpumask_t' has no member named 'bits'
/usr/include/linux/cpumask.h:135: error: 'cpumask_t' has no member named 'bits'
/usr/include/linux/cpumask.h:135: error: 'cpumask_t' has no member named 'bits'
/usr/include/linux/cpumask.h: In function '__cpus_xor':
/usr/include/linux/cpumask.h:142: error: 'cpumask_t' has no member named 'bits'
/usr/include/linux/cpumask.h:142: error: 'cpumask_t' has no member named 'bits'
/usr/include/linux/cpumask.h:142: error: 'cpumask_t' has no member named 'bits'
/usr/include/linux/cpumask.h: In function '__cpus_andnot':
/usr/include/linux/cpumask.h:150: error: 'cpumask_t' has no member named 'bits'
/usr/include/linux/cpumask.h:150: error: 'cpumask_t' has no member named 'bits'
/usr/include/linux/cpumask.h:150: error: 'cpumask_t' has no member named 'bits'
/usr/include/linux/cpumask.h: In function '__cpus_full':
/usr/include/linux/cpumask.h:190: error: 'cpumask_t' has no member named 'bits'
/usr/include/linux/cpumask.h: In function '__cpus_weight':
/usr/include/linux/cpumask.h:196: error: 'cpumask_t' has no member named 'bits'
/usr/include/linux/cpumask.h: In function '__cpus_shift_right':
/usr/include/linux/cpumask.h:204: error: 'cpumask_t' has no member named 'bits'
/usr/include/linux/cpumask.h:204: error: 'cpumask_t' has no member named 'bits'
/usr/include/linux/cpumask.h: In function '__cpus_shift_left':
/usr/include/linux/cpumask.h:212: error: 'cpumask_t' has no member named 'bits'
/usr/include/linux/cpumask.h:212: error: 'cpumask_t' has no member named 'bits'
/usr/include/linux/cpumask.h: In function '__cpumask_scnprintf':
/usr/include/linux/cpumask.h:273: error: 'cpumask_t' has no member named 'bits'
/usr/include/linux/cpumask.h: In function '__cpumask_parse':
/usr/include/linux/cpumask.h:281: error: 'cpumask_t' has no member named 'bits'
/usr/include/linux/cpumask.h: In function '__cpulist_scnprintf':
/usr/include/linux/cpumask.h:289: error: 'cpumask_t' has no member named 'bits'
/usr/include/linux/cpumask.h: In function '__cpulist_parse':
/usr/include/linux/cpumask.h:295: error: 'cpumask_t' has no member named 'bits'
/usr/include/linux/cpumask.h: In function '__cpu_remap':
/usr/include/linux/cpumask.h:303: error: 'cpumask_t' has no member named 'bits'
/usr/include/linux/cpumask.h:303: error: 'cpumask_t' has no member named 'bits'
/usr/include/linux/cpumask.h: In function '__cpus_remap':
/usr/include/linux/cpumask.h:311: error: 'cpumask_t' has no member named 'bits'
/usr/include/linux/cpumask.h:311: error: 'cpumask_t' has no member named 'bits'
/usr/include/linux/cpumask.h:311: error: 'cpumask_t' has no member named 'bits'
/usr/include/linux/cpumask.h:311: error: 'cpumask_t' has no member named 'bits'
In file included from /usr/include/asm/processor.h:8,
                 from /usr/include/asm-i486/atomic.h:5,
                 from /usr/include/asm/atomic.h:8,
                 from include/aproxy-machine.h:27,
                 from aproxy_malloc.c:278:
/usr/include/asm-i486/processor.h: At top level:
/usr/include/asm-i486/processor.h:80: error: 'CONFIG_X86_L1_CACHE_SHIFT' undeclared here (not in a function)
/usr/include/asm-i486/processor.h:80: error: requested alignment is not a constant
make[1]: *** [aproxy_malloc.o] Error 1
make[1]: Leaving directory `/root/eresi/liballocproxy'
make: *** [world] Error 2
dev3:~/eresi# exit

Script done on Thu May 24 22:57:19 2007