[ 7%] Building CXX object kdeui/CMakeFiles/kdeui.dir/util/kwallet.o
/home/nicolas/Paldo/SpielWiese/kde4_build/kdelibs/kdeui/util/kwallet.cpp: In constructor KWallet::Wallet::Wallet(int, const QString&):
/home/nicolas/Paldo/SpielWiese/kde4_build/kdelibs/kdeui/util/kwallet.cpp:122: error: expected type-specifier before org
/home/nicolas/Paldo/SpielWiese/kde4_build/kdelibs/kdeui/util/kwallet.cpp:122: error: cannot convert int* to OrgKdeKWalletInterface* in assignment
/home/nicolas/Paldo/SpielWiese/kde4_build/kdelibs/kdeui/util/kwallet.cpp:122: error: expected `;' before org
/home/nicolas/Paldo/SpielWiese/kde4_build/kdelibs/kdeui/util/kwallet.cpp:123: error: invalid use of undefined type struct OrgKdeKWalletInterface
/home/nicolas/Paldo/SpielWiese/kde4_build/kdelibs/kdeui/util/kwallet.h:31: error: forward declaration of struct OrgKdeKWalletInterface
/home/nicolas/Paldo/SpielWiese/kde4_build/kdelibs/kdeui/util/kwallet.cpp:130: error: no matching function for call to KWallet::Wallet::connect(OrgKdeKWalletInterface*&, const char [19], const char [23])
/usr/include/qt4/QtCore/qobject.h:176: note: candidates are: static bool QObject::connect(const QObject*, const char*, const QObject*, const char*, Qt::ConnectionType)
/usr/include/qt4/QtCore/qobject.h:277: note: bool QObject::connect(const QObject*, const char*, const char*, Qt::ConnectionType) const
/home/nicolas/Paldo/SpielWiese/kde4_build/kdelibs/kdeui/util/kwallet.cpp:131: error: no matching function for call to KWallet::Wallet::connect(OrgKdeKWalletInterface*&, const char [28], const char [32])
/usr/include/qt4/QtCore/qobject.h:176: note: candidates are: static bool QObject::connect(const QObject*, const char*, const QObject*, const char*, Qt::ConnectionType)
/usr/include/qt4/QtCore/qobject.h:277: note: bool QObject::connect(const QObject*, const char*, const char*, Qt::ConnectionType) const
/home/nicolas/Paldo/SpielWiese/kde4_build/kdelibs/kdeui/util/kwallet.cpp:132: error: no matching function for call to KWallet::Wallet::connect(OrgKdeKWalletInterface*&, const char [32], const char [37])
/usr/include/qt4/QtCore/qobject.h:176: note: candidates are: static bool QObject::connect(const QObject*, const char*, const QObject*, const char*, Qt::ConnectionType)
/usr/include/qt4/QtCore/qobject.h:277: note: bool QObject::connect(const QObject*, const char*, const char*, Qt::ConnectionType) const
/home/nicolas/Paldo/SpielWiese/kde4_build/kdelibs/kdeui/util/kwallet.cpp:133: error: no matching function for call to KWallet::Wallet::connect(OrgKdeKWalletInterface*&, const char [43], const char [47])
/usr/include/qt4/QtCore/qobject.h:176: note: candidates are: static bool QObject::connect(const QObject*, const char*, const QObject*, const char*, Qt::ConnectionType)
/usr/include/qt4/QtCore/qobject.h:277: note: bool QObject::connect(const QObject*, const char*, const char*, Qt::ConnectionType) const
/home/nicolas/Paldo/SpielWiese/kde4_build/kdelibs/kdeui/util/kwallet.cpp:137: error: invalid use of undefined type struct OrgKdeKWalletInterface
/home/nicolas/Paldo/SpielWiese/kde4_build/kdelibs/kdeui/util/kwallet.h:31: error: forward declaration of struct OrgKdeKWalletInterface
/home/nicolas/Paldo/SpielWiese/kde4_build/kdelibs/kdeui/util/kwallet.cpp: In destructor virtual KWallet::Wallet::~Wallet():
/home/nicolas/Paldo/SpielWiese/kde4_build/kdelibs/kdeui/util/kwallet.cpp:148: error: invalid use of undefined type struct OrgKdeKWalletInterface
/home/nicolas/Paldo/SpielWiese/kde4_build/kdelibs/kdeui/util/kwallet.h:31: error: forward declaration of struct OrgKdeKWalletInterface
/home/nicolas/Paldo/SpielWiese/kde4_build/kdelibs/kdeui/util/kwallet.cpp: In static member function static QStringList KWallet::Wallet::walletList():
/home/nicolas/Paldo/SpielWiese/kde4_build/kdelibs/kdeui/util/kwallet.cpp:158: error: org has not been declared
/home/nicolas/Paldo/SpielWiese/kde4_build/kdelibs/kdeui/util/kwallet.cpp:158: error: expected `;' before wallet
/home/nicolas/Paldo/SpielWiese/kde4_build/kdelibs/kdeui/util/kwallet.cpp:159: error: wallet was not declared in this scope
/home/nicolas/Paldo/SpielWiese/kde4_build/kdelibs/kdeui/util/kwallet.cpp: In static member function static void KWallet::Wallet::changePassword(const QString&, WId):
/home/nicolas/Paldo/SpielWiese/kde4_build/kdelibs/kdeui/util/kwallet.cpp:166: error: org has not been declared
/home/nicolas/Paldo/SpielWiese/kde4_build/kdelibs/kdeui/util/kwallet.cpp:166: error: expected `;' before wallet
/home/nicolas/Paldo/SpielWiese/kde4_build/kdelibs/kdeui/util/kwallet.cpp:167: error: wallet was not declared in this scope
/home/nicolas/Paldo/SpielWiese/kde4_build/kdelibs/kdeui/util/kwallet.cpp: In static member function static bool KWallet::Wallet::isEnabled():
/home/nicolas/Paldo/SpielWiese/kde4_build/kdelibs/kdeui/util/kwallet.cpp:172: error: org has not been declared
/home/nicolas/Paldo/SpielWiese/kde4_build/kdelibs/kdeui/util/kwallet.cpp:172: error: expected `;' before wallet
/home/nicolas/Paldo/SpielWiese/kde4_build/kdelibs/kdeui/util/kwallet.cpp:173: error: wallet was not declared in this scope
/home/nicolas/Paldo/SpielWiese/kde4_build/kdelibs/kdeui/util/kwallet.cpp: In static member function static bool KWallet::Wallet::isOpen(const QString&):
/home/nicolas/Paldo/SpielWiese/kde4_build/kdelibs/kdeui/util/kwallet.cpp:178: error: org has not been declared
/home/nicolas/Paldo/SpielWiese/kde4_build/kdelibs/kdeui/util/kwallet.cpp:178: error: expected `;' before wallet
/home/nicolas/Paldo/SpielWiese/kde4_build/kdelibs/kdeui/util/kwallet.cpp:179: error: wallet was not declared in this scope
/home/nicolas/Paldo/SpielWiese/kde4_build/kdelibs/kdeui/util/kwallet.cpp: In static member function static int KWallet::Wallet::closeWallet(const QString&, bool):
/home/nicolas/Paldo/SpielWiese/kde4_build/kdelibs/kdeui/util/kwallet.cpp:184: error: org has not been declared
/home/nicolas/Paldo/SpielWiese/kde4_build/kdelibs/kdeui/util/kwallet.cpp:184: error: expected `;' before wallet
/home/nicolas/Paldo/SpielWiese/kde4_build/kdelibs/kdeui/util/kwallet.cpp:185: error: wallet was not declared in this scope
/home/nicolas/Paldo/SpielWiese/kde4_build/kdelibs/kdeui/util/kwallet.cpp: In static member function static int KWallet::Wallet::deleteWallet(const QString&):
/home/nicolas/Paldo/SpielWiese/kde4_build/kdelibs/kdeui/util/kwallet.cpp:191: error: org has not been declared
/home/nicolas/Paldo/SpielWiese/kde4_build/kdelibs/kdeui/util/kwallet.cpp:191: error: expected `;' before wallet
/home/nicolas/Paldo/SpielWiese/kde4_build/kdelibs/kdeui/util/kwallet.cpp:192: error: wallet was not declared in this scope
/home/nicolas/Paldo/SpielWiese/kde4_build/kdelibs/kdeui/util/kwallet.cpp: In static member function static KWallet::Wallet* KWallet::Wallet::openWallet(const QString&, WId, KWallet::Wallet::OpenType):
/home/nicolas/Paldo/SpielWiese/kde4_build/kdelibs/kdeui/util/kwallet.cpp:206: error: invalid use of undefined type struct OrgKdeKWalletInterface
/home/nicolas/Paldo/SpielWiese/kde4_build/kdelibs/kdeui/util/kwallet.h:31: error: forward declaration of struct OrgKdeKWalletInterface
/home/nicolas/Paldo/SpielWiese/kde4_build/kdelibs/kdeui/util/kwallet.cpp:216: error: org has not been declared
/home/nicolas/Paldo/SpielWiese/kde4_build/kdelibs/kdeui/util/kwallet.cpp:216: error: expected `;' before wallet
/home/nicolas/Paldo/SpielWiese/kde4_build/kdelibs/kdeui/util/kwallet.cpp:217: error: wallet was not declared in this scope
/home/nicolas/Paldo/SpielWiese/kde4_build/kdelibs/kdeui/util/kwallet.cpp: In static member function static bool KWallet::Wallet::disconnectApplication(const QString&, const QString&):
/home/nicolas/Paldo/SpielWiese/kde4_build/kdelibs/kdeui/util/kwallet.cpp:230: error: org has not been declared
/home/nicolas/Paldo/SpielWiese/kde4_build/kdelibs/kdeui/util/kwallet.cpp:230: error: expected `;' before w
/home/nicolas/Paldo/SpielWiese/kde4_build/kdelibs/kdeui/util/kwallet.cpp:231: error: w was not declared in this scope
/home/nicolas/Paldo/SpielWiese/kde4_build/kdelibs/kdeui/util/kwallet.cpp: In static member function static QStringList KWallet::Wallet::users(const QString&):
/home/nicolas/Paldo/SpielWiese/kde4_build/kdelibs/kdeui/util/kwallet.cpp:236: error: org has not been declared
/home/nicolas/Paldo/SpielWiese/kde4_build/kdelibs/kdeui/util/kwallet.cpp:236: error: expected `;' before wallet
/home/nicolas/Paldo/SpielWiese/kde4_build/kdelibs/kdeui/util/kwallet.cpp:237: error: wallet was not declared in this scope
/home/nicolas/Paldo/SpielWiese/kde4_build/kdelibs/kdeui/util/kwallet.cpp: In member function virtual int KWallet::Wallet::sync():
/home/nicolas/Paldo/SpielWiese/kde4_build/kdelibs/kdeui/util/kwallet.cpp:246: error: invalid use of undefined type struct OrgKdeKWalletInterface
/home/nicolas/Paldo/SpielWiese/kde4_build/kdelibs/kdeui/util/kwallet.h:31: error: forward declaration of struct OrgKdeKWalletInterface
/home/nicolas/Paldo/SpielWiese/kde4_build/kdelibs/kdeui/util/kwallet.cpp: In member function virtual int KWallet::Wallet::lockWallet():
/home/nicolas/Paldo/SpielWiese/kde4_build/kdelibs/kdeui/util/kwallet.cpp:256: error: invalid use of undefined type struct OrgKdeKWalletInterface
/home/nicolas/Paldo/SpielWiese/kde4_build/kdelibs/kdeui/util/kwallet.h:31: error: forward declaration of struct OrgKdeKWalletInterface
/home/nicolas/Paldo/SpielWiese/kde4_build/kdelibs/kdeui/util/kwallet.cpp: In member function virtual void KWallet::Wallet::requestChangePassword(WId):
/home/nicolas/Paldo/SpielWiese/kde4_build/kdelibs/kdeui/util/kwallet.cpp:284: error: invalid use of undefined type struct OrgKdeKWalletInterface
/home/nicolas/Paldo/SpielWiese/kde4_build/kdelibs/kdeui/util/kwallet.h:31: error: forward declaration of struct OrgKdeKWalletInterface
/home/nicolas/Paldo/SpielWiese/kde4_build/kdelibs/kdeui/util/kwallet.cpp: In member function virtual QStringList KWallet::Wallet::folderList():
/home/nicolas/Paldo/SpielWiese/kde4_build/kdelibs/kdeui/util/kwallet.cpp:303: error: invalid use of undefined type struct OrgKdeKWalletInterface
/home/nicolas/Paldo/SpielWiese/kde4_build/kdelibs/kdeui/util/kwallet.h:31: error: forward declaration of struct OrgKdeKWalletInterface
/home/nicolas/Paldo/SpielWiese/kde4_build/kdelibs/kdeui/util/kwallet.cpp: In member function virtual QStringList KWallet::Wallet::entryList():
/home/nicolas/Paldo/SpielWiese/kde4_build/kdelibs/kdeui/util/kwallet.cpp:313: error: invalid use of undefined type struct OrgKdeKWalletInterface
/home/nicolas/Paldo/SpielWiese/kde4_build/kdelibs/kdeui/util/kwallet.h:31: error: forward declaration of struct OrgKdeKWalletInterface
/home/nicolas/Paldo/SpielWiese/kde4_build/kdelibs/kdeui/util/kwallet.cpp: In member function virtual bool KWallet::Wallet::hasFolder(const QString&):
/home/nicolas/Paldo/SpielWiese/kde4_build/kdelibs/kdeui/util/kwallet.cpp:323: error: invalid use of undefined type struct OrgKdeKWalletInterface
/home/nicolas/Paldo/SpielWiese/kde4_build/kdelibs/kdeui/util/kwallet.h:31: error: forward declaration of struct OrgKdeKWalletInterface
/home/nicolas/Paldo/SpielWiese/kde4_build/kdelibs/kdeui/util/kwallet.cpp: In member function virtual bool KWallet::Wallet::createFolder(const QString&):
/home/nicolas/Paldo/SpielWiese/kde4_build/kdelibs/kdeui/util/kwallet.cpp:334: error: invalid use of undefined type struct OrgKdeKWalletInterface
/home/nicolas/Paldo/SpielWiese/kde4_build/kdelibs/kdeui/util/kwallet.h:31: error: forward declaration of struct OrgKdeKWalletInterface
/home/nicolas/Paldo/SpielWiese/kde4_build/kdelibs/kdeui/util/kwallet.cpp: In member function virtual bool KWallet::Wallet::removeFolder(const QString&):
/home/nicolas/Paldo/SpielWiese/kde4_build/kdelibs/kdeui/util/kwallet.cpp:370: error: invalid use of undefined type struct OrgKdeKWalletInterface
/home/nicolas/Paldo/SpielWiese/kde4_build/kdelibs/kdeui/util/kwallet.h:31: error: forward declaration of struct OrgKdeKWalletInterface
/home/nicolas/Paldo/SpielWiese/kde4_build/kdelibs/kdeui/util/kwallet.cpp: In member function virtual int KWallet::Wallet::readEntry(const QString&, QByteArray&):
/home/nicolas/Paldo/SpielWiese/kde4_build/kdelibs/kdeui/util/kwallet.cpp:391: error: invalid use of undefined type struct OrgKdeKWalletInterface
/home/nicolas/Paldo/SpielWiese/kde4_build/kdelibs/kdeui/util/kwallet.h:31: error: forward declaration of struct OrgKdeKWalletInterface
/home/nicolas/Paldo/SpielWiese/kde4_build/kdelibs/kdeui/util/kwallet.cpp: In member function int KWallet::Wallet::readEntryList(const QString&, QMap<QString, QByteArray>&):
/home/nicolas/Paldo/SpielWiese/kde4_build/kdelibs/kdeui/util/kwallet.cpp:410: error: invalid use of undefined type struct OrgKdeKWalletInterface
/home/nicolas/Paldo/SpielWiese/kde4_build/kdelibs/kdeui/util/kwallet.h:31: error: forward declaration of struct OrgKdeKWalletInterface
/home/nicolas/Paldo/SpielWiese/kde4_build/kdelibs/kdeui/util/kwallet.cpp: In member function virtual int KWallet::Wallet::renameEntry(const QString&, const QString&):
/home/nicolas/Paldo/SpielWiese/kde4_build/kdelibs/kdeui/util/kwallet.cpp:431: error: invalid use of undefined type struct OrgKdeKWalletInterface
/home/nicolas/Paldo/SpielWiese/kde4_build/kdelibs/kdeui/util/kwallet.h:31: error: forward declaration of struct OrgKdeKWalletInterface
/home/nicolas/Paldo/SpielWiese/kde4_build/kdelibs/kdeui/util/kwallet.cpp: In member function virtual int KWallet::Wallet::readMap(const QString&, QMap<QString, QString>&):
/home/nicolas/Paldo/SpielWiese/kde4_build/kdelibs/kdeui/util/kwallet.cpp:449: error: invalid use of undefined type struct OrgKdeKWalletInterface
/home/nicolas/Paldo/SpielWiese/kde4_build/kdelibs/kdeui/util/kwallet.h:31: error: forward declaration of struct OrgKdeKWalletInterface
/home/nicolas/Paldo/SpielWiese/kde4_build/kdelibs/kdeui/util/kwallet.cpp: In member function int KWallet::Wallet::readMapList(const QString&, QMap<QString, QMap<QString, QString> >&):
/home/nicolas/Paldo/SpielWiese/kde4_build/kdelibs/kdeui/util/kwallet.cpp:473: error: invalid use of undefined type struct OrgKdeKWalletInterface
/home/nicolas/Paldo/SpielWiese/kde4_build/kdelibs/kdeui/util/kwallet.h:31: error: forward declaration of struct OrgKdeKWalletInterface
/home/nicolas/Paldo/SpielWiese/kde4_build/kdelibs/kdeui/util/kwallet.cpp: In member function virtual int KWallet::Wallet::readPassword(const QString&, QString&):
/home/nicolas/Paldo/SpielWiese/kde4_build/kdelibs/kdeui/util/kwallet.cpp:499: error: invalid use of undefined type struct OrgKdeKWalletInterface
/home/nicolas/Paldo/SpielWiese/kde4_build/kdelibs/kdeui/util/kwallet.h:31: error: forward declaration of struct OrgKdeKWalletInterface
/home/nicolas/Paldo/SpielWiese/kde4_build/kdelibs/kdeui/util/kwallet.cpp: In member function int KWallet::Wallet::readPasswordList(const QString&, QMap<QString, QString>&):
/home/nicolas/Paldo/SpielWiese/kde4_build/kdelibs/kdeui/util/kwallet.cpp:518: error: invalid use of undefined type struct OrgKdeKWalletInterface
/home/nicolas/Paldo/SpielWiese/kde4_build/kdelibs/kdeui/util/kwallet.h:31: error: forward declaration of struct OrgKdeKWalletInterface
/home/nicolas/Paldo/SpielWiese/kde4_build/kdelibs/kdeui/util/kwallet.cpp: In member function virtual int KWallet::Wallet::writeEntry(const QString&, const QByteArray&, KWallet::Wallet::EntryType):
/home/nicolas/Paldo/SpielWiese/kde4_build/kdelibs/kdeui/util/kwallet.cpp:538: error: invalid use of undefined type struct OrgKdeKWalletInterface
/home/nicolas/Paldo/SpielWiese/kde4_build/kdelibs/kdeui/util/kwallet.h:31: error: forward declaration of struct OrgKdeKWalletInterface
/home/nicolas/Paldo/SpielWiese/kde4_build/kdelibs/kdeui/util/kwallet.cpp: In member function virtual int KWallet::Wallet::writeEntry(const QString&, const QByteArray&):
/home/nicolas/Paldo/SpielWiese/kde4_build/kdelibs/kdeui/util/kwallet.cpp:554: error: invalid use of undefined type struct OrgKdeKWalletInterface
/home/nicolas/Paldo/SpielWiese/kde4_build/kdelibs/kdeui/util/kwallet.h:31: error: forward declaration of struct OrgKdeKWalletInterface
/home/nicolas/Paldo/SpielWiese/kde4_build/kdelibs/kdeui/util/kwallet.cpp: In member function virtual int KWallet::Wallet::writeMap(const QString&, const QMap<QString, QString>&):
/home/nicolas/Paldo/SpielWiese/kde4_build/kdelibs/kdeui/util/kwallet.cpp:575: error: invalid use of undefined type struct OrgKdeKWalletInterface
/home/nicolas/Paldo/SpielWiese/kde4_build/kdelibs/kdeui/util/kwallet.h:31: error: forward declaration of struct OrgKdeKWalletInterface
/home/nicolas/Paldo/SpielWiese/kde4_build/kdelibs/kdeui/util/kwallet.cpp: In member function virtual int KWallet::Wallet::writePassword(const QString&, const QString&):
/home/nicolas/Paldo/SpielWiese/kde4_build/kdelibs/kdeui/util/kwallet.cpp:591: error: invalid use of undefined type struct OrgKdeKWalletInterface
/home/nicolas/Paldo/SpielWiese/kde4_build/kdelibs/kdeui/util/kwallet.h:31: error: forward declaration of struct OrgKdeKWalletInterface
/home/nicolas/Paldo/SpielWiese/kde4_build/kdelibs/kdeui/util/kwallet.cpp: In member function virtual bool KWallet::Wallet::hasEntry(const QString&):
/home/nicolas/Paldo/SpielWiese/kde4_build/kdelibs/kdeui/util/kwallet.cpp:605: error: invalid use of undefined type struct OrgKdeKWalletInterface
/home/nicolas/Paldo/SpielWiese/kde4_build/kdelibs/kdeui/util/kwallet.h:31: error: forward declaration of struct OrgKdeKWalletInterface
/home/nicolas/Paldo/SpielWiese/kde4_build/kdelibs/kdeui/util/kwallet.cpp: In member function virtual int KWallet::Wallet::removeEntry(const QString&):
/home/nicolas/Paldo/SpielWiese/kde4_build/kdelibs/kdeui/util/kwallet.cpp:617: error: invalid use of undefined type struct OrgKdeKWalletInterface
/home/nicolas/Paldo/SpielWiese/kde4_build/kdelibs/kdeui/util/kwallet.h:31: error: forward declaration of struct OrgKdeKWalletInterface
/home/nicolas/Paldo/SpielWiese/kde4_build/kdelibs/kdeui/util/kwallet.cpp: In member function virtual KWallet::Wallet::EntryType KWallet::Wallet::entryType(const QString&):
/home/nicolas/Paldo/SpielWiese/kde4_build/kdelibs/kdeui/util/kwallet.cpp:633: error: invalid use of undefined type struct OrgKdeKWalletInterface
/home/nicolas/Paldo/SpielWiese/kde4_build/kdelibs/kdeui/util/kwallet.h:31: error: forward declaration of struct OrgKdeKWalletInterface
/home/nicolas/Paldo/SpielWiese/kde4_build/kdelibs/kdeui/util/kwallet.cpp: In static member function static bool KWallet::Wallet::folderDoesNotExist(const QString&, const QString&):
/home/nicolas/Paldo/SpielWiese/kde4_build/kdelibs/kdeui/util/kwallet.cpp:688: error: org has not been declared
/home/nicolas/Paldo/SpielWiese/kde4_build/kdelibs/kdeui/util/kwallet.cpp:688: error: expected `;' before w
/home/nicolas/Paldo/SpielWiese/kde4_build/kdelibs/kdeui/util/kwallet.cpp:689: error: w was not declared in this scope
/home/nicolas/Paldo/SpielWiese/kde4_build/kdelibs/kdeui/util/kwallet.cpp: In static member function static bool KWallet::Wallet::keyDoesNotExist(const QString&, const QString&, const QString&):
/home/nicolas/Paldo/SpielWiese/kde4_build/kdelibs/kdeui/util/kwallet.cpp:696: error: org has not been declared
/home/nicolas/Paldo/SpielWiese/kde4_build/kdelibs/kdeui/util/kwallet.cpp:696: error: expected `;' before w
/home/nicolas/Paldo/SpielWiese/kde4_build/kdelibs/kdeui/util/kwallet.cpp:697: error: w was not declared in this scope
make[2]: *** [kdeui/CMakeFiles/kdeui.dir/util/kwallet.o] Error 1
make[1]: *** [kdeui/CMakeFiles/kdeui.dir/all] Error 2
make: *** [all] Error 2