rendered paste bodyemerge portage
Calculating dependencies... done!
>>> Verifying ebuild Manifests...
>>> Emerging (1 of 1) sys-apps/portage-2.1.2.7 to /
* portage-2.1.2.7.patch.bz2 RMD160 ;-) ... [ ok ]
* portage-2.1.2.7.patch.bz2 SHA1 ;-) ... [ ok ]
* portage-2.1.2.7.patch.bz2 SHA256 ;-) ... [ ok ]
* portage-2.1.2.7.patch.bz2 size ;-) ... [ ok ]
* portage-2.1.2.tar.bz2 RMD160 ;-) ... [ ok ]
* portage-2.1.2.tar.bz2 SHA1 ;-) ... [ ok ]
* portage-2.1.2.tar.bz2 SHA256 ;-) ... [ ok ]
* portage-2.1.2.tar.bz2 size ;-) ... [ ok ]
* checking ebuild checksums ;-) ... [ ok ]
* checking auxfile checksums ;-) ... [ ok ]
* checking miscfile checksums ;-) ... [ ok ]
* checking portage-2.1.2.tar.bz2 ;-) ... [ ok ]
* checking portage-2.1.2.7.patch.bz2 ;-) ... [ ok ]
>>> Unpacking source...
>>> Unpacking portage-2.1.2.tar.bz2 to /var/tmp/portage/sys-apps/portage-2.1.2.7/work
>>> Unpacking portage-2.1.2.7.patch.bz2 to /var/tmp/portage/sys-apps/portage-2.1.2.7/work
* Applying portage-2.1.2.7.patch ... [ ok ]
* Setting portage.VERSION to 2.1.2.7 ... [ ok ]
>>> Source unpacked.
>>> Compiling source in /var/tmp/portage/sys-apps/portage-2.1.2.7/work/portage-2.1.2 ...
In file included from /usr/include/stdio.h:28,
from tbz2tool.c:3:
/usr/include/features.h:323:25: error: sys/cdefs.h: No such file or directory
In file included from /usr/include/stdio.h:34,
from tbz2tool.c:3:
/usr/lib/gcc/i686-pc-linux-gnu/4.1.2/include/stddef.h:214: error: expected '=', ',', ';', 'asm' or '__attribute__' before 'typedef'
In file included from tbz2tool.c:3:
/usr/include/stdio.h:46: error: expected '=', ',', ';', 'asm' or '__attribute__' before 'typedef'
/usr/include/stdio.h:51: error: expected '=', ',', ';', 'asm' or '__attribute__' before '__USING_NAMESPACE_STD'
In file included from /usr/include/_G_config.h:44,
from /usr/include/libio.h:32,
from /usr/include/stdio.h:72,
from tbz2tool.c:3:
/usr/include/gconv.h:72: error: expected declaration specifiers or '...' before 'size_t'
/usr/include/gconv.h:88: error: expected declaration specifiers or '...' before 'size_t'
/usr/include/gconv.h:97: error: expected declaration specifiers or '...' before 'size_t'
/usr/include/gconv.h:174: error: expected specifier-qualifier-list before 'size_t'
In file included from /usr/include/stdio.h:72,
from tbz2tool.c:3:
/usr/include/libio.h:328: error: expected specifier-qualifier-list before 'size_t'
/usr/include/libio.h:360: error: expected declaration specifiers or '...' before 'size_t'
/usr/include/libio.h:369: error: expected declaration specifiers or '...' before 'size_t'
/usr/include/libio.h: In function '__underflow':
/usr/include/libio.h:412: error: expected declaration specifiers before '__THROW'
/usr/include/libio.h:413: error: expected '=', ',', ';', 'asm' or '__attribute__' before '__THROW'
/usr/include/libio.h:414: error: expected '=', ',', ';', 'asm' or '__attribute__' before '__THROW'
/usr/include/libio.h:415: error: expected '=', ',', ';', 'asm' or '__attribute__' before '__THROW'
/usr/include/libio.h:416: error: expected '=', ',', ';', 'asm' or '__attribute__' before '__THROW'
/usr/include/libio.h:417: error: expected '=', ',', ';', 'asm' or '__attribute__' before '__THROW'
/usr/include/libio.h:450: error: expected '=', ',', ';', 'asm' or '__attribute__' before '__THROW'
/usr/include/libio.h:451: error: expected '=', ',', ';', 'asm' or '__attribute__' before '__THROW'
/usr/include/libio.h:452: error: expected '=', ',', ';', 'asm' or '__attribute__' before '__THROW'
/usr/include/libio.h:453: error: expected '=', ',', ';', 'asm' or '__attribute__' before '__THROW'
/usr/include/libio.h:455: error: expected '=', ',', ';', 'asm' or '__attribute__' before '__THROW'
/usr/include/libio.h:461: error: expected '=', ',', ';', 'asm' or '__attribute__' before '__THROW'
/usr/include/libio.h:462: error: expected '=', ',', ';', 'asm' or '__attribute__' before '__THROW'
/usr/include/libio.h:463: error: expected '=', ',', ';', 'asm' or '__attribute__' before '__THROW'
/usr/include/libio.h:481: error: storage class specified for parameter '_IO_vfscanf'
/usr/include/libio.h:483: error: storage class specified for parameter '_IO_vfprintf'
/usr/include/libio.h:484: error: expected '=', ',', ';', 'asm' or '__attribute__' before '__THROW'
/usr/include/libio.h:485: error: expected '=', ',', ';', 'asm' or '__attribute__' before '_IO_sgetn'
/usr/include/libio.h:487: error: expected '=', ',', ';', 'asm' or '__attribute__' before '__THROW'
/usr/include/libio.h:488: error: expected '=', ',', ';', 'asm' or '__attribute__' before '__THROW'
/usr/include/libio.h:490: error: expected '=', ',', ';', 'asm' or '__attribute__' before '__THROW'
In file included from tbz2tool.c:3:
/usr/include/stdio.h:86: error: expected declaration specifiers before '__BEGIN_NAMESPACE_STD'
/usr/include/stdio.h:92: error: expected declaration specifiers before '__END_NAMESPACE_STD'
In file included from tbz2tool.c:3:
/usr/include/stdio.h:143: error: storage class specified for parameter 'stdout'
/usr/include/stdio.h:144: error: storage class specified for parameter 'stderr'
/usr/include/stdio.h:150: error: expected declaration specifiers before '__BEGIN_NAMESPACE_STD'
/usr/include/stdio.h:154: error: expected '=', ',', ';', 'asm' or '__attribute__' before '__THROW'
/usr/include/stdio.h:155: error: expected declaration specifiers before '__END_NAMESPACE_STD'
/usr/include/stdio.h:183: error: expected '=', ',', ';', 'asm' or '__attribute__' before '__THROW'
/usr/include/stdio.h:184: error: expected declaration specifiers before '__END_NAMESPACE_STD'
/usr/include/stdio.h:202: error: expected '=', ',', ';', 'asm' or '__attribute__' before '__THROW'
/usr/include/stdio.h:206: error: expected declaration specifiers before '__BEGIN_NAMESPACE_STD'
/usr/include/stdio.h:216: error: expected ')' before '*' token
/usr/include/stdio.h:217: error: expected declaration specifiers before '__END_NAMESPACE_STD'
/usr/include/stdio.h:240: error: expected declaration specifiers before '__BEGIN_NAMESPACE_STD'
/usr/include/stdio.h:252: error: expected '=', ',', ';', 'asm' or '__attribute__' before '*' token
/usr/include/stdio.h:267: error: expected declaration specifiers before '__END_NAMESPACE_STD'
/usr/include/stdio.h:298: error: expected declaration specifiers before '__BEGIN_NAMESPACE_STD'
/usr/include/stdio.h:305: error: expected ')' before '*' token
/usr/include/stdio.h:307: error: expected declaration specifiers before '__END_NAMESPACE_STD'
/usr/include/stdio.h:316: error: expected ')' before '*' token
/usr/include/stdio.h:320: error: expected declaration specifiers before '__BEGIN_NAMESPACE_STD'
/usr/include/stdio.h:331: error: storage class specified for parameter 'printf'
/usr/include/stdio.h:334: error: expected '=', ',', ';', 'asm' or '__attribute__' before '__THROW'
/usr/include/stdio.h:340: error: expected ')' before '*' token
/usr/include/stdio.h:346: error: storage class specified for parameter 'vprintf'
/usr/include/stdio.h:349: error: expected '=', ',', ';', 'asm' or '__attribute__' before '__THROW'
/usr/include/stdio.h:350: error: expected declaration specifiers before '__END_NAMESPACE_STD'
/usr/include/stdio.h:359: error: expected declaration specifiers or '...' before 'size_t'
/usr/include/stdio.h:361: error: expected '=', ',', ';', 'asm' or '__attribute__' before '__THROW'
/usr/include/stdio.h:362: error: expected declaration specifiers before '__END_NAMESPACE_C99'
/usr/include/stdio.h:403: error: expected '=', ',', ';', 'asm' or '__attribute__' before '__wur'
/usr/include/stdio.h:406: error: expected '=', ',', ';', 'asm' or '__attribute__' before '__THROW'
/usr/include/stdio.h:407: error: expected declaration specifiers before '__END_NAMESPACE_STD'
/usr/include/stdio.h:440: error: expected ')' before '*' token
/usr/include/stdio.h:446: error: storage class specified for parameter 'getchar'
/usr/include/stdio.h:447: error: expected declaration specifiers before '__END_NAMESPACE_STD'
/usr/include/stdio.h:459: error: storage class specified for parameter 'getchar_unlocked'
/usr/include/stdio.h:469: error: expected ')' before '*' token
/usr/include/stdio.h:473: error: expected declaration specifiers before '__BEGIN_NAMESPACE_STD'
/usr/include/stdio.h:482: error: expected declaration specifiers or '...' before 'FILE'
/usr/include/stdio.h:482: error: storage class specified for parameter 'putc'
/usr/include/stdio.h:488: error: storage class specified for parameter 'putchar'
/usr/include/stdio.h:489: error: expected declaration specifiers before '__END_NAMESPACE_STD'
/usr/include/stdio.h:510: error: expected declaration specifiers or '...' before 'FILE'
/usr/include/stdio.h:510: error: storage class specified for parameter 'putc_unlocked'
/usr/include/stdio.h:511: error: storage class specified for parameter 'putchar_unlocked'
/usr/include/stdio.h:518: error: expected ')' before '*' token
/usr/include/stdio.h:521: error: expected declaration specifiers or '...' before 'FILE'
/usr/include/stdio.h:521: error: storage class specified for parameter 'putw'
/usr/include/stdio.h:525: error: expected declaration specifiers before '__BEGIN_NAMESPACE_STD'
/usr/include/stdio.h:538: error: expected '=', ',', ';', 'asm' or '__attribute__' before '__wur'
/usr/include/stdio.h:539: error: expected declaration specifiers before '__END_NAMESPACE_STD'
/usr/include/stdio.h:594: error: storage class specified for parameter 'puts'
/usr/include/stdio.h:601: error: expected declaration specifiers or '...' before 'FILE'
/usr/include/stdio.h:601: error: storage class specified for parameter 'ungetc'
/usr/include/stdio.h:608: error: expected '=', ',', ';', 'asm' or '__attribute__' before 'fread'
/usr/include/stdio.h:614: error: expected '=', ',', ';', 'asm' or '__attribute__' before 'fwrite'
/usr/include/stdio.h:616: error: expected declaration specifiers before '__END_NAMESPACE_STD'
/usr/include/stdio.h:638: error: expected '=', ',', ';', 'asm' or '__attribute__' before 'fwrite_unlocked'
/usr/include/stdio.h:643: error: expected declaration specifiers before '__BEGIN_NAMESPACE_STD'
/usr/include/stdio.h:653: error: expected ')' before '*' token
/usr/include/stdio.h:658: error: expected ')' before '*' token
/usr/include/stdio.h:659: error: expected declaration specifiers before '__END_NAMESPACE_STD'
/usr/include/stdio.h:677: error: expected ')' before '*' token
/usr/include/stdio.h:691: error: expected declaration specifiers before '__BEGIN_NAMESPACE_STD'
/usr/include/stdio.h:702: error: expected ')' before '*' token
/usr/include/stdio.h:714: error: expected declaration specifiers before '__END_NAMESPACE_STD'
/usr/include/stdio.h:727: error: expected ')' before '*' token
/usr/include/stdio.h:729: error: expected ')' before '*' token
/usr/include/stdio.h:730: error: expected declaration specifiers before '__END_NAMESPACE_STD'
/usr/include/stdio.h:735: error: expected ')' before '*' token
/usr/include/stdio.h:736: error: expected ')' before '*' token
/usr/include/stdio.h:740: error: expected declaration specifiers before '__BEGIN_NAMESPACE_STD'
/usr/include/stdio.h:746: error: expected declaration specifiers before '__END_NAMESPACE_STD'
In file included from /usr/include/stdio.h:752,
from tbz2tool.c:3:
/usr/include/bits/sys_errlist.h:28: error: storage class specified for parameter 'sys_errlist'
In file included from tbz2tool.c:3:
/usr/include/stdio.h:757: error: expected ')' before '*' token
/usr/include/stdio.h:762: error: expected ')' before '*' token
/usr/include/stdio.h:772: error: expected '=', ',', ';', 'asm' or '__attribute__' before '*' token
/usr/include/stdio.h:778: error: expected ')' before '*' token
/usr/include/stdio.h:784: error: expected '=', ',', ';', 'asm' or '__attribute__' before '__THROW'
/usr/include/stdio.h:812: error: expected ')' before '*' token
/usr/include/stdio.h:816: error: expected ')' before '*' token
/usr/include/stdio.h:819: error: expected ')' before '*' token
In file included from /usr/include/stdio.h:833,
from tbz2tool.c:3:
/usr/include/bits/stdio.h:35: error: expected '=', ',', ';', 'asm' or '__attribute__' before '{' token
/usr/include/bits/stdio.h:42: error: expected '=', ',', ';', 'asm' or '__attribute__' before '{' token
/usr/include/bits/stdio.h:50: error: expected ')' before '*' token
/usr/include/bits/stdio.h:58: error: expected '=', ',', ';', 'asm' or '__attribute__' before '{' token
/usr/include/bits/stdio.h:67: error: expected '=', ',', ';', 'asm' or '__attribute__' before '{' token
/usr/include/bits/stdio.h:75: error: expected declaration specifiers or '...' before 'FILE'
/usr/include/bits/stdio.h:76: error: expected '=', ',', ';', 'asm' or '__attribute__' before '{' token
/usr/include/bits/stdio.h:85: error: expected declaration specifiers or '...' before 'FILE'
/usr/include/bits/stdio.h:86: error: expected '=', ',', ';', 'asm' or '__attribute__' before '{' token
/usr/include/bits/stdio.h:93: error: expected '=', ',', ';', 'asm' or '__attribute__' before '{' token
/usr/include/bits/stdio.h:112: error: expected ')' before '(' token
/usr/include/bits/stdio.h:119: error: expected ')' before '(' token
In file included from tbz2tool.c:3:
/usr/include/stdio.h:842: error: expected declaration specifiers before '__END_DECLS'
In file included from tbz2tool.c:4:
/usr/include/stdlib.h:102: error: expected declaration specifiers before 'div_t'
/usr/include/stdlib.h:110: error: storage class specified for parameter 'ldiv_t'
/usr/include/stdlib.h:113: error: expected declaration specifiers before '__END_NAMESPACE_STD'
/usr/include/stdlib.h:143: error: expected declaration specifiers before '__BEGIN_NAMESPACE_STD'
/usr/include/stdlib.h:149: error: expected '=', ',', ';', 'asm' or '__attribute__' before '__THROW'
/usr/include/stdlib.h:152: error: expected '=', ',', ';', 'asm' or '__attribute__' before '__THROW'
/usr/include/stdlib.h:153: error: expected declaration specifiers before '__END_NAMESPACE_STD'
/usr/include/stdlib.h:160: error: expected declaration specifiers before '__END_NAMESPACE_C99'
/usr/include/stdlib.h:168: error: expected declaration specifiers before '__END_NAMESPACE_STD'
/usr/include/stdlib.h:190: error: expected '=', ',', ';', 'asm' or '__attribute__' before '__THROW'
/usr/include/stdlib.h:191: error: expected declaration specifiers before '__END_NAMESPACE_STD'
/usr/include/stdlib.h:200: error: expected declaration specifiers before '__extension__'
/usr/include/stdlib.h:207: error: expected declaration specifiers before '__BEGIN_NAMESPACE_C99'
/usr/include/stdlib.h:214: error: expected declaration specifiers before '__extension__'
/usr/include/stdlib.h:218: error: expected declaration specifiers before '__END_NAMESPACE_C99'
/usr/include/stdlib.h:284: error: expected '=', ',', ';', 'asm' or '__attribute__' before '__THROW'
/usr/include/stdlib.h:288: error: expected '=', ',', ';', 'asm' or '__attribute__' before '__THROW'
/usr/include/stdlib.h:293: error: expected '=', ',', ';', 'asm' or '__attribute__' before '__THROW'
/usr/include/stdlib.h:300: error: expected '=', ',', ';', 'asm' or '__attribute__' before '__THROW'
/usr/include/stdlib.h:305: error: expected declaration specifiers before '__extension__'
/usr/include/stdlib.h:313: error: expected declaration specifiers before '__extension__'
/usr/include/stdlib.h:326: error: expected declaration specifiers before '__BEGIN_NAMESPACE_STD'
/usr/include/stdlib.h:333: error: expected ')' before '(' token
/usr/include/stdlib.h:339: error: expected ')' before '(' token
/usr/include/stdlib.h:344: error: expected declaration specifiers before '__END_NAMESPACE_STD'
/usr/include/stdlib.h:370: error: expected declaration specifiers before '__extension__'
/usr/include/stdlib.h:379: error: expected declaration specifiers before '__BEGIN_NAMESPACE_C99'
/usr/include/stdlib.h:386: error: expected declaration specifiers before '__extension__'
/usr/include/stdlib.h:392: error: expected declaration specifiers before '__END_NAMESPACE_C99'
/usr/include/stdlib.h:402: error: expected ')' before '(' token
/usr/include/stdlib.h:407: error: expected ')' before '(' token
/usr/include/stdlib.h:411: error: expected declaration specifiers before '__END_NAMESPACE_STD'
/usr/include/stdlib.h:420: error: expected declaration specifiers before '__END_NAMESPACE_C99'
/usr/include/stdlib.h:433: error: expected '=', ',', ';', 'asm' or '__attribute__' before '__THROW'
In file included from tbz2tool.c:4:
/usr/include/stdlib.h:438:49: error: sys/types.h: No such file or directory
/usr/include/stdlib.h:445: error: expected '=', ',', ';', 'asm' or '__attribute__' before '__THROW'
/usr/include/stdlib.h:448: error: expected '=', ',', ';', 'asm' or '__attribute__' before '__THROW'
/usr/include/stdlib.h:455: error: expected declaration specifiers or '...' before 'size_t'
/usr/include/stdlib.h:455: error: expected '=', ',', ';', 'asm' or '__attribute__' before '__THROW'
/usr/include/stdlib.h:459: error: expected '=', ',', ';', 'asm' or '__attribute__' before '__THROW'
/usr/include/stdlib.h:469: error: expected specifier-qualifier-list before 'int32_t'
/usr/include/stdlib.h:479: error: expected declaration specifiers or '...' before 'int32_t'
/usr/include/stdlib.h:479: error: expected '=', ',', ';', 'asm' or '__attribute__' before '__THROW'
/usr/include/stdlib.h:482: error: expected '=', ',', ';', 'asm' or '__attribute__' before '__THROW'
/usr/include/stdlib.h:485: error: expected declaration specifiers or '...' before 'size_t'
/usr/include/stdlib.h:487: error: expected '=', ',', ';', 'asm' or '__attribute__' before '__THROW'
/usr/include/stdlib.h:491: error: expected '=', ',', ';', 'asm' or '__attribute__' before '__THROW'
/usr/include/stdlib.h:496: error: expected declaration specifiers before '__BEGIN_NAMESPACE_STD'
/usr/include/stdlib.h:500: error: expected '=', ',', ';', 'asm' or '__attribute__' before '__THROW'
/usr/include/stdlib.h:501: error: expected declaration specifiers before '__END_NAMESPACE_STD'
/usr/include/stdlib.h:513: error: expected '=', ',', ';', 'asm' or '__attribute__' before '__THROW'
/usr/include/stdlib.h:514: error: expected '=', ',', ';', 'asm' or '__attribute__' before '__THROW'
/usr/include/stdlib.h:517: error: expected '=', ',', ';', 'asm' or '__attribute__' before '__THROW'
/usr/include/stdlib.h:519: error: expected '=', ',', ';', 'asm' or '__attribute__' before '__THROW'
/usr/include/stdlib.h:522: error: expected '=', ',', ';', 'asm' or '__attribute__' before '__THROW'
/usr/include/stdlib.h:524: error: expected '=', ',', ';', 'asm' or '__attribute__' before '__THROW'
/usr/include/stdlib.h:527: error: expected '=', ',', ';', 'asm' or '__attribute__' before '__THROW'
/usr/include/stdlib.h:529: error: expected '=', ',', ';', 'asm' or '__attribute__' before '__THROW'
/usr/include/stdlib.h:530: error: expected '=', ',', ';', 'asm' or '__attribute__' before '__THROW'
/usr/include/stdlib.h:547: error: expected '=', ',', ';', 'asm' or '__attribute__' before '__THROW'
/usr/include/stdlib.h:550: error: expected '=', ',', ';', 'asm' or '__attribute__' before '__THROW'
/usr/include/stdlib.h:555: error: expected '=', ',', ';', 'asm' or '__attribute__' before '__THROW'
/usr/include/stdlib.h:559: error: expected '=', ',', ';', 'asm' or '__attribute__' before '__THROW'
/usr/include/stdlib.h:564: error: expected '=', ',', ';', 'asm' or '__attribute__' before '__THROW'
/usr/include/stdlib.h:568: error: expected '=', ',', ';', 'asm' or '__attribute__' before '__THROW'
/usr/include/stdlib.h:572: error: expected '=', ',', ';', 'asm' or '__attribute__' before '__THROW'
/usr/include/stdlib.h:575: error: expected '=', ',', ';', 'asm' or '__attribute__' before '__THROW'
/usr/include/stdlib.h:579: error: expected '=', ',', ';', 'asm' or '__attribute__' before '__THROW'
/usr/include/stdlib.h:587: error: expected declaration specifiers before '__BEGIN_NAMESPACE_STD'
/usr/include/stdlib.h:591: error: expected ')' before '__nmemb'
/usr/include/stdlib.h:593: error: expected declaration specifiers before '__END_NAMESPACE_STD'
/usr/include/stdlib.h:603: error: expected '=', ',', ';', 'asm' or '__attribute__' before '__THROW'
/usr/include/stdlib.h:604: error: expected declaration specifiers before '__END_NAMESPACE_STD'
In file included from /usr/include/stdlib.h:612,
from tbz2tool.c:4:
/usr/include/alloca.h:27: error: expected declaration specifiers before '__BEGIN_DECLS'
/usr/include/alloca.h:39: error: expected declaration specifiers before '__END_DECLS'
In file included from tbz2tool.c:4:
/usr/include/stdlib.h:622: error: expected declaration specifiers or '...' before 'size_t'
/usr/include/stdlib.h:622: error: expected declaration specifiers or '...' before 'size_t'
/usr/include/stdlib.h:623: error: expected '=', ',', ';', 'asm' or '__attribute__' before '__THROW'
/usr/include/stdlib.h:626: error: expected declaration specifiers before '__BEGIN_NAMESPACE_STD'
/usr/include/stdlib.h:632: error: expected '=', ',', ';', 'asm' or '__attribute__' before '__THROW'
/usr/include/stdlib.h:633: error: expected declaration specifiers before '__END_NAMESPACE_STD'
/usr/include/stdlib.h:642: error: expected declaration specifiers before '__BEGIN_NAMESPACE_STD'
/usr/include/stdlib.h:647: error: expected declaration specifiers before '__END_NAMESPACE_STD'
/usr/include/stdlib.h:661: error: expected declaration specifiers before '__END_NAMESPACE_STD'
/usr/include/stdlib.h:672: error: expected '=', ',', ';', 'asm' or '__attribute__' before '__THROW'
/usr/include/stdlib.h:679: error: expected '=', ',', ';', 'asm' or '__attribute__' before '__THROW'
/usr/include/stdlib.h:682: error: expected '=', ',', ';', 'asm' or '__attribute__' before '__THROW'
/usr/include/stdlib.h:689: error: expected '=', ',', ';', 'asm' or '__attribute__' before '__THROW'
/usr/include/stdlib.h:698: error: expected '=', ',', ';', 'asm' or '__attribute__' before '__THROW'
/usr/include/stdlib.h:709: error: expected '=', ',', ';', 'asm' or '__attribute__' before '__nonnull'
/usr/include/stdlib.h:729: error: expected '=', ',', ';', 'asm' or '__attribute__' before '__THROW'
/usr/include/stdlib.h:733: error: expected declaration specifiers before '__BEGIN_NAMESPACE_STD'
/usr/include/stdlib.h:739: error: expected declaration specifiers before '__END_NAMESPACE_STD'
/usr/include/stdlib.h:765: error: storage class specified for parameter '__compar_fn_t'
/usr/include/stdlib.h:772: error: expected declaration specifiers before '__BEGIN_NAMESPACE_STD'
/usr/include/stdlib.h:781: error: expected declaration specifiers or '...' before 'size_t'
/usr/include/stdlib.h:781: error: expected declaration specifiers or '...' before 'size_t'
/usr/include/stdlib.h:782: error: expected declaration specifiers or '...' before '__compar_fn_t'
/usr/include/stdlib.h:782: error: expected '=', ',', ';', 'asm' or '__attribute__' before '__nonnull'
/usr/include/stdlib.h:786: error: expected '=', ',', ';', 'asm' or '__attribute__' before '__THROW'
/usr/include/stdlib.h:787: error: expected '=', ',', ';', 'asm' or '__attribute__' before '__THROW'
/usr/include/stdlib.h:788: error: expected declaration specifiers before '__END_NAMESPACE_STD'
/usr/include/stdlib.h:802: error: expected '=', ',', ';', 'asm' or '__attribute__' before 'ldiv'
/usr/include/stdlib.h:804: error: expected declaration specifiers before '__END_NAMESPACE_STD'
/usr/include/stdlib.h:829: error: expected '=', ',', ';', 'asm' or '__attribute__' before '__THROW'
/usr/include/stdlib.h:835: error: expected '=', ',', ';', 'asm' or '__attribute__' before '__THROW'
/usr/include/stdlib.h:842: error: expected '=', ',', ';', 'asm' or '__attribute__' before '__THROW'
/usr/include/stdlib.h:845: error: expected '=', ',', ';', 'asm' or '__attribute__' before '__THROW'
/usr/include/stdlib.h:847: error: expected '=', ',', ';', 'asm' or '__attribute__' before '__THROW'
/usr/include/stdlib.h:854: error: expected declaration specifiers or '...' before 'size_t'
/usr/include/stdlib.h:854: error: expected '=', ',', ';', 'asm' or '__attribute__' before '__THROW'
/usr/include/stdlib.h:857: error: expected declaration specifiers or '...' before 'size_t'
/usr/include/stdlib.h:857: error: expected '=', ',', ';', 'asm' or '__attribute__' before '__THROW'
/usr/include/stdlib.h:861: error: expected declaration specifiers or '...' before 'size_t'
/usr/include/stdlib.h:862: error: expected '=', ',', ';', 'asm' or '__attribute__' before '__THROW'
/usr/include/stdlib.h:865: error: expected declaration specifiers or '...' before 'size_t'
/usr/include/stdlib.h:866: error: expected '=', ',', ';', 'asm' or '__attribute__' before '__THROW'
/usr/include/stdlib.h:871: error: expected declaration specifiers before '__BEGIN_NAMESPACE_STD'
/usr/include/stdlib.h:878: error: expected declaration specifiers or '...' before 'size_t'
/usr/include/stdlib.h:878: error: expected '=', ',', ';', 'asm' or '__attribute__' before '__THROW'
/usr/include/stdlib.h:881: error: expected '=', ',', ';', 'asm' or '__attribute__' before '__THROW'
/usr/include/stdlib.h:885: error: expected '=', ',', ';', 'asm' or '__attribute__' before 'mbstowcs'
/usr/include/stdlib.h:888: error: expected '=', ',', ';', 'asm' or '__attribute__' before 'wcstombs'
/usr/include/stdlib.h:891: error: expected declaration specifiers before '__END_NAMESPACE_STD'
/usr/include/stdlib.h:927: error: expected '=', ',', ';', 'asm' or '__attribute__' before '__wur'
/usr/include/stdlib.h:963: error: expected '=', ',', ';', 'asm' or '__attribute__' before '__THROW'
/usr/include/stdlib.h:978: error: expected declaration specifiers before '__END_DECLS'
tbz2tool.c:6:22: error: sys/stat.h: No such file or directory
In file included from tbz2tool.c:7:
/usr/include/unistd.h:201: error: storage class specified for parameter 'gid_t'
/usr/include/unistd.h:206: error: storage class specified for parameter 'uid_t'
/usr/include/unistd.h:212: error: storage class specified for parameter 'off_t'
/usr/include/unistd.h:224: error: storage class specified for parameter 'useconds_t'
/usr/include/unistd.h:229: error: storage class specified for parameter 'pid_t'
/usr/include/unistd.h:236: error: storage class specified for parameter 'intptr_t'
/usr/include/unistd.h:243: error: storage class specified for parameter 'socklen_t'
/usr/include/unistd.h:256: error: expected '=', ',', ';', 'asm' or '__attribute__' before '__THROW'
/usr/include/unistd.h:299: error: expected '=', ',', ';', 'asm' or '__attribute__' before '__THROW'
/usr/include/unistd.h:318: error: storage class specified for parameter 'close'
/usr/include/unistd.h:325: error: expected '=', ',', ';', 'asm' or '__attribute__' before 'read'
/usr/include/unistd.h:331: error: expected '=', ',', ';', 'asm' or '__attribute__' before 'write'
/usr/include/unistd.h:382: error: expected '=', ',', ';', 'asm' or '__attribute__' before '__THROW'
/usr/include/unistd.h:391: error: expected '=', ',', ';', 'asm' or '__attribute__' before '__THROW'
/usr/include/unistd.h:403: error: storage class specified for parameter 'sleep'
/usr/include/unistd.h:411: error: expected '=', ',', ';', 'asm' or '__attribute__' before '__THROW'
/usr/include/unistd.h:418: error: storage class specified for parameter 'usleep'
/usr/include/unistd.h:427: error: storage class specified for parameter 'pause'
/usr/include/unistd.h:432: error: expected '=', ',', ';', 'asm' or '__attribute__' before '__THROW'
/usr/include/unistd.h:436: error: expected '=', ',', ';', 'asm' or '__attribute__' before '__THROW'
/usr/include/unistd.h:442: error: expected '=', ',', ';', 'asm' or '__attribute__' before '__THROW'
/usr/include/unistd.h:455: error: expected '=', ',', ';', 'asm' or '__attribute__' before '__THROW'
/usr/include/unistd.h:459: error: expected '=', ',', ';', 'asm' or '__attribute__' before '__THROW'
/usr/include/unistd.h:469: error: expected declaration specifiers or '...' before 'size_t'
/usr/include/unistd.h:469: error: expected '=', ',', ';', 'asm' or '__attribute__' before '__THROW'
/usr/include/unistd.h:483: error: expected '=', ',', ';', 'asm' or '__attribute__' before '__THROW'
/usr/include/unistd.h:488: error: expected '=', ',', ';', 'asm' or '__attribute__' before '__THROW'
/usr/include/unistd.h:491: error: expected '=', ',', ';', 'asm' or '__attribute__' before '__THROW'
/usr/include/unistd.h:494: error: storage class specified for parameter '__environ'
/usr/include/unistd.h:503: error: expected '=', ',', ';', 'asm' or '__attribute__' before '__THROW'
/usr/include/unistd.h:515: error: expected '=', ',', ';', 'asm' or '__attribute__' before '__THROW'
/usr/include/unistd.h:520: error: expected '=', ',', ';', 'asm' or '__attribute__' before '__THROW'
/usr/include/unistd.h:525: error: expected '=', ',', ';', 'asm' or '__attribute__' before '__THROW'
/usr/include/unistd.h:530: error: expected '=', ',', ';', 'asm' or '__attribute__' before '__THROW'
/usr/include/unistd.h:536: error: expected '=', ',', ';', 'asm' or '__attribute__' before '__THROW'
/usr/include/unistd.h:541: error: expected '=', ',', ';', 'asm' or '__attribute__' before '__THROW'
/usr/include/unistd.h:546: error: storage class specified for parameter '_exit'
In file included from tbz2tool.c:7:
/usr/include/unistd.h:556: error: expected '=', ',', ';', 'asm' or '__attribute__' before '__THROW'
/usr/include/unistd.h:559: error: expected '=', ',', ';', 'asm' or '__attribute__' before '__THROW'
/usr/include/unistd.h:562: error: expected '=', ',', ';', 'asm' or '__attribute__' before '__THROW'
/usr/include/unistd.h:566: error: expected '=', ',', ';', 'asm' or '__attribute__' before 'confstr'
/usr/include/unistd.h:571: error: expected '=', ',', ';', 'asm' or '__attribute__' before '__THROW'
/usr/include/unistd.h:574: error: expected '=', ',', ';', 'asm' or '__attribute__' before '__THROW'
/usr/include/unistd.h:579: error: expected '=', ',', ';', 'asm' or '__attribute__' before '__THROW'
/usr/include/unistd.h:589: error: expected '=', ',', ';', 'asm' or '__attribute__' before '__THROW'
/usr/include/unistd.h:598: error: expected '=', ',', ';', 'asm' or '__attribute__' before '__THROW'
/usr/include/unistd.h:615: error: expected '=', ',', ';', 'asm' or '__attribute__' before '__THROW'
/usr/include/unistd.h:632: error: expected '=', ',', ';', 'asm' or '__attribute__' before '__THROW'
/usr/include/unistd.h:640: error: expected '=', ',', ';', 'asm' or '__attribute__' before '__THROW'
/usr/include/unistd.h:643: error: expected '=', ',', ';', 'asm' or '__attribute__' before '__THROW'
/usr/include/unistd.h:646: error: expected '=', ',', ';', 'asm' or '__attribute__' before '__THROW'
/usr/include/unistd.h:649: error: expected '=', ',', ';', 'asm' or '__attribute__' before '__THROW'
/usr/include/unistd.h:654: error: expected '=', ',', ';', 'asm' or '__attribute__' before '__THROW'
/usr/include/unistd.h:665: error: expected '=', ',', ';', 'asm' or '__attribute__' before '__THROW'
/usr/include/unistd.h:670: error: expected '=', ',', ';', 'asm' or '__attribute__' before '__THROW'
/usr/include/unistd.h:675: error: expected '=', ',', ';', 'asm' or '__attribute__' before '__THROW'
/usr/include/unistd.h:682: error: expected '=', ',', ';', 'asm' or '__attribute__' before '__THROW'
/usr/include/unistd.h:687: error: expected '=', ',', ';', 'asm' or '__attribute__' before '__THROW'
/usr/include/unistd.h:692: error: expected '=', ',', ';', 'asm' or '__attribute__' before '__THROW'
/usr/include/unistd.h:721: error: expected '=', ',', ';', 'asm' or '__attribute__' before '__THROW'
/usr/include/unistd.h:728: error: expected '=', ',', ';', 'asm' or '__attribute__' before '__THROW'
/usr/include/unistd.h:734: error: expected '=', ',', ';', 'asm' or '__attribute__' before '__THROW'
/usr/include/unistd.h:738: error: expected declaration specifiers or '...' before 'size_t'
/usr/include/unistd.h:739: error: expected '=', ',', ';', 'asm' or '__attribute__' before '__THROW'
/usr/include/unistd.h:743: error: expected '=', ',', ';', 'asm' or '__attribute__' before '__THROW'
/usr/include/unistd.h:749: error: expected '=', ',', ';', 'asm' or '__attribute__' before '__THROW'
/usr/include/unistd.h:755: error: expected '=', ',', ';', 'asm' or '__attribute__' before '__THROW'
/usr/include/unistd.h:768: error: expected '=', ',', ';', 'asm' or '__attribute__' before '__THROW'
/usr/include/unistd.h:773: error: expected '=', ',', ';', 'asm' or '__attribute__' before 'readlink'
/usr/include/unistd.h:790: error: expected '=', ',', ';', 'asm' or '__attribute__' before '__THROW'
/usr/include/unistd.h:799: error: expected '=', ',', ';', 'asm' or '__attribute__' before '__THROW'
/usr/include/unistd.h:803: error: expected '=', ',', ';', 'asm' or '__attribute__' before '__THROW'
/usr/include/unistd.h:806: error: expected '=', ',', ';', 'asm' or '__attribute__' before '__THROW'
/usr/include/unistd.h:813: error: storage class specified for parameter 'getlogin'
/usr/include/unistd.h:821: error: expected declaration specifiers or '...' before 'size_t'
/usr/include/unistd.h:821: error: expected '=', ',', ';', 'asm' or '__attribute__' before '__nonnull'
/usr/include/unistd.h:826: error: expected '=', ',', ';', 'asm' or '__attribute__' before '__THROW'
In file included from /usr/include/unistd.h:835,
from tbz2tool.c:7:
/usr/include/getopt.h:59: error: storage class specified for parameter 'optarg'
/usr/include/getopt.h:73: error: storage class specified for parameter 'optind'
/usr/include/getopt.h:78: error: storage class specified for parameter 'opterr'
/usr/include/getopt.h:82: error: storage class specified for parameter 'optopt'
/usr/include/getopt.h:153: error: storage class specified for parameter 'getopt'
In file included from tbz2tool.c:7:
/usr/include/unistd.h:843: error: expected declaration specifiers or '...' before 'size_t'
/usr/include/unistd.h:843: error: expected '=', ',', ';', 'asm' or '__attribute__' before '__nonnull'
/usr/include/unistd.h:850: error: expected declaration specifiers or '...' before 'size_t'
/usr/include/unistd.h:851: error: expected '=', ',', ';', 'asm' or '__attribute__' before '__nonnull'
/usr/include/unistd.h:855: error: expected '=', ',', ';', 'asm' or '__attribute__' before '__wur'
/usr/include/unistd.h:861: error: expected declaration specifiers or '...' before 'size_t'
/usr/include/unistd.h:862: error: expected '=', ',', ';', 'asm' or '__attribute__' before '__nonnull'
/usr/include/unistd.h:863: error: expected declaration specifiers or '...' before 'size_t'
/usr/include/unistd.h:864: error: expected '=', ',', ';', 'asm' or '__attribute__' before '__nonnull'
/usr/include/unistd.h:870: error: storage class specified for parameter 'vhangup'
/usr/include/unistd.h:873: error: expected '=', ',', ';', 'asm' or '__attribute__' before '__nonnull'
/usr/include/unistd.h:881: error: expected declaration specifiers or '...' before 'size_t'
/usr/include/unistd.h:882: error: expected declaration specifiers or '...' before 'size_t'
/usr/include/unistd.h:883: error: expected '=', ',', ';', 'asm' or '__attribute__' before '__nonnull'
/usr/include/unistd.h:889: error: storage class specified for parameter 'acct'
/usr/include/unistd.h:893: error: storage class specified for parameter 'getusershell'
/usr/include/unistd.h:894: error: storage class specified for parameter 'endusershell'
/usr/include/unistd.h:895: error: storage class specified for parameter 'setusershell'
/usr/include/unistd.h:901: error: expected '=', ',', ';', 'asm' or '__attribute__' before '__wur'
/usr/include/unistd.h:908: error: expected '=', ',', ';', 'asm' or '__attribute__' before '__nonnull'
/usr/include/unistd.h:912: error: expected '=', ',', ';', 'asm' or '__attribute__' before '__nonnull'
/usr/include/unistd.h:921: error: storage class specified for parameter 'fsync'
/usr/include/unistd.h:928: error: storage class specified for parameter 'gethostid'
/usr/include/unistd.h:931: error: storage class specified for parameter 'sync'
/usr/include/unistd.h:936: error: storage class specified for parameter 'getpagesize'
/usr/include/unistd.h:941: error: storage class specified for parameter 'getdtablesize'
/usr/include/unistd.h:947: error: expected '=', ',', ';', 'asm' or '__attribute__' before '__nonnull'
/usr/include/unistd.h:968: error: expected '=', ',', ';', 'asm' or '__attribute__' before '__wur'
/usr/include/unistd.h:988: error: expected '=', ',', ';', 'asm' or '__attribute__' before '__wur'
/usr/include/unistd.h:994: error: expected ')' before '__delta'
/usr/include/unistd.h:1009: error: storage class specified for parameter 'syscall'
/usr/include/unistd.h:1032: error: expected '=', ',', ';', 'asm' or '__attribute__' before '__wur'
/usr/include/unistd.h:1063: error: storage class specified for parameter 'fdatasync'
/usr/include/unistd.h:1101: error: expected declaration specifiers before '__END_DECLS'
In file included from tbz2tool.c:8:
/usr/include/errno.h:59: error: expected declaration specifiers before '__END_DECLS'
In file included from tbz2tool.c:9:
/usr/include/string.h:43: error: expected declaration specifiers or '...' before 'size_t'
/usr/include/string.h:44: error: expected '=', ',', ';', 'asm' or '__attribute__' before '__nonnull'
/usr/include/string.h:45: error: expected declaration specifiers before '__END_NAMESPACE_STD'
/usr/include/string.h:57: error: expected declaration specifiers before '__BEGIN_NAMESPACE_STD'
/usr/include/string.h:62: error: expected declaration specifiers or '...' before 'size_t'
/usr/include/string.h:63: error: expected '=', ',', ';', 'asm' or '__attribute__' before '__attribute_pure__'
/usr/include/string.h:66: error: expected declaration specifiers or '...' before 'size_t'
/usr/include/string.h:67: error: expected '=', ',', ';', 'asm' or '__attribute__' before '__attribute_pure__'
/usr/include/string.h:68: error: expected declaration specifiers before '__END_NAMESPACE_STD'
/usr/include/string.h:88: error: expected declaration specifiers or '...' before 'size_t'
/usr/include/string.h:89: error: expected '=', ',', ';', 'asm' or '__attribute__' before '__nonnull'
/usr/include/string.h:93: error: expected '=', ',', ';', 'asm' or '__attribute__' before '__nonnull'
/usr/include/string.h:96: error: expected declaration specifiers or '...' before 'size_t'
/usr/include/string.h:96: error: expected '=', ',', ';', 'asm' or '__attribute__' before '__nonnull'
/usr/include/string.h:100: error: expected '=', ',', ';', 'asm' or '__attribute__' before '__attribute_pure__'
/usr/include/string.h:102: error: expected declaration specifiers or '...' before 'size_t'
/usr/include/string.h:103: error: expected '=', ',', ';', 'asm' or '__attribute__' before '__attribute_pure__'
/usr/include/string.h:107: error: expected '=', ',', ';', 'asm' or '__attribute__' before '__attribute_pure__'
/usr/include/string.h:109: error: expected '=', ',', ';', 'asm' or '__attribute__' before 'strxfrm'
/usr/include/string.h:112: error: expected declaration specifiers before '__END_NAMESPACE_STD'
/usr/include/string.h:165: error: expected declaration specifiers before '__BEGIN_NAMESPACE_STD'
/usr/include/string.h:171: error: expected '=', ',', ';', 'asm' or '__attribute__' before '__attribute_pure__'
/usr/include/string.h:172: error: expected declaration specifiers before '__END_NAMESPACE_STD'
/usr/include/string.h:188: error: expected '=', ',', ';', 'asm' or '__attribute__' before 'strspn'
/usr/include/string.h:192: error: expected '=', ',', ';', 'asm' or '__attribute__' before '__attribute_pure__'
/usr/include/string.h:195: error: expected '=', ',', ';', 'asm' or '__attribute__' before '__attribute_pure__'
/usr/include/string.h:200: error: expected '=', ',', ';', 'asm' or '__attribute__' before '__nonnull'
/usr/include/string.h:201: error: expected declaration specifiers before '__END_NAMESPACE_STD'
/usr/include/string.h:212: error: expected '=', ',', ';', 'asm' or '__attribute__' before '__nonnull'
/usr/include/string.h:240: error: expected declaration specifiers before '__BEGIN_NAMESPACE_STD'
/usr/include/string.h:244: error: expected declaration specifiers before '__END_NAMESPACE_STD'
/usr/include/string.h:257: error: expected declaration specifiers before '__END_NAMESPACE_STD'
/usr/include/string.h:288: error: expected declaration specifiers or '...' before 'size_t'
/usr/include/string.h:288: error: expected '=', ',', ';', 'asm' or '__attribute__' before '__nonnull'
/usr/include/string.h:292: error: expected declaration specifiers or '...' before 'size_t'
/usr/include/string.h:293: error: expected '=', ',', ';', 'asm' or '__attribute__' before '__nonnull'
/usr/include/string.h:296: error: expected declaration specifiers or '...' before 'size_t'
/usr/include/string.h:296: error: expected '=', ',', ';', 'asm' or '__attribute__' before '__nonnull'
/usr/include/string.h:299: error: expected declaration specifiers or '...' before 'size_t'
/usr/include/string.h:300: error: expected '=', ',', ';', 'asm' or '__attribute__' before '__attribute_pure__'
/usr/include/string.h:304: error: expected '=', ',', ';', 'asm' or '__attribute__' before '__attribute_pure__'
/usr/include/string.h:308: error: expected '=', ',', ';', 'asm' or '__attribute__' before '__attribute_pure__'
/usr/include/string.h:312: error: storage class specified for parameter 'ffs'
/usr/include/string.h:326: error: expected '=', ',', ';', 'asm' or '__attribute__' before '__attribute_pure__'
/usr/include/string.h:329: error: expected declaration specifiers or '...' before 'size_t'
/usr/include/string.h:330: error: expected '=', ',', ';', 'asm' or '__attribute__' before '__attribute_pure__'
/usr/include/string.h:350: error: expected '=', ',', ';', 'asm' or '__attribute__' before '__nonnull'
In file included from /usr/include/string.h:417,
from tbz2tool.c:9:
/usr/include/bits/string2.h:394: error: storage class specified for parameter '__rawmemchr'
/usr/include/bits/string2.h:969: error: expected '=', ',', ';', 'asm' or '__attribute__' before '__strcspn_c1'
/usr/include/bits/string2.h:971: error: expected '=', ',', ';', 'asm' or '__attribute__' before '__strcspn_c1'
/usr/include/bits/string2.h:979: error: expected '=', ',', ';', 'asm' or '__attribute__' before '__strcspn_c2'
/usr/include/bits/string2.h:982: error: expected '=', ',', ';', 'asm' or '__attribute__' before '__strcspn_c2'
/usr/include/bits/string2.h:991: error: expected '=', ',', ';', 'asm' or '__attribute__' before '__strcspn_c3'
/usr/include/bits/string2.h:994: error: expected '=', ',', ';', 'asm' or '__attribute__' before '__strcspn_c3'
/usr/include/bits/string2.h:1045: error: expected '=', ',', ';', 'asm' or '__attribute__' before '__strspn_c1'
/usr/include/bits/string2.h:1047: error: expected '=', ',', ';', 'asm' or '__attribute__' before '__strspn_c1'
/usr/include/bits/string2.h:1056: error: expected '=', ',', ';', 'asm' or '__attribute__' before '__strspn_c2'
/usr/include/bits/string2.h:1059: error: expected '=', ',', ';', 'asm' or '__attribute__' before '__strspn_c2'
/usr/include/bits/string2.h:1068: error: expected '=', ',', ';', 'asm' or '__attribute__' before '__strspn_c3'
/usr/include/bits/string2.h:1071: error: expected '=', ',', ';', 'asm' or '__attribute__' before '__strspn_c3'
/usr/include/bits/string2.h:1122: error: storage class specified for parameter '__strpbrk_c2'
/usr/include/bits/string2.h:1125: error: expected '=', ',', ';', 'asm' or '__attribute__' before '{' token
/usr/include/bits/string2.h:1133: error: storage class specified for parameter '__strpbrk_c3'
/usr/include/bits/string2.h:1137: error: expected '=', ',', ';', 'asm' or '__attribute__' before '{' token
/usr/include/bits/string2.h:1173: error: storage class specified for parameter '__strtok_r_1c'
/usr/include/bits/string2.h:1176: error: expected '=', ',', ';', 'asm' or '__attribute__' before '{' token
/usr/include/bits/string2.h:1205: error: storage class specified for parameter '__strsep_g'
/usr/include/bits/string2.h:1223: error: storage class specified for parameter '__strsep_1c'
/usr/include/bits/string2.h:1226: error: expected '=', ',', ';', 'asm' or '__attribute__' before '{' token
/usr/include/bits/string2.h:1233: error: storage class specified for parameter '__strsep_2c'
/usr/include/bits/string2.h:1236: error: expected '=', ',', ';', 'asm' or '__attribute__' before '{' token
/usr/include/bits/string2.h:1261: error: storage class specified for parameter '__strsep_3c'
/usr/include/bits/string2.h:1264: error: expected '=', ',', ';', 'asm' or '__attribute__' before '{' token
/usr/include/bits/string2.h:1304: error: expected '=', ',', ';', 'asm' or '__attribute__' before '__attribute_malloc__'
/usr/include/bits/string2.h:1323: error: expected declaration specifiers or '...' before 'size_t'
/usr/include/bits/string2.h:1324: error: expected '=', ',', ';', 'asm' or '__attribute__' before '__attribute_malloc__'
In file included from tbz2tool.c:9:
/usr/include/string.h:426: error: expected declaration specifiers before '__END_DECLS'
tbz2tool.c:14: error: parameter 'mystat' is initialized
tbz2tool.c:16: error: expected declaration specifiers before 'FILE'
tbz2tool.c:20: error: expected '=', ',', ';', 'asm' or '__attribute__' before '{' token
tbz2tool.c:28: error: expected ')' before '*' token
tbz2tool.c:36: error: expected ')' before '*' token
tbz2tool.c:55: error: expected '=', ',', ';', 'asm' or '__attribute__' before '{' token
tbz2tool.c:228: error: old-style parameter declarations in prototyped function definition
/usr/include/libio.h:412: error: parameter name omitted
tbz2tool.c:228: error: expected '{' at end of input
!!! ERROR: sys-apps/portage-2.1.2.7 failed.
Call stack:
ebuild.sh, line 1615: Called dyn_compile
ebuild.sh, line 972: Called qa_call 'src_compile'
ebuild.sh, line 44: Called src_compile
portage-2.1.2.7.ebuild, line 86: Called die
!!! Failed to build tbz2tool
!!! If you need support, post the topmost build error, and the call stack if relevant.
!!! A complete build log is located at '/var/tmp/portage/sys-apps/portage-2.1.2.7/temp/build.log'.