.deps/e2k-kerberos.Tpo -c e2k-kerberos.c -fPIC -DPIC -o .libs/e2k-kerberos.o
e2k-kerberos.c:31:18: error: krb5.h: No such file or directory
e2k-kerberos.c:34: error: expected '=', ',', ';', 'asm' or '__attribute__' befor e 'e2k_kerberos_context_new'
e2k-kerberos.c: In function 'krb5_result_to_e2k_kerberos_result':
e2k-kerberos.c:56: error: 'KRB5KDC_ERR_C_PRINCIPAL_UNKNOWN' undeclared (first us e in this function)
e2k-kerberos.c:56: error: (Each undeclared identifier is reported only once
e2k-kerberos.c:56: error: for each function it appears in.)
e2k-kerberos.c:59: error: 'KRB5KRB_AP_ERR_BAD_INTEGRITY' undeclared (first use i n this function)
e2k-kerberos.c:60: error: 'KRB5KDC_ERR_PREAUTH_FAILED' undeclared (first use in this function)
e2k-kerberos.c:63: error: 'KRB5KDC_ERR_KEY_EXP' undeclared (first use in this fu nction)
e2k-kerberos.c:66: error: 'KRB5_KDC_UNREACH' undeclared (first use in this funct ion)
e2k-kerberos.c:69: error: 'KRB5KRB_AP_ERR_SKEW' undeclared (first use in this fu nction)
e2k-kerberos.c: At top level:
e2k-kerberos.c:79: error: expected ')' before 'ctx'
e2k-kerberos.c: In function 'e2k_kerberos_change_password':
e2k-kerberos.c:119: error: 'krb5_context' undeclared (first use in this function )
e2k-kerberos.c:119: error: expected ';' before 'ctx'
e2k-kerberos.c:120: error: 'krb5_creds' undeclared (first use in this function)
e2k-kerberos.c:120: error: expected ';' before 'creds'
e2k-kerberos.c:121: error: 'krb5_data' undeclared (first use in this function)
e2k-kerberos.c:121: error: expected ';' before 'res_code_string'
e2k-kerberos.c:125: error: 'ctx' undeclared (first use in this function)
e2k-kerberos.c:125: warning: implicit declaration of function 'e2k_kerberos_cont ext_new'
e2k-kerberos.c:129: warning: implicit declaration of function 'get_init_cred'
e2k-kerberos.c:130: error: 'creds' undeclared (first use in this function)
e2k-kerberos.c:132: warning: implicit declaration of function 'krb5_free_context '
e2k-kerberos.c:136: warning: implicit declaration of function 'krb5_change_passw ord'
e2k-kerberos.c:137: error: 'res_code_string' undeclared (first use in this funct ion)
e2k-kerberos.c:137: error: 'res_string' undeclared (first use in this function)
e2k-kerberos.c:138: warning: implicit declaration of function 'krb5_free_cred_co ntents'
e2k-kerberos.c:139: warning: implicit declaration of function 'krb5_free_data_co ntents'
e2k-kerberos.c: In function 'e2k_kerberos_check_password':
e2k-kerberos.c:167: error: 'krb5_context' undeclared (first use in this function )
e2k-kerberos.c:167: error: expected ';' before 'ctx'
e2k-kerberos.c:168: error: 'krb5_creds' undeclared (first use in this function)
e2k-kerberos.c:168: error: expected ';' before 'creds'
e2k-kerberos.c:171: error: 'ctx' undeclared (first use in this function)
e2k-kerberos.c:175: error: 'creds' undeclared (first use in this function)
make[11]: *** [e2k-kerberos.lo] Fejl 1
make[11]: Forlader katalog '/home/sebastian/Desktop/garnome-2.18.1/desktop/evolu tion-data-server/work/main.d/evolution-data-server-1.10.1/servers/exchange/lib'