All pastes #506924 Raw Edit

largo

public text v1 · immutable
·published 2007-05-24 08:51 UTC
rendered paste body
configure:4939: cp conftest.c build && make _module_/usr/local/src/lustre-1.4.6.4/build LUSTRE_KERNEL_TEST=conftest.i CC=gcc -m64 -f /usr/local/src/lustre-1.4.6.4/build/Makefile LUSTRE_LINUX_CONFIG=/usr/src/linux
/.config -o tmp_include_depends -o scripts -o include/config/MARKER -C /usr/src/linux EXTRA_CFLAGS=-Werror-implicit-function-declaration -g -I/usr/local/src/lustre-1.4.6.4/lnet/include -I/usr/local/src/lustre-1.4
.6.4/lustre/include  M=/usr/local/src/lustre-1.4.6.4/build
/usr/local/src/lustre-1.4.6.4/build/conftest.c:28: warning: function declaration isn't a prototype
configure:4942: $? = 0
configure:4944: test -s build/conftest.i
configure:4947: $? = 0
configure:4950: result: yes
configure:4977: checking that modules can be built at all
configure:4997: cp conftest.c build && make modules CC=gcc -m64 -f /usr/local/src/lustre-1.4.6.4/build/Makefile LUSTRE_LINUX_CONFIG=/usr/src/linux/.config -o tmp_include_depends -o scripts -o include/config/MARKE
R -C /usr/src/linux EXTRA_CFLAGS=-Werror-implicit-function-declaration -g -I/usr/local/src/lustre-1.4.6.4/lnet/include -I/usr/local/src/lustre-1.4.6.4/lustre/include  M=/usr/local/src/lustre-1.4.6.4/build
/usr/local/src/lustre-1.4.6.4/build/conftest.c:28: warning: function declaration isn't a prototype
modpost: /usr/local/src/lustre-1.4.6.4/build/conftest.o no symtab?
/bin/sh: line 1: 28903 Aborted                 scripts/mod/modpost -m -i /usr/src/linux-2.6.12.6/Module.symvers vmlinux /usr/local/src/lustre-1.4.6.4/build/conftest.o
make[1]: *** [__modpost] Error 134
make: *** [modules] Error 2
configure:5000: $? = 2
configure: failed program was:
| /* confdefs.h.  */
|
| #define PACKAGE_NAME "Lustre"
| #define PACKAGE_TARNAME "lustre"
| #define PACKAGE_VERSION "LUSTRE_VERSION"
| #define PACKAGE_STRING "Lustre LUSTRE_VERSION"
| #define PACKAGE_BUGREPORT "https://bugzilla.lustre.org/"
| #define PACKAGE "lustre"
| #define VERSION "1.4.6.4"
| #define STDC_HEADERS 1
| #define HAVE_SYS_TYPES_H 1
| #define HAVE_SYS_STAT_H 1
| #define HAVE_STDLIB_H 1
| #define HAVE_STRING_H 1
| #define HAVE_MEMORY_H 1
| #define HAVE_STRINGS_H 1
| #define HAVE_INTTYPES_H 1
| #define HAVE_STDINT_H 1
| #define HAVE_UNISTD_H 1
| #define SIZEOF_UNSIGNED_LONG_LONG 8
| #define HAVE__USR_SRC_LINUX_INCLUDE_LINUX_AUTOCONF_H 1
| #define HAVE__USR_SRC_LINUX_INCLUDE_LINUX_VERSION_H 1
| #define HAVE__USR_SRC_LINUX_INCLUDE_LINUX_CONFIG_H 1
| /* end confdefs.h.  */
|
| int
| main ()
| {
|
|   ;
|   return 0;
| }
configure:5016: result: no
configure:5018: WARNING: Consult config.log for details.
configure:5020: WARNING: If you are trying to build with a kernel-source rpm, consult build/README.kernel-source
configure:5022: error: Kernel modules cannot be build.