../inc/extern.h:475: warning: conflicting types for built-in function 'log'
process.c: In function `m_sendmotd':
process.c:76: error: missing terminating " character
process.c:77: error: syntax error before '%' token
process.c:77: error: missing terminating " character
*** Error code 1
Stop in /usr/home/unreal/auspices/src.
gcc -Wall -g -c process.c
In file included from ../inc/services.h:615,
from process.c:12:
../inc/extern.h:475: warning: conflicting types for built-in function 'log'
process.c: In function `m_sendmotd':
process.c:76: error: missing terminating " character
process.c:77: error: syntax error before '%' token
process.c:77: error: missing terminating " character
*** Error code 1
Stop in /usr/home/unreal/auspices/src.
gmake: *** [install] Error 1