All pastes #506039 Raw Edit

bipolar

public text v1 · immutable
·published 2007-05-23 20:29 UTC
rendered paste body
g++ -c -pipe -g -fno-exceptions -O2 -fvisibility=hidden -fvisibility-inlines-hidden -Wall -W -D_REENTRANT -fPIC -DQT_SHARED -DQT_BUILD_SCRIPT_LIB -DQLALR_NO_QSCRIPTGRAMMAR_DEBUG_INFO -DQT_NO_CAST_TO_ASCII -DQT_ASCII_CAST_WARNINGS -DQT_MOC_COMPAT -DQ_SCRIPT_DIRECT_CODE -DQT_NO_DEBUG -DQT_CORE_LIB -D_LARGEFILE64_SOURCE -D_LARGEFILE_SOURCE -I../../mkspecs/qws/linux-x86-g++ -I. -I../../include/QtCore -I../../include/QtCore -I../../include -I../../include/QtScript -I.moc/release-shared-emb-x86 -I.uic/release-shared-emb-x86 -o .obj/release-shared-emb-x86/qscriptextqobject.o qscriptextqobject.cpp
qscriptextqobject.cpp: In member function ‘virtual bool QScript::ExtQObjectData::resolve(const QScriptValueImpl&, QScriptNameIdImpl*, QScript::Member*, QScriptValueImpl*)’:
qscriptextqobject.cpp:245: error: ‘class QObject’ has no member named ‘dynamicPropertyNames’
qscriptextqobject.cpp: In member function ‘virtual bool QScript::ExtQObjectData::get(const QScriptValueImpl&, const QScript::Member&, QScriptValueImpl*)’:
qscriptextqobject.cpp:332: error: ‘class QObject’ has no member named ‘property’
qscriptextqobject.cpp: In member function ‘virtual bool QScript::ExtQObjectData::put(QScriptValueImpl*, const QScript::Member&, const QScriptValueImpl&)’:
qscriptextqobject.cpp:402: error: ‘class QObject’ has no member named ‘setProperty’
qscriptextqobject.cpp: In member function ‘virtual int QScript::ExtQObjectData::extraMemberCount(const QScriptValueImpl&)’:
qscriptextqobject.cpp:429: error: ‘class QObject’ has no member named ‘dynamicPropertyNames’
qscriptextqobject.cpp: In member function ‘virtual bool QScript::ExtQObjectData::extraMember(const QScriptValueImpl&, int, QScript::Member*)’:
qscriptextqobject.cpp:483: error: ‘class QObject’ has no member named ‘dynamicPropertyNames’
qscriptextqobject.cpp: In member function ‘virtual bool QScript::ExtQObjectData::removeMember(const QScriptValueImpl&, const QScript::Member&)’:
qscriptextqobject.cpp:532: error: ‘class QObject’ has no member named ‘setProperty’
make[1]: *** [.obj/release-shared-emb-x86/qscriptextqobject.o] Error 1
make[1]: Leaving directory `/home/bflong/build/qtopia-core-opensource-src-4.3.0rc1/src/script'
make: *** [sub-script-make_default-ordered] Error 2
makeobj[0]: Leaving directory `/home/bflong/build/qtopia-core-opensource-src-4.3.0rc1'