All pastes #503786 Raw Edit

bipolar

public text v1 · immutable
·published 2007-05-23 01:01 UTC
rendered paste body
/home/bflong/build/kde4/src/KDE/kdelibs/kdeui/kernel/kapplication.cpp:305:2: error: #error QT_NO_SESSIONMANAGER was set, this will not compile. Reconfigure Qt with Session management support.
<snip>
/home/bflong/build/kde4/src/KDE/kdelibs/kdeui/kernel/kapplication.cpp: In member function &#8216;QString KApplication::sessionConfigName() const&#8217;:
/home/bflong/build/kde4/src/KDE/kdelibs/kdeui/kernel/kapplication.cpp:307: error: &#8216;sessionKey&#8217; was not declared in this scope
/home/bflong/build/kde4/src/KDE/kdelibs/kdeui/kernel/kapplication.cpp:310: error: &#8216;sessionId&#8217; was not declared in this scope
/home/bflong/build/kde4/src/KDE/kdelibs/kdeui/kernel/kapplication.cpp: At global scope:
/home/bflong/build/kde4/src/KDE/kdelibs/kdeui/kernel/kapplication.cpp:403: warning: unused parameter &#8216;dpy&#8217;
/home/bflong/build/kde4/src/KDE/kdelibs/kdeui/kernel/kapplication.cpp:403: warning: unused parameter &#8216;err_&#8217;
/home/bflong/build/kde4/src/KDE/kdelibs/kdeui/kernel/kapplication.cpp:416: warning: unused parameter &#8216;conn&#8217;
Scanning dependencies of target kjsconsole
cd /home/bflong/build/kde4/builddir/KDE/kdelibs && /usr/bin/cmake -E cmake_depends "Unix Makefiles" /home/bflong/build/kde4/src/KDE/kdelibs /home/bflong/build/kde4/src/KDE/kdelibs/kjsembed/console /home/bflong/build/kde4/builddir/KDE/kdelibs /home/bflong/build/kde4/builddir/KDE/kdelibs/kjsembed/console /home/bflong/build/kde4/builddir/KDE/kdelibs/kjsembed/console/CMakeFiles/kjsconsole.dir/DependInfo.cmake
/home/bflong/build/kde4/src/KDE/kdelibs/kdeui/kernel/kapplication.cpp: In member function &#8216;void KApplication::commitData(QSessionManager&)&#8217;:
/home/bflong/build/kde4/src/KDE/kdelibs/kdeui/kernel/kapplication.cpp:663: error: invalid use of undefined type &#8216;struct QSessionManager&#8217;
/usr/local/Trolltech/QtopiaCore-4.3.0rc1/include/QtGui/qapplication.h:48: error: forward declaration of &#8216;struct QSessionManager&#8217;
/home/bflong/build/kde4/src/KDE/kdelibs/kdeui/kernel/kapplication.cpp:665: error: invalid use of undefined type &#8216;struct QSessionManager&#8217;
/usr/local/Trolltech/QtopiaCore-4.3.0rc1/include/QtGui/qapplication.h:48: error: forward declaration of &#8216;struct QSessionManager&#8217;
/home/bflong/build/kde4/src/KDE/kdelibs/kdeui/kernel/kapplication.cpp:695: error: invalid use of undefined type &#8216;struct QSessionManager&#8217;
/usr/local/Trolltech/QtopiaCore-4.3.0rc1/include/QtGui/qapplication.h:48: error: forward declaration of &#8216;struct QSessionManager&#8217;
/home/bflong/build/kde4/src/KDE/kdelibs/kdeui/kernel/kapplication.cpp:695: error: incomplete type &#8216;QSessionManager&#8217; used in nested name specifier
/home/bflong/build/kde4/src/KDE/kdelibs/kdeui/kernel/kapplication.cpp:697: error: invalid use of undefined type &#8216;struct QSessionManager&#8217;
/usr/local/Trolltech/QtopiaCore-4.3.0rc1/include/QtGui/qapplication.h:48: error: forward declaration of &#8216;struct QSessionManager&#8217;
/home/bflong/build/kde4/src/KDE/kdelibs/kdeui/kernel/kapplication.cpp:697: error: incomplete type &#8216;QSessionManager&#8217; used in nested name specifier
/home/bflong/build/kde4/src/KDE/kdelibs/kdeui/kernel/kapplication.cpp: At global scope:
/home/bflong/build/kde4/src/KDE/kdelibs/kdeui/kernel/kapplication.cpp:701: warning: unused parameter &#8216;sm&#8217;
/home/bflong/build/kde4/src/KDE/kdelibs/kdeui/kernel/kapplication.cpp:962: warning: unused parameter &#8216;time&#8217;
/home/bflong/build/kde4/src/KDE/kdelibs/kdeui/kernel/kapplication.cpp:991: warning: unused parameter &#8216;service&#8217;
/home/bflong/build/kde4/src/KDE/kdelibs/kdeui/kernel/kapplication.cpp:991: warning: unused parameter &#8216;time&#8217;
make[2]: *** [kdeui/CMakeFiles/kdeui.dir/kernel/kapplication.o] Error 1
make[2]: Leaving directory `/home/bflong/build/kde4/builddir/KDE/kdelibs'
make[1]: *** [kdeui/CMakeFiles/kdeui.dir/all] Error 2
make[1]: *** Waiting for unfinished jobs....
make[2]: Leaving directory `/home/bflong/build/kde4/builddir/KDE/kdelibs'