rendered paste bodyThis file contains any messages produced by compilers while
running configure, to aid debugging if configure makes a mistake.
It was created by configure, which was
generated by GNU Autoconf 2.59. Invocation command line was
$ ./configure --prefix=/home/lighty/kryst --with-php=5 --with-php-config=/usr/bin --with-php-lib=/usr/lib/httpd/modules --with-tclconfig=/usr/lib
## --------- ##
## Platform. ##
## --------- ##
hostname = vexacom.com
uname -m = i686
uname -r = 2.6.20-1.2948.fc6
uname -s = Linux
uname -v = #1 SMP Fri Apr 27 19:48:40 EDT 2007
/usr/bin/uname -p = unknown
/bin/uname -X = unknown
/bin/arch = i686
/usr/bin/arch -k = unknown
/usr/convex/getsysinfo = unknown
hostinfo = unknown
/bin/machine = unknown
/usr/bin/oslevel = unknown
/bin/universe = unknown
PATH: /usr/kerberos/bin
PATH: //bin
PATH: /usr/local/bin
PATH: /bin
PATH: /usr/bin
PATH: /home/lighty/bin
## ----------- ##
## Core tests. ##
## ----------- ##
configure:1354: checking for a BSD-compatible install
configure:1409: result: /usr/bin/install -c
configure:1420: checking whether build environment is sane
configure:1463: result: yes
configure:1528: checking for gawk
configure:1544: found //bin/gawk
configure:1554: result: gawk
configure:1564: checking whether make sets $(MAKE)
configure:1584: result: yes
configure:1756: checking whether to enable maintainer-specific portions of Makefiles
configure:1765: result: no
configure:1827: checking for gcc
configure:1843: found /usr/bin/gcc
configure:1853: result: gcc
configure:2097: checking for C compiler version
configure:2100: gcc --version </dev/null >&5
gcc (GCC) 4.1.1 20070105 (Red Hat 4.1.1-51)
Copyright (C) 2006 Free Software Foundation, Inc.
This is free software; see the source for copying conditions. There is NO
warranty; not even for MERCHANTABILITY or FITNESS FOR A PARTICULAR PURPOSE.
configure:2103: $? = 0
configure:2105: gcc -v </dev/null >&5
Using built-in specs.
Target: i386-redhat-linux
Configured with: ../configure --prefix=/usr --mandir=/usr/share/man --infodir=/usr/share/info --enable-shared --enable-threads=posix --enable-checking=release --with-system-zlib --enable-__cxa_atexit --disable-libunwind-exceptions --enable-libgcj-multifile --enable-languages=c,c++,objc,obj-c++,java,fortran,ada --enable-java-awt=gtk --disable-dssi --enable-plugin --with-java-home=/usr/lib/jvm/java-1.4.2-gcj-1.4.2.0/jre --with-cpu=generic --host=i386-redhat-linux
Thread model: posix
gcc version 4.1.1 20070105 (Red Hat 4.1.1-51)
configure:2108: $? = 0
configure:2110: gcc -V </dev/null >&5
gcc: '-V' option must have argument
configure:2113: $? = 1
configure:2136: checking for C compiler default output file name
configure:2139: gcc conftest.c >&5
configure:2142: $? = 0
configure:2188: result: a.out
configure:2193: checking whether the C compiler works
configure:2199: ./a.out
configure:2202: $? = 0
configure:2219: result: yes
configure:2226: checking whether we are cross compiling
configure:2228: result: no
configure:2231: checking for suffix of executables
configure:2233: gcc -o conftest conftest.c >&5
configure:2236: $? = 0
configure:2261: result:
configure:2267: checking for suffix of object files
configure:2288: gcc -c conftest.c >&5
configure:2291: $? = 0
configure:2313: result: o
configure:2317: checking whether we are using the GNU C compiler
configure:2341: gcc -c conftest.c >&5
configure:2347: $? = 0
configure:2351: test -z
|| test ! -s conftest.err
configure:2354: $? = 0
configure:2357: test -s conftest.o
configure:2360: $? = 0
configure:2373: result: yes
configure:2379: checking whether gcc accepts -g
configure:2400: gcc -c -g conftest.c >&5
configure:2406: $? = 0
configure:2410: test -z
|| test ! -s conftest.err
configure:2413: $? = 0
configure:2416: test -s conftest.o
configure:2419: $? = 0
configure:2430: result: yes
configure:2447: checking for gcc option to accept ANSI C
configure:2517: gcc -c -g -O2 conftest.c >&5
configure:2523: $? = 0
configure:2527: test -z
|| test ! -s conftest.err
configure:2530: $? = 0
configure:2533: test -s conftest.o
configure:2536: $? = 0
configure:2554: result: none needed
configure:2572: gcc -c -g -O2 conftest.c >&5
conftest.c:2: error: expected '=', ',', ';', 'asm' or '__attribute__' before 'me'
configure:2578: $? = 1
configure: failed program was:
| #ifndef __cplusplus
| choke me
| #endif
configure:2722: checking for style of include used by make
configure:2750: result: GNU
configure:2778: checking dependency style of gcc
configure:2868: result: gcc3
configure:2894: checking for an ANSI C-conforming const
configure:2961: gcc -c -g -O2 conftest.c >&5
configure:2967: $? = 0
configure:2971: test -z
|| test ! -s conftest.err
configure:2974: $? = 0
configure:2977: test -s conftest.o
configure:2980: $? = 0
configure:2991: result: yes
configure:3002: checking whether struct tm is in sys/time.h or time.h
configure:3025: gcc -c -g -O2 conftest.c >&5
configure:3031: $? = 0
configure:3035: test -z
|| test ! -s conftest.err
configure:3038: $? = 0
configure:3041: test -s conftest.o
configure:3044: $? = 0
configure:3055: result: time.h
configure:3071: checking how to run the C preprocessor
configure:3106: gcc -E conftest.c
configure:3112: $? = 0
configure:3144: gcc -E conftest.c
conftest.c:11:28: error: ac_nonexistent.h: No such file or directory
configure:3150: $? = 1
configure: failed program was:
| /* confdefs.h. */
|
| #define PACKAGE_NAME ""
| #define PACKAGE_TARNAME ""
| #define PACKAGE_VERSION ""
| #define PACKAGE_STRING ""
| #define PACKAGE_BUGREPORT ""
| #define PACKAGE "trollbot"
| #define VERSION "BETA-20070509"
| /* end confdefs.h. */
| #include <ac_nonexistent.h>
configure:3189: result: gcc -E
configure:3213: gcc -E conftest.c
configure:3219: $? = 0
configure:3251: gcc -E conftest.c
conftest.c:11:28: error: ac_nonexistent.h: No such file or directory
configure:3257: $? = 1
configure: failed program was:
| /* confdefs.h. */
|
| #define PACKAGE_NAME ""
| #define PACKAGE_TARNAME ""
| #define PACKAGE_VERSION ""
| #define PACKAGE_STRING ""
| #define PACKAGE_BUGREPORT ""
| #define PACKAGE "trollbot"
| #define VERSION "BETA-20070509"
| /* end confdefs.h. */
| #include <ac_nonexistent.h>
configure:3301: checking for egrep
configure:3311: result: grep -E
configure:3316: checking for ANSI C header files
configure:3341: gcc -c -g -O2 conftest.c >&5
configure:3347: $? = 0
configure:3351: test -z
|| test ! -s conftest.err
configure:3354: $? = 0
configure:3357: test -s conftest.o
configure:3360: $? = 0
configure:3449: gcc -o conftest -g -O2 conftest.c >&5
conftest.c: In function 'main':
conftest.c:28: warning: incompatible implicit declaration of built-in function 'exit'
configure:3452: $? = 0
configure:3454: ./conftest
configure:3457: $? = 0
configure:3472: result: yes
configure:3496: checking for sys/types.h
configure:3512: gcc -c -g -O2 conftest.c >&5
configure:3518: $? = 0
configure:3522: test -z
|| test ! -s conftest.err
configure:3525: $? = 0
configure:3528: test -s conftest.o
configure:3531: $? = 0
configure:3542: result: yes
configure:3496: checking for sys/stat.h
configure:3512: gcc -c -g -O2 conftest.c >&5
configure:3518: $? = 0
configure:3522: test -z
|| test ! -s conftest.err
configure:3525: $? = 0
configure:3528: test -s conftest.o
configure:3531: $? = 0
configure:3542: result: yes
configure:3496: checking for stdlib.h
configure:3512: gcc -c -g -O2 conftest.c >&5
configure:3518: $? = 0
configure:3522: test -z
|| test ! -s conftest.err
configure:3525: $? = 0
configure:3528: test -s conftest.o
configure:3531: $? = 0
configure:3542: result: yes
configure:3496: checking for string.h
configure:3512: gcc -c -g -O2 conftest.c >&5
configure:3518: $? = 0
configure:3522: test -z
|| test ! -s conftest.err
configure:3525: $? = 0
configure:3528: test -s conftest.o
configure:3531: $? = 0
configure:3542: result: yes
configure:3496: checking for memory.h
configure:3512: gcc -c -g -O2 conftest.c >&5
configure:3518: $? = 0
configure:3522: test -z
|| test ! -s conftest.err
configure:3525: $? = 0
configure:3528: test -s conftest.o
configure:3531: $? = 0
configure:3542: result: yes
configure:3496: checking for strings.h
configure:3512: gcc -c -g -O2 conftest.c >&5
configure:3518: $? = 0
configure:3522: test -z
|| test ! -s conftest.err
configure:3525: $? = 0
configure:3528: test -s conftest.o
configure:3531: $? = 0
configure:3542: result: yes
configure:3496: checking for inttypes.h
configure:3512: gcc -c -g -O2 conftest.c >&5
configure:3518: $? = 0
configure:3522: test -z
|| test ! -s conftest.err
configure:3525: $? = 0
configure:3528: test -s conftest.o
configure:3531: $? = 0
configure:3542: result: yes
configure:3496: checking for stdint.h
configure:3512: gcc -c -g -O2 conftest.c >&5
configure:3518: $? = 0
configure:3522: test -z
|| test ! -s conftest.err
configure:3525: $? = 0
configure:3528: test -s conftest.o
configure:3531: $? = 0
configure:3542: result: yes
configure:3496: checking for unistd.h
configure:3512: gcc -c -g -O2 conftest.c >&5
configure:3518: $? = 0
configure:3522: test -z
|| test ! -s conftest.err
configure:3525: $? = 0
configure:3528: test -s conftest.o
configure:3531: $? = 0
configure:3542: result: yes
configure:3568: checking time.h usability
configure:3580: gcc -c -g -O2 conftest.c >&5
configure:3586: $? = 0
configure:3590: test -z
|| test ! -s conftest.err
configure:3593: $? = 0
configure:3596: test -s conftest.o
configure:3599: $? = 0
configure:3609: result: yes
configure:3613: checking time.h presence
configure:3623: gcc -E conftest.c
configure:3629: $? = 0
configure:3649: result: yes
configure:3684: checking for time.h
configure:3691: result: yes
configure:3718: checking sys/time.h usability
configure:3730: gcc -c -g -O2 conftest.c >&5
configure:3736: $? = 0
configure:3740: test -z
|| test ! -s conftest.err
configure:3743: $? = 0
configure:3746: test -s conftest.o
configure:3749: $? = 0
configure:3759: result: yes
configure:3763: checking sys/time.h presence
configure:3773: gcc -E conftest.c
configure:3779: $? = 0
configure:3799: result: yes
configure:3834: checking for sys/time.h
configure:3841: result: yes
configure:3855: checking for pid_t
configure:3879: gcc -c -g -O2 conftest.c >&5
configure:3885: $? = 0
configure:3889: test -z
|| test ! -s conftest.err
configure:3892: $? = 0
configure:3895: test -s conftest.o
configure:3898: $? = 0
configure:3909: result: yes
configure:3927: checking for unistd.h
configure:3932: result: yes
configure:3936: checking vfork.h usability
configure:3948: gcc -c -g -O2 conftest.c >&5
conftest.c:58:19: error: vfork.h: No such file or directory
configure:3954: $? = 1
configure: failed program was:
| /* confdefs.h. */
|
| #define PACKAGE_NAME ""
| #define PACKAGE_TARNAME ""
| #define PACKAGE_VERSION ""
| #define PACKAGE_STRING ""
| #define PACKAGE_BUGREPORT ""
| #define PACKAGE "trollbot"
| #define VERSION "BETA-20070509"
| #define STDC_HEADERS 1
| #define HAVE_SYS_TYPES_H 1
| #define HAVE_SYS_STAT_H 1
| #define HAVE_STDLIB_H 1
| #define HAVE_STRING_H 1
| #define HAVE_MEMORY_H 1
| #define HAVE_STRINGS_H 1
| #define HAVE_INTTYPES_H 1
| #define HAVE_STDINT_H 1
| #define HAVE_UNISTD_H 1
| #define HAVE_TIME_H 1
| #define HAVE_SYS_TIME_H 1
| #define HAVE_UNISTD_H 1
| /* end confdefs.h. */
| #include <stdio.h>
| #if HAVE_SYS_TYPES_H
| # include <sys/types.h>
| #endif
| #if HAVE_SYS_STAT_H
| # include <sys/stat.h>
| #endif
| #if STDC_HEADERS
| # include <stdlib.h>
| # include <stddef.h>
| #else
| # if HAVE_STDLIB_H
| # include <stdlib.h>
| # endif
| #endif
| #if HAVE_STRING_H
| # if !STDC_HEADERS && HAVE_MEMORY_H
| # include <memory.h>
| # endif
| # include <string.h>
| #endif
| #if HAVE_STRINGS_H
| # include <strings.h>
| #endif
| #if HAVE_INTTYPES_H
| # include <inttypes.h>
| #else
| # if HAVE_STDINT_H
| # include <stdint.h>
| # endif
| #endif
| #if HAVE_UNISTD_H
| # include <unistd.h>
| #endif
| #include <vfork.h>
configure:3977: result: no
configure:3981: checking vfork.h presence
configure:3991: gcc -E conftest.c
conftest.c:24:19: error: vfork.h: No such file or directory
configure:3997: $? = 1
configure: failed program was:
| /* confdefs.h. */
|
| #define PACKAGE_NAME ""
| #define PACKAGE_TARNAME ""
| #define PACKAGE_VERSION ""
| #define PACKAGE_STRING ""
| #define PACKAGE_BUGREPORT ""
| #define PACKAGE "trollbot"
| #define VERSION "BETA-20070509"
| #define STDC_HEADERS 1
| #define HAVE_SYS_TYPES_H 1
| #define HAVE_SYS_STAT_H 1
| #define HAVE_STDLIB_H 1
| #define HAVE_STRING_H 1
| #define HAVE_MEMORY_H 1
| #define HAVE_STRINGS_H 1
| #define HAVE_INTTYPES_H 1
| #define HAVE_STDINT_H 1
| #define HAVE_UNISTD_H 1
| #define HAVE_TIME_H 1
| #define HAVE_SYS_TIME_H 1
| #define HAVE_UNISTD_H 1
| /* end confdefs.h. */
| #include <vfork.h>
configure:4017: result: no
configure:4052: checking for vfork.h
configure:4059: result: no
configure:4077: checking for fork
configure:4134: gcc -o conftest -g -O2 conftest.c >&5
conftest.c:48: warning: conflicting types for built-in function 'fork'
configure:4140: $? = 0
configure:4144: test -z
|| test ! -s conftest.err
configure:4147: $? = 0
configure:4150: test -s conftest
configure:4153: $? = 0
configure:4165: result: yes
configure:4077: checking for vfork
configure:4134: gcc -o conftest -g -O2 conftest.c >&5
configure:4140: $? = 0
configure:4144: test -z
|| test ! -s conftest.err
configure:4147: $? = 0
configure:4150: test -s conftest
configure:4153: $? = 0
configure:4165: result: yes
configure:4176: checking for working fork
configure:4199: gcc -o conftest -g -O2 conftest.c >&5
conftest.c: In function 'main':
conftest.c:10: warning: incompatible implicit declaration of built-in function 'exit'
configure:4202: $? = 0
configure:4204: ./conftest
configure:4207: $? = 0
configure:4221: result: yes
configure:4242: checking for working vfork
configure:4375: result: yes
configure:4407: checking for pid_t
configure:4461: result: yes
configure:4589: checking for tclConfig.sh
configure:4608: result: /usr/lib/
configure:4613: checking Tcl configuration on what Tcl needs to compile
configure:4616: result: ok
configure:4627: checking where Tcl includes are
configure:4642: result: -I/usr/include
configure:4716: checking if there's a valid user specified php-config
configure:4721: result: Found at /usr/bin/php-config
configure:4768: checking for CFLAGS to use with PHP
configure:4777: result: -I/usr/include/php -I/usr/include/php/main -I/usr/include/php/TSRM -I/usr/include/php/Zend -I/usr/include/php/ext
configure:4780: checking whether our test PHP program compiles
configure:4811: gcc -c -g -O2 -I/usr/include/php -I/usr/include/php/main -I/usr/include/php/TSRM -I/usr/include/php/Zend -I/usr/include/php/ext conftest.c >&5
configure:4817: $? = 0
configure:4821: test -z
|| test ! -s conftest.err
configure:4824: $? = 0
configure:4827: test -s conftest.o
configure:4830: $? = 0
configure:4846: result: Wonderbar
configure:4850: checking for LDFLAGS to use with PHP5
configure:4863: result: -L/usr/lib/httpd/modules -Wl,-rpath=/usr/lib/httpd/modules -lcrypt -lcrypt -lhistory -lreadline -lncurses -laspell -lpspell -lgmp -ldb-4.3 -lcurl -lbz2 -lz -lpcre -lresolv -lm -ldl -lnsl -lxml2 -lz -lm -lgssapi_krb5 -lkrb5 -lk5crypto -lcom_err -lssl -lcrypto -ldl -lz -lcurl -lgssapi_krb5 -lkrb5 -lk5crypto -lcom_err -lresolv -ldl -lidn -lssl -lcrypto -lz -lssl -lcrypto -ldl -lz -lxml2 -lz -lm -lcrypt -lxml2 -lz -lm -lcrypt -L/usr/kerberos/lib -lphp5 -Wl,--unresolved-symbols=ignore-all
configure:4866: checking whether our test PHP5 program can link
configure:4896: gcc -o conftest -g -O2 -I/usr/include/php -I/usr/include/php/main -I/usr/include/php/TSRM -I/usr/include/php/Zend -I/usr/include/php/ext conftest.c -L/usr/lib/httpd/modules -Wl,-rpath=/usr/lib/httpd/modules -lcrypt -lcrypt -lhistory -lreadline -lncurses -laspell -lpspell -lgmp -ldb-4.3 -lcurl -lbz2 -lz -lpcre -lresolv -lm -ldl -lnsl -lxml2 -lz -lm -lgssapi_krb5 -lkrb5 -lk5crypto -lcom_err -lssl -lcrypto -ldl -lz -lcurl -lgssapi_krb5 -lkrb5 -lk5crypto -lcom_err -lresolv -ldl -lidn -lssl -lcrypto -lz -lssl -lcrypto -ldl -lz -lxml2 -lz -lm -lcrypt -lxml2 -lz -lm -lcrypt -L/usr/kerberos/lib -lphp5 -Wl,--unresolved-symbols=ignore-all >&5
/usr/bin/ld: cannot find -lhistory
collect2: ld returned 1 exit status
configure:4902: $? = 1
configure: failed program was:
| /* confdefs.h. */
|
| #define PACKAGE_NAME ""
| #define PACKAGE_TARNAME ""
| #define PACKAGE_VERSION ""
| #define PACKAGE_STRING ""
| #define PACKAGE_BUGREPORT ""
| #define PACKAGE "trollbot"
| #define VERSION "BETA-20070509"
| #define STDC_HEADERS 1
| #define HAVE_SYS_TYPES_H 1
| #define HAVE_SYS_STAT_H 1
| #define HAVE_STDLIB_H 1
| #define HAVE_STRING_H 1
| #define HAVE_MEMORY_H 1
| #define HAVE_STRINGS_H 1
| #define HAVE_INTTYPES_H 1
| #define HAVE_STDINT_H 1
| #define HAVE_UNISTD_H 1
| #define HAVE_TIME_H 1
| #define HAVE_SYS_TIME_H 1
| #define HAVE_UNISTD_H 1
| #define HAVE_FORK 1
| #define HAVE_VFORK 1
| #define HAVE_WORKING_VFORK 1
| #define HAVE_WORKING_FORK 1
| #define HAVE_TCL 1
| /* end confdefs.h. */
| #include <main/php.h>
| #include <main/SAPI.h>
| #include <main/php_main.h>
| #include <main/php_variables.h>
| #include <main/php_ini.h>
| #include <zend_ini.h>
|
| int
| main ()
| {
|
| zval *test;
|
| ;
| return 0;
| }
configure:4947: result: Error, cannot use PHP5
configure:4953: checking for LDFLAGS to use with PHP4
configure:4966: result: -L/usr/lib/httpd/modules -Wl,-rpath=/usr/lib/httpd/modules -lcrypt -lcrypt -lhistory -lreadline -lncurses -laspell -lpspell -lgmp -ldb-4.3 -lcurl -lbz2 -lz -lpcre -lresolv -lm -ldl -lnsl -lxml2 -lz -lm -lgssapi_krb5 -lkrb5 -lk5crypto -lcom_err -lssl -lcrypto -ldl -lz -lcurl -lgssapi_krb5 -lkrb5 -lk5crypto -lcom_err -lresolv -ldl -lidn -lssl -lcrypto -lz -lssl -lcrypto -ldl -lz -lxml2 -lz -lm -lcrypt -lxml2 -lz -lm -lcrypt -L/usr/kerberos/lib -lphp4 -Wl,--unresolved-symbols=ignore-all
configure:4969: checking whether our test PHP4 program can link
configure:4999: gcc -o conftest -g -O2 -I/usr/include/php -I/usr/include/php/main -I/usr/include/php/TSRM -I/usr/include/php/Zend -I/usr/include/php/ext conftest.c -L/usr/lib/httpd/modules -Wl,-rpath=/usr/lib/httpd/modules -lcrypt -lcrypt -lhistory -lreadline -lncurses -laspell -lpspell -lgmp -ldb-4.3 -lcurl -lbz2 -lz -lpcre -lresolv -lm -ldl -lnsl -lxml2 -lz -lm -lgssapi_krb5 -lkrb5 -lk5crypto -lcom_err -lssl -lcrypto -ldl -lz -lcurl -lgssapi_krb5 -lkrb5 -lk5crypto -lcom_err -lresolv -ldl -lidn -lssl -lcrypto -lz -lssl -lcrypto -ldl -lz -lxml2 -lz -lm -lcrypt -lxml2 -lz -lm -lcrypt -L/usr/kerberos/lib -lphp4 -Wl,--unresolved-symbols=ignore-all >&5
/usr/bin/ld: cannot find -lhistory
collect2: ld returned 1 exit status
configure:5005: $? = 1
configure: failed program was:
| /* confdefs.h. */
|
| #define PACKAGE_NAME ""
| #define PACKAGE_TARNAME ""
| #define PACKAGE_VERSION ""
| #define PACKAGE_STRING ""
| #define PACKAGE_BUGREPORT ""
| #define PACKAGE "trollbot"
| #define VERSION "BETA-20070509"
| #define STDC_HEADERS 1
| #define HAVE_SYS_TYPES_H 1
| #define HAVE_SYS_STAT_H 1
| #define HAVE_STDLIB_H 1
| #define HAVE_STRING_H 1
| #define HAVE_MEMORY_H 1
| #define HAVE_STRINGS_H 1
| #define HAVE_INTTYPES_H 1
| #define HAVE_STDINT_H 1
| #define HAVE_UNISTD_H 1
| #define HAVE_TIME_H 1
| #define HAVE_SYS_TIME_H 1
| #define HAVE_UNISTD_H 1
| #define HAVE_FORK 1
| #define HAVE_VFORK 1
| #define HAVE_WORKING_VFORK 1
| #define HAVE_WORKING_FORK 1
| #define HAVE_TCL 1
| /* end confdefs.h. */
| #include <main/php.h>
| #include <main/SAPI.h>
| #include <main/php_main.h>
| #include <main/php_variables.h>
| #include <main/php_ini.h>
| #include <zend_ini.h>
|
| int
| main ()
| {
|
| zval *test;
|
| ;
| return 0;
| }
configure:5050: result: Error, cannot use PHP4
configure:5093: checking For perl binary
configure:5097: checking for perl
configure:5115: found /usr/bin/perl
configure:5127: result: /usr/bin/perl
configure:5144: checking whether we can link with perl
configure:5167: gcc -o conftest -g -O2 -D_REENTRANT -D_GNU_SOURCE -fno-strict-aliasing -pipe -Wdeclaration-after-statement -I/usr/local/include -D_LARGEFILE_SOURCE -D_FILE_OFFSET_BITS=64 -I/usr/include/gdbm -I/usr/lib/perl5/5.8.8/i386-linux-thread-multi/CORE conftest.c -Wl,-E -Wl,-rpath,/usr/lib/perl5/5.8.8/i386-linux-thread-multi/CORE -L/usr/local/lib /usr/lib/perl5/5.8.8/i386-linux-thread-multi/auto/DynaLoader/DynaLoader.a -L/usr/lib/perl5/5.8.8/i386-linux-thread-multi/CORE -lperl -lresolv -lnsl -ldl -lm -lcrypt -lutil -lpthread -lc >&5
configure:5173: $? = 0
configure:5177: test -z
|| test ! -s conftest.err
configure:5180: $? = 0
configure:5183: test -s conftest
configure:5186: $? = 0
configure:5205: result: Yes
configure:5247: checking whether make sets $(MAKE)
configure:5267: result: yes
configure:5277: checking for ANSI C header files
configure:5433: result: yes
configure:5593: creating ./config.status
## ---------------------- ##
## Running config.status. ##
## ---------------------- ##
This file was extended by config.status, which was
generated by GNU Autoconf 2.59. Invocation command line was
CONFIG_FILES =
CONFIG_HEADERS =
CONFIG_LINKS =
CONFIG_COMMANDS =
$ ./config.status
on vexacom.com
config.status:715: creating Makefile
config.status:715: creating src/Makefile
config.status:715: creating doc_dist/Makefile
config.status:715: creating scripts_dist/Makefile
config.status:715: creating conf_dist/Makefile
config.status:715: creating text_dist/Makefile
config.status:819: creating config.h
config.status:1125: executing depfiles commands
## ---------------- ##
## Cache variables. ##
## ---------------- ##
ac_cv_c_compiler_gnu=yes
ac_cv_c_const=yes
ac_cv_env_CC_set=
ac_cv_env_CC_value=
ac_cv_env_CFLAGS_set=
ac_cv_env_CFLAGS_value=
ac_cv_env_CPPFLAGS_set=
ac_cv_env_CPPFLAGS_value=
ac_cv_env_CPP_set=
ac_cv_env_CPP_value=
ac_cv_env_LDFLAGS_set=
ac_cv_env_LDFLAGS_value=
ac_cv_env_build_alias_set=
ac_cv_env_build_alias_value=
ac_cv_env_host_alias_set=
ac_cv_env_host_alias_value=
ac_cv_env_target_alias_set=
ac_cv_env_target_alias_value=
ac_cv_exeext=
ac_cv_func_fork=yes
ac_cv_func_fork_works=yes
ac_cv_func_vfork=yes
ac_cv_func_vfork_works=yes
ac_cv_header_inttypes_h=yes
ac_cv_header_memory_h=yes
ac_cv_header_stdc=yes
ac_cv_header_stdint_h=yes
ac_cv_header_stdlib_h=yes
ac_cv_header_string_h=yes
ac_cv_header_strings_h=yes
ac_cv_header_sys_stat_h=yes
ac_cv_header_sys_time_h=yes
ac_cv_header_sys_types_h=yes
ac_cv_header_time_h=yes
ac_cv_header_unistd_h=yes
ac_cv_header_vfork_h=no
ac_cv_objext=o
ac_cv_path_PERL=/usr/bin/perl
ac_cv_path_install='/usr/bin/install -c'
ac_cv_prog_AWK=gawk
ac_cv_prog_CPP='gcc -E'
ac_cv_prog_ac_ct_CC=gcc
ac_cv_prog_cc_g=yes
ac_cv_prog_cc_stdc=
ac_cv_prog_egrep='grep -E'
ac_cv_prog_make_make_set=yes
ac_cv_struct_tm=time.h
ac_cv_type_pid_t=yes
am_cv_CC_dependencies_compiler_type=gcc3
## ----------------- ##
## Output variables. ##
## ----------------- ##
ACLOCAL='${SHELL} /home/lighty/trollbot-BETA-20070509/missing --run aclocal-1.9'
AMDEPBACKSLASH='\'
AMDEP_FALSE='#'
AMDEP_TRUE=''
AMTAR='${SHELL} /home/lighty/trollbot-BETA-20070509/missing --run tar'
AUTOCONF='${SHELL} /home/lighty/trollbot-BETA-20070509/missing --run autoconf'
AUTOHEADER='${SHELL} /home/lighty/trollbot-BETA-20070509/missing --run autoheader'
AUTOMAKE='${SHELL} /home/lighty/trollbot-BETA-20070509/missing --run automake-1.9'
AWK='gawk'
CC='gcc'
CCDEPMODE='depmode=gcc3'
CFLAGS='-g -O2'
CPP='gcc -E'
CPPFLAGS=''
CYGPATH_W='echo'
DEFS='-DHAVE_CONFIG_H'
DEPDIR='.deps'
ECHO_C=''
ECHO_N='-n'
ECHO_T=''
EGREP='grep -E'
EXEEXT=''
INSTALL_DATA='${INSTALL} -m 644'
INSTALL_PROGRAM='${INSTALL}'
INSTALL_SCRIPT='${INSTALL}'
INSTALL_STRIP_PROGRAM='${SHELL} $(install_sh) -c -s'
LDFLAGS=''
LIBOBJS=''
LIBS=''
LTLIBOBJS=''
MAINT='#'
MAINTAINER_MODE_FALSE=''
MAINTAINER_MODE_TRUE='#'
MAKEINFO='${SHELL} /home/lighty/trollbot-BETA-20070509/missing --run makeinfo'
OBJEXT='o'
PACKAGE='trollbot'
PACKAGE_BUGREPORT=''
PACKAGE_NAME=''
PACKAGE_STRING=''
PACKAGE_TARNAME=''
PACKAGE_VERSION=''
PATH_SEPARATOR=':'
PERL='/usr/bin/perl'
PERL_CFLAGS=' -D_REENTRANT -D_GNU_SOURCE -fno-strict-aliasing -pipe -Wdeclaration-after-statement -I/usr/local/include -D_LARGEFILE_SOURCE -D_FILE_OFFSET_BITS=64 -I/usr/include/gdbm -I/usr/lib/perl5/5.8.8/i386-linux-thread-multi/CORE '
PERL_LDADD='-Wl,-E -Wl,-rpath,/usr/lib/perl5/5.8.8/i386-linux-thread-multi/CORE -L/usr/local/lib /usr/lib/perl5/5.8.8/i386-linux-thread-multi/auto/DynaLoader/DynaLoader.a -L/usr/lib/perl5/5.8.8/i386-linux-thread-multi/CORE -lperl -lresolv -lnsl -ldl -lm -lcrypt -lutil -lpthread -lc'
PHPCONFIG='/usr/bin/php-config'
PHP_CFLAGS=''
PHP_LDADD=''
SET_MAKE=''
SHELL='/bin/sh'
STRIP=''
TCLSH=''
TCL_CPPFLAGS='-I/usr/include'
TCL_DEFS='-DPACKAGE_NAME=\"\" -DPACKAGE_TARNAME=\"\" -DPACKAGE_VERSION=\"\" -DPACKAGE_STRING=\"\" -DPACKAGE_BUGREPORT=\"\" -DSTDC_HEADERS=1 -DHAVE_SYS_TYPES_H=1 -DHAVE_SYS_STAT_H=1 -DHAVE_STDLIB_H=1 -DHAVE_STRING_H=1 -DHAVE_MEMORY_H=1 -DHAVE_STRINGS_H=1 -DHAVE_INTTYPES_H=1 -DHAVE_STDINT_H=1 -DHAVE_UNISTD_H=1 -DHAVE_LIMITS_H=1 -DHAVE_UNISTD_H=1 -DHAVE_SYS_PARAM_H=1 -DUSE_THREAD_ALLOC=1 -D_REENTRANT=1 -D_THREAD_SAFE=1 -DHAVE_PTHREAD_ATTR_SETSTACKSIZE=1 -DHAVE_PTHREAD_ATFORK=1 -DTCL_THREADS=1 -DPEEK_XCLOSEIM=1 -D_LARGEFILE64_SOURCE=1 -DTCL_WIDE_INT_TYPE=long\ long -DHAVE_STRUCT_STAT64=1 -DHAVE_OPEN64=1 -DHAVE_LSEEK64=1 -DHAVE_TYPE_OFF64_T=1 -DHAVE_GETCWD=1 -DHAVE_OPENDIR=1 -DHAVE_STRSTR=1 -DHAVE_STRTOL=1 -DHAVE_STRTOLL=1 -DHAVE_STRTOULL=1 -DHAVE_TMPNAM=1 -DHAVE_WAITPID=1 -DUSE_TERMIOS=1 -DHAVE_SYS_TIME_H=1 -DTIME_WITH_SYS_TIME=1 -DHAVE_STRUCT_TM_TM_ZONE=1 -DHAVE_TM_ZONE=1 -DHAVE_GMTIME_R=1 -DHAVE_LOCALTIME_R=1 -DHAVE_TM_GMTOFF=1 -DHAVE_TIMEZONE_VAR=1 -DHAVE_STRUCT_STAT_ST_BLKSIZE=1 -DHAVE_ST_BLKSIZE=1 -DHAVE_SIGNED_CHAR=1 -DHAVE_LANGINFO=1 -DHAVE_SYS_IOCTL_H=1 '
TCL_LIBS='-L/usr/lib -ltcl8.4${TCL_DBGX} -ldl -lpthread -lieee -lm'
VERSION='BETA-20070509'
WITH_PERL_FALSE='#'
WITH_PERL_TRUE=''
WITH_PHP_FALSE=''
WITH_PHP_TRUE='#'
WITH_PYTHON_FALSE=''
WITH_PYTHON_TRUE='#'
WITH_TCL_FALSE='#'
WITH_TCL_TRUE=''
ac_ct_CC='gcc'
ac_ct_STRIP=''
am__fastdepCC_FALSE='#'
am__fastdepCC_TRUE=''
am__include='include'
am__leading_dot='.'
am__quote=''
am__tar='${AMTAR} chof - "$$tardir"'
am__untar='${AMTAR} xf -'
bindir='${exec_prefix}/bin'
build_alias=''
datadir='${prefix}/share'
exec_prefix='${prefix}'
host_alias=''
includedir='${prefix}/include'
infodir='${prefix}/info'
install_sh='/home/lighty/trollbot-BETA-20070509/install-sh'
libdir='${exec_prefix}/lib'
libexecdir='${exec_prefix}/libexec'
localstatedir='${prefix}/var'
mandir='${prefix}/man'
mkdir_p='mkdir -p --'
oldincludedir='/usr/include'
prefix='/home/lighty/kryst'
program_transform_name='s,x,x,'
sbindir='${exec_prefix}/sbin'
sharedstatedir='${prefix}/com'
sysconfdir='${prefix}/etc'
target_alias=''
## ----------- ##
## confdefs.h. ##
## ----------- ##
#define HAVE_FORK 1
#define HAVE_INTTYPES_H 1
#define HAVE_MEMORY_H 1
#define HAVE_PERL 1
#define HAVE_STDINT_H 1
#define HAVE_STDLIB_H 1
#define HAVE_STRINGS_H 1
#define HAVE_STRING_H 1
#define HAVE_SYS_STAT_H 1
#define HAVE_SYS_TIME_H 1
#define HAVE_SYS_TYPES_H 1
#define HAVE_TCL 1
#define HAVE_TIME_H 1
#define HAVE_UNISTD_H 1
#define HAVE_UNISTD_H 1
#define HAVE_VFORK 1
#define HAVE_WORKING_FORK 1
#define HAVE_WORKING_VFORK 1
#define PACKAGE "trollbot"
#define PACKAGE_BUGREPORT ""
#define PACKAGE_NAME ""
#define PACKAGE_STRING ""
#define PACKAGE_TARNAME ""
#define PACKAGE_VERSION ""
#define STDC_HEADERS 1
#define STDC_HEADERS 1
#define VERSION "BETA-20070509"
configure: exit 0