rendered paste bodyroot@logic otrs -> !1084
perl -MCPAN -e shell
Terminal does not support AddHistory.
cpan shell -- CPAN exploration and modules installation (v1.7601)
ReadLine support available (try 'install Bundle::CPAN')
cpan> install GD
CPAN: Storable loaded ok
Going to read /root/.cpan/Metadata
Database was generated on Tue, 22 May 2007 17:55:23 GMT
Running install for module GD
Running make for L/LD/LDS/GD-2.35.tar.gz
CPAN: Digest::MD5 loaded ok
Checksum for /root/.cpan/sources/authors/id/L/LD/LDS/GD-2.35.tar.gz ok
Scanning cache /root/.cpan/build for sizes
GD-2.35/
GD-2.35/t/
GD-2.35/t/test.out.3.jpeg
GD-2.35/t/GD.t
GD-2.35/t/tile.jpeg
GD-2.35/t/test.out.4.jpeg
GD-2.35/t/test.out.5.jpeg
GD-2.35/t/test.out.6.jpeg
GD-2.35/t/test.out.7.jpeg
GD-2.35/t/test.out.8.jpeg
GD-2.35/t/test.out.9.jpeg
GD-2.35/t/test.out.3.png-1
GD-2.35/t/Polyline.t
GD-2.35/t/test.out.4.png-1
GD-2.35/t/test.out.4.png-2
GD-2.35/t/test.out.10.png-1
GD-2.35/t/test.out.10.png-2
GD-2.35/t/test.out.10.png-3
GD-2.35/t/test.out.1.png
GD-2.35/t/test.out.2.gif
GD-2.35/t/test.out.2.png
GD-2.35/t/test.out.3.gif
GD-2.35/t/test.out.3.png
GD-2.35/t/test.out.4.gif
GD-2.35/t/test.out.4.png
GD-2.35/t/test.out.5.gif
GD-2.35/t/test.out.5.png
GD-2.35/t/test.out.6.gif
GD-2.35/t/test.out.6.png
GD-2.35/t/test.out.7.gif
GD-2.35/t/test.out.7.png
GD-2.35/t/test.out.8.gif
GD-2.35/t/test.out.8.png
GD-2.35/t/test.out.9.gif
GD-2.35/t/test.out.9.png
GD-2.35/t/test.out.5.png-1
GD-2.35/t/Generic.ttf
GD-2.35/t/test.out.6.png-1
GD-2.35/t/test.out.7.png-1
GD-2.35/t/frog.jpg
GD-2.35/t/frog.xpm
GD-2.35/t/test.out.10.jpeg
GD-2.35/t/test.out.8.png-1
GD-2.35/t/test.out.8.png-2
GD-2.35/t/test.out.8.png-3
GD-2.35/t/test.out.8.png-4
GD-2.35/t/test.out.8.png-5
GD-2.35/t/test.out.8.png-6
GD-2.35/t/tile.gif
GD-2.35/t/tile.png
GD-2.35/t/test.out.2.png-1
GD-2.35/t/test.out.9.png-1
GD-2.35/t/test.out.9.png-2
GD-2.35/t/palettemap.png
GD-2.35/t/test.out.10.gif
GD-2.35/t/test.out.10.png
GD-2.35/t/test.out.2.jpeg
GD-2.35/GD/
GD-2.35/GD/Polygon.pm
GD-2.35/GD/Simple.pm
GD-2.35/GD/Image.pm.PLS
GD-2.35/GD/Polyline.pm
GD-2.35/GD.pm
GD-2.35/GD.xs
GD-2.35/demos/
GD-2.35/demos/brushes.pl
GD-2.35/demos/font_list.png
GD-2.35/demos/fonttest
GD-2.35/demos/polys.pl
GD-2.35/demos/fills.pl
GD-2.35/demos/truetype_test
GD-2.35/demos/shapes.pl
GD-2.35/demos/copies.pl
GD-2.35/demos/ttf.pl
GD-2.35/demos/gd_example.cgi
GD-2.35/demos/tile.png
GD-2.35/demos/polyline.pl
GD-2.35/demos/transform.pl
GD-2.35/qd.pl
GD-2.35/README
GD-2.35/Makefile.PL
GD-2.35/README.QUICKDRAW
GD-2.35/META.yml
GD-2.35/typemap
GD-2.35/bdf_scripts/
GD-2.35/bdf_scripts/README
GD-2.35/bdf_scripts/bdf2gdfont.PLS
GD-2.35/bdf_scripts/bdftogd
GD-2.35/bdf_scripts/bdf2gdfont.pl
GD-2.35/README.unix
GD-2.35/ChangeLog
GD-2.35/MANIFEST
Removing previously used /root/.cpan/build/GD-2.35
CPAN.pm: Going to build L/LD/LDS/GD-2.35.tar.gz
NOTICE: This module requires libgd 2.0.28 or higher.
If you are using Math::Trig 1.01 or lower, it has a bug that
causes a "prerequisite not found" warning to be issued. You may
safely ignore this warning.
Type perl Makefile.PL -h for command-line option summary
Where is libgd installed? [/usr/lib]
Please choose the features that match how libgd was built:
Build JPEG support? [y]
Build PNG support? [y]
Build FreeType support? [y]
Build GIF support? [y]
Build support for animated GIFs? [y]
Build XPM support? [y]
If you experience compile problems, please check the @INC, @LIBPATH and @LIBS
arrays defined in Makefile.PL and manually adjust, if necessary.
Checking if your kit is complete...
Looks good
Writing Makefile for GD
/usr/bin/perl "-Iblib/arch" "-Iblib/lib" GD/Image.pm.PLS GD/Image.pm
Extracting Image.pm (with variable substitutions)
cp GD/Polyline.pm blib/lib/GD/Polyline.pm
cp qd.pl blib/lib/qd.pl
cp GD/Image.pm blib/lib/GD/Image.pm
cp GD.pm blib/lib/GD.pm
AutoSplitting blib/lib/GD.pm (blib/lib/auto/GD)
cp GD/Simple.pm blib/lib/GD/Simple.pm
cp GD/Polygon.pm blib/lib/GD/Polygon.pm
/usr/bin/perl /usr/lib/perl5/5.8.5/ExtUtils/xsubpp -typemap /usr/lib/perl5/5.8.5/ExtUtils/typemap -typemap typemap GD.xs > GD.xsc && mv GD.xsc GD.c
gcc -c -I/usr/include -I/usr/include/gd -D_REENTRANT -D_GNU_SOURCE -DDEBUGGING -fno-strict-aliasing -pipe -I/usr/local/include -D_LARGEFILE_SOURCE -D_FILE_OFFSET_BITS=64 -I/usr/include/gdbm -O2 -g -pipe -m32 -march=i386 -mtune=pentium4 -DVERSION=\"2.35\" -DXS_VERSION=\"2.35\" -fPIC "-I/usr/lib/perl5/5.8.5/i386-linux-thread-multi/CORE" -DHAVE_JPEG -DHAVE_FT -DHAVE_XPM -DHAVE_GIF -DHAVE_PNG -DHAVE_ANIMGIF GD.c
Running Mkbootstrap for GD ()
chmod 644 GD.bs
rm -f blib/arch/auto/GD/GD.so
gcc -shared -L/usr/local/lib GD.o -o blib/arch/auto/GD/GD.so -L/usr/lib/X11 -L/usr/X11R6/lib -L/usr/lib -lgd -lfreetype -ljpeg -lpng -lz -lm -lX11 -lXpm
chmod 755 blib/arch/auto/GD/GD.so
cp GD.bs blib/arch/auto/GD/GD.bs
chmod 644 blib/arch/auto/GD/GD.bs
cp bdf_scripts/bdf2gdfont.pl blib/script/bdf2gdfont.pl
/usr/bin/perl "-MExtUtils::MY" -e "MY->fixin(shift)" blib/script/bdf2gdfont.pl
Manifying blib/man1/bdf2gdfont.pl.1
Manifying blib/man3/GD::Polyline.3pm
Manifying blib/man3/GD::Image.3pm
Manifying blib/man3/GD::Simple.3pm
Manifying blib/man3/GD.3pm
Manifying blib/man3/GD::Polygon.3pm
/usr/bin/make -- OK
Running make test
PERL_DL_NONLAZY=1 /usr/bin/perl "-MExtUtils::Command::MM" "-e" "test_harness(0, 'blib/lib', 'blib/arch')" t/*.t
t/GD..........Can't load './blib/arch/auto/GD/GD.so' for module GD: ./blib/arch/auto/GD/GD.so: undefined symbol: gdImagePngPtrEx at /usr/lib/perl5/5.8.5/i386-linux-thread-multi/DynaLoader.pm line 230.
at t/GD.t line 14
Compilation failed in require at t/GD.t line 14.
BEGIN failed--compilation aborted at t/GD.t line 14.
t/GD..........dubious
Test returned status 255 (wstat 65280, 0xff00)
DIED. FAILED tests 1-12
Failed 12/12 tests, 0.00% okay
t/Polyline....Can't load '/root/.cpan/build/GD-2.35/blib/arch/auto/GD/GD.so' for module GD: /root/.cpan/build/GD-2.35/blib/arch/auto/GD/GD.so: undefined symbol: gdImagePngPtrEx at /usr/lib/perl5/5.8.5/i386-linux-thread-multi/DynaLoader.pm line 230.
at /root/.cpan/build/GD-2.35/blib/lib/GD/Polyline.pm line 45
Compilation failed in require at /root/.cpan/build/GD-2.35/blib/lib/GD/Polyline.pm line 45.
BEGIN failed--compilation aborted at /root/.cpan/build/GD-2.35/blib/lib/GD/Polyline.pm line 45.
Compilation failed in require at t/Polyline.t line 10.
BEGIN failed--compilation aborted at t/Polyline.t line 10.
t/Polyline....dubious
Test returned status 255 (wstat 65280, 0xff00)
DIED. FAILED test 1
Failed 1/1 tests, 0.00% okay
Failed Test Stat Wstat Total Fail Failed List of Failed
-------------------------------------------------------------------------------
t/GD.t 255 65280 12 23 191.67% 1-12
t/Polyline.t 255 65280 1 2 200.00% 1
Failed 2/2 test scripts, 0.00% okay. 13/13 subtests failed, 0.00% okay.
make: *** [test_dynamic] Error 255
/usr/bin/make test -- NOT OK
Running make install
make test had returned bad status, won't install without force
cpan>