rendered paste bodyThis file contains any messages produced by compilers while
running configure, to aid debugging if configure makes a mistake.
It was created by configure, which was
generated by GNU Autoconf 2.59. Invocation command line was
$ ./configure --prefix=/usr --mandir=${prefix}/share/man --infodir=${prefix}/share/info --with-nss-includes=/usr/include/mozilla/nss --with-nspr-includes=/usr/include/mozilla/nspr --with-nspr-libs=/usr/lib --with-nss-libs=/usr/lib
## --------- ##
## Platform. ##
## --------- ##
hostname = Gutsy
uname -m = i686
uname -r = 2.6.20-15-generic
uname -s = Linux
uname -v = #2 SMP Sun Apr 15 07:36:31 UTC 2007
/usr/bin/uname -p = unknown
/bin/uname -X = unknown
/bin/arch = i686
/usr/bin/arch -k = unknown
/usr/convex/getsysinfo = unknown
hostinfo = unknown
/bin/machine = unknown
/usr/bin/oslevel = unknown
/bin/universe = unknown
PATH: /home/gnomefreak/bin
PATH: /home/gnomefreak/bin
PATH: /usr/local/sbin
PATH: /usr/local/bin
PATH: /usr/sbin
PATH: /usr/bin
PATH: /sbin
PATH: /bin
PATH: /usr/games
## ----------- ##
## Core tests. ##
## ----------- ##
configure:1541: checking build system type
configure:1559: result: i686-pc-linux-gnu
configure:1567: checking host system type
configure:1581: result: i686-pc-linux-gnu
configure:1589: checking target system type
configure:1603: result: i686-pc-linux-gnu
configure:1640: checking for a BSD-compatible install
configure:1695: result: /usr/bin/install -c
configure:1706: checking whether build environment is sane
configure:1749: result: yes
configure:1764: checking whether make sets $(MAKE)
configure:1784: result: yes
configure:1807: checking for working aclocal-1.4
configure:1814: result: found
configure:1822: checking for working autoconf
configure:1829: result: found
configure:1837: checking for working automake-1.4
configure:1844: result: found
configure:1852: checking for working autoheader
configure:1859: result: found
configure:1867: checking for working makeinfo
configure:1878: result: missing
configure:1929: checking whether NLS is requested
configure:1938: result: yes
configure:1976: checking for msgfmt
configure:2007: result: /usr/bin/msgfmt
configure:2016: checking for gmsgfmt
configure:2047: result: /usr/bin/msgfmt
configure:2086: checking for xgettext
configure:2117: result: /usr/bin/xgettext
configure:2157: checking for msgmerge
configure:2187: result: /usr/bin/msgmerge
configure:2268: checking for gcc
configure:2284: found /usr/bin/gcc
configure:2294: result: gcc
configure:2538: checking for C compiler version
configure:2541: gcc --version </dev/null >&5
gcc (GCC) 4.0.3 (Ubuntu 4.0.3-1ubuntu5)
Copyright (C) 2006 Free Software Foundation, Inc.
This is free software; see the source for copying conditions. There is NO
warranty; not even for MERCHANTABILITY or FITNESS FOR A PARTICULAR PURPOSE.
configure:2544: $? = 0
configure:2546: gcc -v </dev/null >&5
Using built-in specs.
Target: i486-linux-gnu
Configured with: ../src/configure -v --enable-languages=c,c++,java,f95,objc,ada,treelang --prefix=/usr --enable-shared --with-system-zlib --libexecdir=/usr/lib --without-included-gettext --enable-threads=posix --enable-nls --program-suffix=-4.0 --enable-__cxa_atexit --enable-clocale=gnu --enable-libstdcxx-debug --enable-java-awt=gtk-default --enable-gtk-cairo --with-java-home=/usr/lib/jvm/java-1.4.2-gcj-4.0-1.4.2.0/jre --enable-mpfr --disable-werror --with-tune=pentium4 --enable-checking=release i486-linux-gnu
Thread model: posix
gcc version 4.0.3 (Ubuntu 4.0.3-1ubuntu5)
configure:2549: $? = 0
configure:2551: gcc -V </dev/null >&5
gcc: '-V' option must have argument
configure:2554: $? = 1
configure:2577: checking for C compiler default output file name
configure:2580: gcc conftest.c >&5
configure:2583: $? = 0
configure:2629: result: a.out
configure:2634: checking whether the C compiler works
configure:2640: ./a.out
configure:2643: $? = 0
configure:2660: result: yes
configure:2667: checking whether we are cross compiling
configure:2669: result: no
configure:2672: checking for suffix of executables
configure:2674: gcc -o conftest conftest.c >&5
configure:2677: $? = 0
configure:2702: result:
configure:2708: checking for suffix of object files
configure:2729: gcc -c conftest.c >&5
configure:2732: $? = 0
configure:2754: result: o
configure:2758: checking whether we are using the GNU C compiler
configure:2782: gcc -c conftest.c >&5
configure:2788: $? = 0
configure:2791: test -z || test ! -s conftest.err
configure:2794: $? = 0
configure:2797: test -s conftest.o
configure:2800: $? = 0
configure:2813: result: yes
configure:2819: checking whether gcc accepts -g
configure:2840: gcc -c -g conftest.c >&5
configure:2846: $? = 0
configure:2849: test -z || test ! -s conftest.err
configure:2852: $? = 0
configure:2855: test -s conftest.o
configure:2858: $? = 0
configure:2869: result: yes
configure:2886: checking for gcc option to accept ANSI C
configure:2956: gcc -c -g -O2 conftest.c >&5
configure:2962: $? = 0
configure:2965: test -z || test ! -s conftest.err
configure:2968: $? = 0
configure:2971: test -s conftest.o
configure:2974: $? = 0
configure:2992: result: none needed
configure:3010: gcc -c -g -O2 conftest.c >&5
conftest.c:2: error: syntax error before 'me'
configure:3016: $? = 1
configure: failed program was:
| #ifndef __cplusplus
| choke me
| #endif
configure:3187: checking for ranlib
configure:3203: found /usr/bin/ranlib
configure:3214: result: ranlib
configure:3228: checking for strerror in -lcposix
configure:3258: gcc -o conftest -g -O2 conftest.c -lcposix >&5
/usr/bin/ld: cannot find -lcposix
collect2: ld returned 1 exit status
configure:3264: $? = 1
configure: failed program was:
| /* confdefs.h. */
|
| #define PACKAGE_NAME ""
| #define PACKAGE_TARNAME ""
| #define PACKAGE_VERSION ""
| #define PACKAGE_STRING ""
| #define PACKAGE_BUGREPORT ""
| #define ENC_VERSION "2.38"
| #define ENC_PACKAGE "gaim-encryption"
| /* end confdefs.h. */
|
| /* Override any gcc2 internal prototype to avoid an error. */
| #ifdef __cplusplus
| extern "C"
| #endif
| /* We use char because int might match the return type of a gcc2
| builtin and then its argument prototype would still apply. */
| char strerror ();
| int
| main ()
| {
| strerror ();
| ;
| return 0;
| }
configure:3289: result: no
configure:3302: checking how to run the C preprocessor
configure:3337: gcc -E conftest.c
configure:3343: $? = 0
configure:3375: gcc -E conftest.c
conftest.c:11:28: error: ac_nonexistent.h: No such file or directory
configure:3381: $? = 1
configure: failed program was:
| /* confdefs.h. */
|
| #define PACKAGE_NAME ""
| #define PACKAGE_TARNAME ""
| #define PACKAGE_VERSION ""
| #define PACKAGE_STRING ""
| #define PACKAGE_BUGREPORT ""
| #define ENC_VERSION "2.38"
| #define ENC_PACKAGE "gaim-encryption"
| /* end confdefs.h. */
| #include <ac_nonexistent.h>
configure:3420: result: gcc -E
configure:3444: gcc -E conftest.c
configure:3450: $? = 0
configure:3482: gcc -E conftest.c
conftest.c:11:28: error: ac_nonexistent.h: No such file or directory
configure:3488: $? = 1
configure: failed program was:
| /* confdefs.h. */
|
| #define PACKAGE_NAME ""
| #define PACKAGE_TARNAME ""
| #define PACKAGE_VERSION ""
| #define PACKAGE_STRING ""
| #define PACKAGE_BUGREPORT ""
| #define ENC_VERSION "2.38"
| #define ENC_PACKAGE "gaim-encryption"
| /* end confdefs.h. */
| #include <ac_nonexistent.h>
configure:3532: checking for egrep
configure:3542: result: grep -E
configure:3547: checking for ANSI C header files
configure:3572: gcc -c -g -O2 conftest.c >&5
configure:3578: $? = 0
configure:3581: test -z || test ! -s conftest.err
configure:3584: $? = 0
configure:3587: test -s conftest.o
configure:3590: $? = 0
configure:3679: gcc -o conftest -g -O2 conftest.c >&5
conftest.c: In function 'main':
conftest.c:28: warning: incompatible implicit declaration of built-in function 'exit'
configure:3682: $? = 0
configure:3684: ./conftest
configure:3687: $? = 0
configure:3702: result: yes
configure:3712: checking for an ANSI C-conforming const
configure:3779: gcc -c -g -O2 conftest.c >&5
configure:3785: $? = 0
configure:3788: test -z || test ! -s conftest.err
configure:3791: $? = 0
configure:3794: test -s conftest.o
configure:3797: $? = 0
configure:3808: result: yes
configure:3819: checking for signed
configure:3840: gcc -c -g -O2 conftest.c >&5
configure:3846: $? = 0
configure:3849: test -z || test ! -s conftest.err
configure:3852: $? = 0
configure:3855: test -s conftest.o
configure:3858: $? = 0
configure:3869: result: yes
configure:3879: checking for inline
configure:3900: gcc -c -g -O2 conftest.c >&5
configure:3906: $? = 0
configure:3909: test -z || test ! -s conftest.err
configure:3912: $? = 0
configure:3915: test -s conftest.o
configure:3918: $? = 0
configure:3930: result: inline
configure:3963: checking for sys/types.h
configure:3979: gcc -c -g -O2 conftest.c >&5
configure:3985: $? = 0
configure:3988: test -z || test ! -s conftest.err
configure:3991: $? = 0
configure:3994: test -s conftest.o
configure:3997: $? = 0
configure:4008: result: yes
configure:3963: checking for sys/stat.h
configure:3979: gcc -c -g -O2 conftest.c >&5
configure:3985: $? = 0
configure:3988: test -z || test ! -s conftest.err
configure:3991: $? = 0
configure:3994: test -s conftest.o
configure:3997: $? = 0
configure:4008: result: yes
configure:3963: checking for stdlib.h
configure:3979: gcc -c -g -O2 conftest.c >&5
configure:3985: $? = 0
configure:3988: test -z || test ! -s conftest.err
configure:3991: $? = 0
configure:3994: test -s conftest.o
configure:3997: $? = 0
configure:4008: result: yes
configure:3963: checking for string.h
configure:3979: gcc -c -g -O2 conftest.c >&5
configure:3985: $? = 0
configure:3988: test -z || test ! -s conftest.err
configure:3991: $? = 0
configure:3994: test -s conftest.o
configure:3997: $? = 0
configure:4008: result: yes
configure:3963: checking for memory.h
configure:3979: gcc -c -g -O2 conftest.c >&5
configure:3985: $? = 0
configure:3988: test -z || test ! -s conftest.err
configure:3991: $? = 0
configure:3994: test -s conftest.o
configure:3997: $? = 0
configure:4008: result: yes
configure:3963: checking for strings.h
configure:3979: gcc -c -g -O2 conftest.c >&5
configure:3985: $? = 0
configure:3988: test -z || test ! -s conftest.err
configure:3991: $? = 0
configure:3994: test -s conftest.o
configure:3997: $? = 0
configure:4008: result: yes
configure:3963: checking for inttypes.h
configure:3979: gcc -c -g -O2 conftest.c >&5
configure:3985: $? = 0
configure:3988: test -z || test ! -s conftest.err
configure:3991: $? = 0
configure:3994: test -s conftest.o
configure:3997: $? = 0
configure:4008: result: yes
configure:3963: checking for stdint.h
configure:3979: gcc -c -g -O2 conftest.c >&5
configure:3985: $? = 0
configure:3988: test -z || test ! -s conftest.err
configure:3991: $? = 0
configure:3994: test -s conftest.o
configure:3997: $? = 0
configure:4008: result: yes
configure:3963: checking for unistd.h
configure:3979: gcc -c -g -O2 conftest.c >&5
configure:3985: $? = 0
configure:3988: test -z || test ! -s conftest.err
configure:3991: $? = 0
configure:3994: test -s conftest.o
configure:3997: $? = 0
configure:4008: result: yes
configure:4020: checking for off_t
configure:4044: gcc -c -g -O2 conftest.c >&5
configure:4050: $? = 0
configure:4053: test -z || test ! -s conftest.err
configure:4056: $? = 0
configure:4059: test -s conftest.o
configure:4062: $? = 0
configure:4073: result: yes
configure:4085: checking for size_t
configure:4109: gcc -c -g -O2 conftest.c >&5
configure:4115: $? = 0
configure:4118: test -z || test ! -s conftest.err
configure:4121: $? = 0
configure:4124: test -s conftest.o
configure:4127: $? = 0
configure:4138: result: yes
configure:4151: checking for long long
configure:4173: gcc -o conftest -g -O2 conftest.c >&5
configure:4179: $? = 0
configure:4182: test -z || test ! -s conftest.err
configure:4185: $? = 0
configure:4188: test -s conftest
configure:4191: $? = 0
configure:4203: result: yes
configure:4214: checking for long double
configure:4273: result: yes
configure:4284: checking for wchar_t
configure:4306: gcc -c -g -O2 conftest.c >&5
configure:4312: $? = 0
configure:4315: test -z || test ! -s conftest.err
configure:4318: $? = 0
configure:4321: test -s conftest.o
configure:4324: $? = 0
configure:4335: result: yes
configure:4346: checking for wint_t
configure:4368: gcc -c -g -O2 conftest.c >&5
configure:4374: $? = 0
configure:4377: test -z || test ! -s conftest.err
configure:4380: $? = 0
configure:4383: test -s conftest.o
configure:4386: $? = 0
configure:4397: result: yes
configure:4408: checking for inttypes.h
configure:4430: gcc -c -g -O2 conftest.c >&5
configure:4436: $? = 0
configure:4439: test -z || test ! -s conftest.err
configure:4442: $? = 0
configure:4445: test -s conftest.o
configure:4448: $? = 0
configure:4459: result: yes
configure:4470: checking for stdint.h
configure:4492: gcc -c -g -O2 conftest.c >&5
configure:4498: $? = 0
configure:4501: test -z || test ! -s conftest.err
configure:4504: $? = 0
configure:4507: test -s conftest.o
configure:4510: $? = 0
configure:4521: result: yes
configure:4534: checking for intmax_t
configure:4564: gcc -c -g -O2 conftest.c >&5
configure:4570: $? = 0
configure:4573: test -z || test ! -s conftest.err
configure:4576: $? = 0
configure:4579: test -s conftest.o
configure:4582: $? = 0
configure:4593: result: yes
configure:4605: checking whether printf() supports POSIX/XSI format strings
configure:4655: gcc -o conftest -g -O2 conftest.c >&5
configure:4658: $? = 0
configure:4660: ./conftest
configure:4663: $? = 0
configure:4678: result: yes
configure:4692: checking for working alloca.h
configure:4713: gcc -o conftest -g -O2 conftest.c >&5
configure:4719: $? = 0
configure:4722: test -z || test ! -s conftest.err
configure:4725: $? = 0
configure:4728: test -s conftest
configure:4731: $? = 0
configure:4743: result: yes
configure:4753: checking for alloca
configure:4794: gcc -o conftest -g -O2 conftest.c >&5
configure:4800: $? = 0
configure:4803: test -z || test ! -s conftest.err
configure:4806: $? = 0
configure:4809: test -s conftest
configure:4812: $? = 0
configure:4824: result: yes
configure:5052: checking for stdlib.h
configure:5057: result: yes
configure:5052: checking for unistd.h
configure:5057: result: yes
configure:5200: checking for getpagesize
configure:5257: gcc -o conftest -g -O2 conftest.c >&5
configure:5263: $? = 0
configure:5266: test -z || test ! -s conftest.err
configure:5269: $? = 0
configure:5272: test -s conftest
configure:5275: $? = 0
configure:5287: result: yes
configure:5297: checking for working mmap
configure:5439: gcc -o conftest -g -O2 conftest.c >&5
configure:5442: $? = 0
configure:5444: ./conftest
configure:5447: $? = 0
configure:5461: result: yes
configure:5473: checking whether we are using the GNU C Library 2.1 or newer
configure:5504: result: yes
configure:5512: checking whether integer division by zero raises SIGFPE
configure:5574: gcc -o conftest -g -O2 conftest.c >&5
configure:5577: $? = 0
configure:5579: ./conftest
configure:5582: $? = 0
configure:5597: result: yes
configure:5610: checking for unsigned long long
configure:5632: gcc -o conftest -g -O2 conftest.c >&5
configure:5638: $? = 0
configure:5641: test -z || test ! -s conftest.err
configure:5644: $? = 0
configure:5647: test -s conftest
configure:5650: $? = 0
configure:5662: result: yes
configure:5694: checking for inttypes.h
configure:5717: gcc -c -g -O2 conftest.c >&5
configure:5723: $? = 0
configure:5726: test -z || test ! -s conftest.err
configure:5729: $? = 0
configure:5732: test -s conftest.o
configure:5735: $? = 0
configure:5747: result: yes
configure:5760: checking whether the inttypes.h PRIxNN macros are broken
configure:5786: gcc -c -g -O2 conftest.c >&5
configure:5792: $? = 0
configure:5795: test -z || test ! -s conftest.err
configure:5798: $? = 0
configure:5801: test -s conftest.o
configure:5804: $? = 0
configure:5816: result: no
configure:5833: checking for stdint.h
configure:5838: result: yes
configure:5977: checking for SIZE_MAX
configure:7024: result: yes
configure:7041: checking for stdint.h
configure:7046: result: yes
configure:7226: checking for ld used by GCC
configure:7290: result: /usr/bin/ld
configure:7299: checking if the linker (/usr/bin/ld) is GNU ld
configure:7312: result: yes
configure:7318: checking for shared library run path origin
configure:7331: result: done
configure:7737: checking for ptrdiff_t
configure:7761: gcc -c -g -O2 conftest.c >&5
configure:7767: $? = 0
configure:7770: test -z || test ! -s conftest.err
configure:7773: $? = 0
configure:7776: test -s conftest.o
configure:7779: $? = 0
configure:7790: result: yes
configure:7827: checking argz.h usability
configure:7839: gcc -c -g -O2 conftest.c >&5
configure:7845: $? = 0
configure:7848: test -z || test ! -s conftest.err
configure:7851: $? = 0
configure:7854: test -s conftest.o
configure:7857: $? = 0
configure:7867: result: yes
configure:7871: checking argz.h presence
configure:7881: gcc -E conftest.c
configure:7887: $? = 0
configure:7907: result: yes
configure:7942: checking for argz.h
configure:7949: result: yes
configure:7827: checking limits.h usability
configure:7839: gcc -c -g -O2 conftest.c >&5
configure:7845: $? = 0
configure:7848: test -z || test ! -s conftest.err
configure:7851: $? = 0
configure:7854: test -s conftest.o
configure:7857: $? = 0
configure:7867: result: yes
configure:7871: checking limits.h presence
configure:7881: gcc -E conftest.c
configure:7887: $? = 0
configure:7907: result: yes
configure:7942: checking for limits.h
configure:7949: result: yes
configure:7827: checking locale.h usability
configure:7839: gcc -c -g -O2 conftest.c >&5
configure:7845: $? = 0
configure:7848: test -z || test ! -s conftest.err
configure:7851: $? = 0
configure:7854: test -s conftest.o
configure:7857: $? = 0
configure:7867: result: yes
configure:7871: checking locale.h presence
configure:7881: gcc -E conftest.c
configure:7887: $? = 0
configure:7907: result: yes
configure:7942: checking for locale.h
configure:7949: result: yes
configure:7827: checking nl_types.h usability
configure:7839: gcc -c -g -O2 conftest.c >&5
configure:7845: $? = 0
configure:7848: test -z || test ! -s conftest.err
configure:7851: $? = 0
configure:7854: test -s conftest.o
configure:7857: $? = 0
configure:7867: result: yes
configure:7871: checking nl_types.h presence
configure:7881: gcc -E conftest.c
configure:7887: $? = 0
configure:7907: result: yes
configure:7942: checking for nl_types.h
configure:7949: result: yes
configure:7827: checking malloc.h usability
configure:7839: gcc -c -g -O2 conftest.c >&5
configure:7845: $? = 0
configure:7848: test -z || test ! -s conftest.err
configure:7851: $? = 0
configure:7854: test -s conftest.o
configure:7857: $? = 0
configure:7867: result: yes
configure:7871: checking malloc.h presence
configure:7881: gcc -E conftest.c
configure:7887: $? = 0
configure:7907: result: yes
configure:7942: checking for malloc.h
configure:7949: result: yes
configure:7827: checking stddef.h usability
configure:7839: gcc -c -g -O2 conftest.c >&5
configure:7845: $? = 0
configure:7848: test -z || test ! -s conftest.err
configure:7851: $? = 0
configure:7854: test -s conftest.o
configure:7857: $? = 0
configure:7867: result: yes
configure:7871: checking stddef.h presence
configure:7881: gcc -E conftest.c
configure:7887: $? = 0
configure:7907: result: yes
configure:7942: checking for stddef.h
configure:7949: result: yes
configure:7818: checking for stdlib.h
configure:7823: result: yes
configure:7818: checking for string.h
configure:7823: result: yes
configure:7818: checking for unistd.h
configure:7823: result: yes
configure:7827: checking sys/param.h usability
configure:7839: gcc -c -g -O2 conftest.c >&5
configure:7845: $? = 0
configure:7848: test -z || test ! -s conftest.err
configure:7851: $? = 0
configure:7854: test -s conftest.o
configure:7857: $? = 0
configure:7867: result: yes
configure:7871: checking sys/param.h presence
configure:7881: gcc -E conftest.c
configure:7887: $? = 0
configure:7907: result: yes
configure:7942: checking for sys/param.h
configure:7949: result: yes
configure:7991: checking for asprintf
configure:8048: gcc -o conftest -g -O2 conftest.c >&5
configure:8054: $? = 0
configure:8057: test -z || test ! -s conftest.err
configure:8060: $? = 0
configure:8063: test -s conftest
configure:8066: $? = 0
configure:8078: result: yes
configure:7991: checking for fwprintf
configure:8048: gcc -o conftest -g -O2 conftest.c >&5
configure:8054: $? = 0
configure:8057: test -z || test ! -s conftest.err
configure:8060: $? = 0
configure:8063: test -s conftest
configure:8066: $? = 0
configure:8078: result: yes
configure:7991: checking for getcwd
configure:8048: gcc -o conftest -g -O2 conftest.c >&5
configure:8054: $? = 0
configure:8057: test -z || test ! -s conftest.err
configure:8060: $? = 0
configure:8063: test -s conftest
configure:8066: $? = 0
configure:8078: result: yes
configure:7991: checking for getegid
configure:8048: gcc -o conftest -g -O2 conftest.c >&5
configure:8054: $? = 0
configure:8057: test -z || test ! -s conftest.err
configure:8060: $? = 0
configure:8063: test -s conftest
configure:8066: $? = 0
configure:8078: result: yes
configure:7991: checking for geteuid
configure:8048: gcc -o conftest -g -O2 conftest.c >&5
configure:8054: $? = 0
configure:8057: test -z || test ! -s conftest.err
configure:8060: $? = 0
configure:8063: test -s conftest
configure:8066: $? = 0
configure:8078: result: yes
configure:7991: checking for getgid
configure:8048: gcc -o conftest -g -O2 conftest.c >&5
configure:8054: $? = 0
configure:8057: test -z || test ! -s conftest.err
configure:8060: $? = 0
configure:8063: test -s conftest
configure:8066: $? = 0
configure:8078: result: yes
configure:7991: checking for getuid
configure:8048: gcc -o conftest -g -O2 conftest.c >&5
configure:8054: $? = 0
configure:8057: test -z || test ! -s conftest.err
configure:8060: $? = 0
configure:8063: test -s conftest
configure:8066: $? = 0
configure:8078: result: yes
configure:7991: checking for mempcpy
configure:8048: gcc -o conftest -g -O2 conftest.c >&5
conftest.c:82: warning: conflicting types for built-in function 'mempcpy'
configure:8054: $? = 0
configure:8057: test -z || test ! -s conftest.err
configure:8060: $? = 0
configure:8063: test -s conftest
configure:8066: $? = 0
configure:8078: result: yes
configure:7991: checking for munmap
configure:8048: gcc -o conftest -g -O2 conftest.c >&5
configure:8054: $? = 0
configure:8057: test -z || test ! -s conftest.err
configure:8060: $? = 0
configure:8063: test -s conftest
configure:8066: $? = 0
configure:8078: result: yes
configure:7991: checking for putenv
configure:8048: gcc -o conftest -g -O2 conftest.c >&5
configure:8054: $? = 0
configure:8057: test -z || test ! -s conftest.err
configure:8060: $? = 0
configure:8063: test -s conftest
configure:8066: $? = 0
configure:8078: result: yes
configure:7991: checking for setenv
configure:8048: gcc -o conftest -g -O2 conftest.c >&5
configure:8054: $? = 0
configure:8057: test -z || test ! -s conftest.err
configure:8060: $? = 0
configure:8063: test -s conftest
configure:8066: $? = 0
configure:8078: result: yes
configure:7991: checking for setlocale
configure:8048: gcc -o conftest -g -O2 conftest.c >&5
configure:8054: $? = 0
configure:8057: test -z || test ! -s conftest.err
configure:8060: $? = 0
configure:8063: test -s conftest
configure:8066: $? = 0
configure:8078: result: yes
configure:7991: checking for snprintf
configure:8048: gcc -o conftest -g -O2 conftest.c >&5
conftest.c:87: warning: conflicting types for built-in function 'snprintf'
configure:8054: $? = 0
configure:8057: test -z || test ! -s conftest.err
configure:8060: $? = 0
configure:8063: test -s conftest
configure:8066: $? = 0
configure:8078: result: yes
configure:7991: checking for stpcpy
configure:8048: gcc -o conftest -g -O2 conftest.c >&5
conftest.c:88: warning: conflicting types for built-in function 'stpcpy'
configure:8054: $? = 0
configure:8057: test -z || test ! -s conftest.err
configure:8060: $? = 0
configure:8063: test -s conftest
configure:8066: $? = 0
configure:8078: result: yes
configure:7991: checking for strcasecmp
configure:8048: gcc -o conftest -g -O2 conftest.c >&5
configure:8054: $? = 0
configure:8057: test -z || test ! -s conftest.err
configure:8060: $? = 0
configure:8063: test -s conftest
configure:8066: $? = 0
configure:8078: result: yes
configure:7991: checking for strdup
configure:8048: gcc -o conftest -g -O2 conftest.c >&5
conftest.c:90: warning: conflicting types for built-in function 'strdup'
configure:8054: $? = 0
configure:8057: test -z || test ! -s conftest.err
configure:8060: $? = 0
configure:8063: test -s conftest
configure:8066: $? = 0
configure:8078: result: yes
configure:7991: checking for strtoul
configure:8048: gcc -o conftest -g -O2 conftest.c >&5
configure:8054: $? = 0
configure:8057: test -z || test ! -s conftest.err
configure:8060: $? = 0
configure:8063: test -s conftest
configure:8066: $? = 0
configure:8078: result: yes
configure:7991: checking for tsearch
configure:8048: gcc -o conftest -g -O2 conftest.c >&5
configure:8054: $? = 0
configure:8057: test -z || test ! -s conftest.err
configure:8060: $? = 0
configure:8063: test -s conftest
configure:8066: $? = 0
configure:8078: result: yes
configure:7991: checking for wcslen
configure:8048: gcc -o conftest -g -O2 conftest.c >&5
configure:8054: $? = 0
configure:8057: test -z || test ! -s conftest.err
configure:8060: $? = 0
configure:8063: test -s conftest
configure:8066: $? = 0
configure:8078: result: yes
configure:7991: checking for __argz_count
configure:8048: gcc -o conftest -g -O2 conftest.c >&5
configure:8054: $? = 0
configure:8057: test -z || test ! -s conftest.err
configure:8060: $? = 0
configure:8063: test -s conftest
configure:8066: $? = 0
configure:8078: result: yes
configure:7991: checking for __argz_stringify
configure:8048: gcc -o conftest -g -O2 conftest.c >&5
configure:8054: $? = 0
configure:8057: test -z || test ! -s conftest.err
configure:8060: $? = 0
configure:8063: test -s conftest
configure:8066: $? = 0
configure:8078: result: yes
configure:7991: checking for __argz_next
configure:8048: gcc -o conftest -g -O2 conftest.c >&5
configure:8054: $? = 0
configure:8057: test -z || test ! -s conftest.err
configure:8060: $? = 0
configure:8063: test -s conftest
configure:8066: $? = 0
configure:8078: result: yes
configure:7991: checking for __fsetlocking
configure:8048: gcc -o conftest -g -O2 conftest.c >&5
configure:8054: $? = 0
configure:8057: test -z || test ! -s conftest.err
configure:8060: $? = 0
configure:8063: test -s conftest
configure:8066: $? = 0
configure:8078: result: yes
configure:8090: checking whether _snprintf is declared
configure:8115: gcc -c -g -O2 conftest.c >&5
conftest.c: In function 'main':
conftest.c:80: error: '_snprintf' undeclared (first use in this function)
conftest.c:80: error: (Each undeclared identifier is reported only once
conftest.c:80: error: for each function it appears in.)
configure:8121: $? = 1
configure: failed program was:
| /* confdefs.h. */
|
| #define PACKAGE_NAME ""
| #define PACKAGE_TARNAME ""
| #define PACKAGE_VERSION ""
| #define PACKAGE_STRING ""
| #define PACKAGE_BUGREPORT ""
| #define ENC_VERSION "2.38"
| #define ENC_PACKAGE "gaim-encryption"
| #define STDC_HEADERS 1
| #define HAVE_SYS_TYPES_H 1
| #define HAVE_SYS_STAT_H 1
| #define HAVE_STDLIB_H 1
| #define HAVE_STRING_H 1
| #define HAVE_MEMORY_H 1
| #define HAVE_STRINGS_H 1
| #define HAVE_INTTYPES_H 1
| #define HAVE_STDINT_H 1
| #define HAVE_UNISTD_H 1
| #define HAVE_LONG_LONG 1
| #define HAVE_LONG_DOUBLE 1
| #define HAVE_WCHAR_T 1
| #define HAVE_WINT_T 1
| #define HAVE_INTTYPES_H_WITH_UINTMAX 1
| #define HAVE_STDINT_H_WITH_UINTMAX 1
| #define HAVE_INTMAX_T 1
| #define HAVE_POSIX_PRINTF 1
| #define HAVE_ALLOCA_H 1
| #define HAVE_ALLOCA 1
| #define HAVE_STDLIB_H 1
| #define HAVE_UNISTD_H 1
| #define HAVE_GETPAGESIZE 1
| #define HAVE_MMAP 1
| #define INTDIV0_RAISES_SIGFPE 1
| #define HAVE_UNSIGNED_LONG_LONG 1
| #define HAVE_UINTMAX_T 1
| #define HAVE_INTTYPES_H 1
| #define HAVE_STDINT_H 1
| #define HAVE_STDINT_H 1
| #define HAVE_ARGZ_H 1
| #define HAVE_LIMITS_H 1
| #define HAVE_LOCALE_H 1
| #define HAVE_NL_TYPES_H 1
| #define HAVE_MALLOC_H 1
| #define HAVE_STDDEF_H 1
| #define HAVE_STDLIB_H 1
| #define HAVE_STRING_H 1
| #define HAVE_UNISTD_H 1
| #define HAVE_SYS_PARAM_H 1
| #define HAVE_ASPRINTF 1
| #define HAVE_FWPRINTF 1
| #define HAVE_GETCWD 1
| #define HAVE_GETEGID 1
| #define HAVE_GETEUID 1
| #define HAVE_GETGID 1
| #define HAVE_GETUID 1
| #define HAVE_MEMPCPY 1
| #define HAVE_MUNMAP 1
| #define HAVE_PUTENV 1
| #define HAVE_SETENV 1
| #define HAVE_SETLOCALE 1
| #define HAVE_SNPRINTF 1
| #define HAVE_STPCPY 1
| #define HAVE_STRCASECMP 1
| #define HAVE_STRDUP 1
| #define HAVE_STRTOUL 1
| #define HAVE_TSEARCH 1
| #define HAVE_WCSLEN 1
| #define HAVE___ARGZ_COUNT 1
| #define HAVE___ARGZ_STRINGIFY 1
| #define HAVE___ARGZ_NEXT 1
| #define HAVE___FSETLOCKING 1
| /* end confdefs.h. */
| #include <stdio.h>
| int
| main ()
| {
|
| #ifndef _snprintf
| char *p = (char *) _snprintf;
| #endif
|
| ;
| return 0;
| }
configure:8144: result: no
configure:8158: checking whether _snwprintf is declared
configure:8183: gcc -c -g -O2 conftest.c >&5
conftest.c: In function 'main':
conftest.c:81: error: '_snwprintf' undeclared (first use in this function)
conftest.c:81: error: (Each undeclared identifier is reported only once
conftest.c:81: error: for each function it appears in.)
configure:8189: $? = 1
configure: failed program was:
| /* confdefs.h. */
|
| #define PACKAGE_NAME ""
| #define PACKAGE_TARNAME ""
| #define PACKAGE_VERSION ""
| #define PACKAGE_STRING ""
| #define PACKAGE_BUGREPORT ""
| #define ENC_VERSION "2.38"
| #define ENC_PACKAGE "gaim-encryption"
| #define STDC_HEADERS 1
| #define HAVE_SYS_TYPES_H 1
| #define HAVE_SYS_STAT_H 1
| #define HAVE_STDLIB_H 1
| #define HAVE_STRING_H 1
| #define HAVE_MEMORY_H 1
| #define HAVE_STRINGS_H 1
| #define HAVE_INTTYPES_H 1
| #define HAVE_STDINT_H 1
| #define HAVE_UNISTD_H 1
| #define HAVE_LONG_LONG 1
| #define HAVE_LONG_DOUBLE 1
| #define HAVE_WCHAR_T 1
| #define HAVE_WINT_T 1
| #define HAVE_INTTYPES_H_WITH_UINTMAX 1
| #define HAVE_STDINT_H_WITH_UINTMAX 1
| #define HAVE_INTMAX_T 1
| #define HAVE_POSIX_PRINTF 1
| #define HAVE_ALLOCA_H 1
| #define HAVE_ALLOCA 1
| #define HAVE_STDLIB_H 1
| #define HAVE_UNISTD_H 1
| #define HAVE_GETPAGESIZE 1
| #define HAVE_MMAP 1
| #define INTDIV0_RAISES_SIGFPE 1
| #define HAVE_UNSIGNED_LONG_LONG 1
| #define HAVE_UINTMAX_T 1
| #define HAVE_INTTYPES_H 1
| #define HAVE_STDINT_H 1
| #define HAVE_STDINT_H 1
| #define HAVE_ARGZ_H 1
| #define HAVE_LIMITS_H 1
| #define HAVE_LOCALE_H 1
| #define HAVE_NL_TYPES_H 1
| #define HAVE_MALLOC_H 1
| #define HAVE_STDDEF_H 1
| #define HAVE_STDLIB_H 1
| #define HAVE_STRING_H 1
| #define HAVE_UNISTD_H 1
| #define HAVE_SYS_PARAM_H 1
| #define HAVE_ASPRINTF 1
| #define HAVE_FWPRINTF 1
| #define HAVE_GETCWD 1
| #define HAVE_GETEGID 1
| #define HAVE_GETEUID 1
| #define HAVE_GETGID 1
| #define HAVE_GETUID 1
| #define HAVE_MEMPCPY 1
| #define HAVE_MUNMAP 1
| #define HAVE_PUTENV 1
| #define HAVE_SETENV 1
| #define HAVE_SETLOCALE 1
| #define HAVE_SNPRINTF 1
| #define HAVE_STPCPY 1
| #define HAVE_STRCASECMP 1
| #define HAVE_STRDUP 1
| #define HAVE_STRTOUL 1
| #define HAVE_TSEARCH 1
| #define HAVE_WCSLEN 1
| #define HAVE___ARGZ_COUNT 1
| #define HAVE___ARGZ_STRINGIFY 1
| #define HAVE___ARGZ_NEXT 1
| #define HAVE___FSETLOCKING 1
| #define HAVE_DECL__SNPRINTF 0
| /* end confdefs.h. */
| #include <stdio.h>
| int
| main ()
| {
|
| #ifndef _snwprintf
| char *p = (char *) _snwprintf;
| #endif
|
| ;
| return 0;
| }
configure:8212: result: no
configure:8227: checking whether feof_unlocked is declared
configure:8252: gcc -c -g -O2 conftest.c >&5
configure:8258: $? = 0
configure:8261: test -z || test ! -s conftest.err
configure:8264: $? = 0
configure:8267: test -s conftest.o
configure:8270: $? = 0
configure:8281: result: yes
configure:8295: checking whether fgets_unlocked is declared
configure:8320: gcc -c -g -O2 conftest.c >&5
conftest.c: In function 'main':
conftest.c:83: error: 'fgets_unlocked' undeclared (first use in this function)
conftest.c:83: error: (Each undeclared identifier is reported only once
conftest.c:83: error: for each function it appears in.)
configure:8326: $? = 1
configure: failed program was:
| /* confdefs.h. */
|
| #define PACKAGE_NAME ""
| #define PACKAGE_TARNAME ""
| #define PACKAGE_VERSION ""
| #define PACKAGE_STRING ""
| #define PACKAGE_BUGREPORT ""
| #define ENC_VERSION "2.38"
| #define ENC_PACKAGE "gaim-encryption"
| #define STDC_HEADERS 1
| #define HAVE_SYS_TYPES_H 1
| #define HAVE_SYS_STAT_H 1
| #define HAVE_STDLIB_H 1
| #define HAVE_STRING_H 1
| #define HAVE_MEMORY_H 1
| #define HAVE_STRINGS_H 1
| #define HAVE_INTTYPES_H 1
| #define HAVE_STDINT_H 1
| #define HAVE_UNISTD_H 1
| #define HAVE_LONG_LONG 1
| #define HAVE_LONG_DOUBLE 1
| #define HAVE_WCHAR_T 1
| #define HAVE_WINT_T 1
| #define HAVE_INTTYPES_H_WITH_UINTMAX 1
| #define HAVE_STDINT_H_WITH_UINTMAX 1
| #define HAVE_INTMAX_T 1
| #define HAVE_POSIX_PRINTF 1
| #define HAVE_ALLOCA_H 1
| #define HAVE_ALLOCA 1
| #define HAVE_STDLIB_H 1
| #define HAVE_UNISTD_H 1
| #define HAVE_GETPAGESIZE 1
| #define HAVE_MMAP 1
| #define INTDIV0_RAISES_SIGFPE 1
| #define HAVE_UNSIGNED_LONG_LONG 1
| #define HAVE_UINTMAX_T 1
| #define HAVE_INTTYPES_H 1
| #define HAVE_STDINT_H 1
| #define HAVE_STDINT_H 1
| #define HAVE_ARGZ_H 1
| #define HAVE_LIMITS_H 1
| #define HAVE_LOCALE_H 1
| #define HAVE_NL_TYPES_H 1
| #define HAVE_MALLOC_H 1
| #define HAVE_STDDEF_H 1
| #define HAVE_STDLIB_H 1
| #define HAVE_STRING_H 1
| #define HAVE_UNISTD_H 1
| #define HAVE_SYS_PARAM_H 1
| #define HAVE_ASPRINTF 1
| #define HAVE_FWPRINTF 1
| #define HAVE_GETCWD 1
| #define HAVE_GETEGID 1
| #define HAVE_GETEUID 1
| #define HAVE_GETGID 1
| #define HAVE_GETUID 1
| #define HAVE_MEMPCPY 1
| #define HAVE_MUNMAP 1
| #define HAVE_PUTENV 1
| #define HAVE_SETENV 1
| #define HAVE_SETLOCALE 1
| #define HAVE_SNPRINTF 1
| #define HAVE_STPCPY 1
| #define HAVE_STRCASECMP 1
| #define HAVE_STRDUP 1
| #define HAVE_STRTOUL 1
| #define HAVE_TSEARCH 1
| #define HAVE_WCSLEN 1
| #define HAVE___ARGZ_COUNT 1
| #define HAVE___ARGZ_STRINGIFY 1
| #define HAVE___ARGZ_NEXT 1
| #define HAVE___FSETLOCKING 1
| #define HAVE_DECL__SNPRINTF 0
| #define HAVE_DECL__SNWPRINTF 0
| #define HAVE_DECL_FEOF_UNLOCKED 1
| /* end confdefs.h. */
| #include <stdio.h>
| int
| main ()
| {
|
| #ifndef fgets_unlocked
| char *p = (char *) fgets_unlocked;
| #endif
|
| ;
| return 0;
| }
configure:8349: result: no
configure:8363: checking whether getc_unlocked is declared
configure:8388: gcc -c -g -O2 conftest.c >&5
configure:8394: $? = 0
configure:8397: test -z || test ! -s conftest.err
configure:8400: $? = 0
configure:8403: test -s conftest.o
configure:8406: $? = 0
configure:8417: result: yes
configure:8485: checking for iconv
configure:8512: gcc -o conftest -g -O2 conftest.c >&5
configure:8518: $? = 0
configure:8521: test -z || test ! -s conftest.err
configure:8524: $? = 0
configure:8527: test -s conftest
configure:8530: $? = 0
configure:8595: result: yes
configure:8618: checking for iconv declaration
configure:8652: gcc -c -g -O2 conftest.c >&5
configure:8658: $? = 0
configure:8661: test -z || test ! -s conftest.err
configure:8664: $? = 0
configure:8667: test -s conftest.o
configure:8670: $? = 0
configure:8685: result:
extern size_t iconv (iconv_t cd, char * *inbuf, size_t *inbytesleft, char * *outbuf, size_t *outbytesleft);
configure:8696: checking for nl_langinfo and CODESET
configure:8717: gcc -o conftest -g -O2 conftest.c >&5
configure:8723: $? = 0
configure:8726: test -z || test ! -s conftest.err
configure:8729: $? = 0
configure:8732: test -s conftest
configure:8735: $? = 0
configure:8748: result: yes
configure:8760: checking for LC_MESSAGES
configure:8781: gcc -o conftest -g -O2 conftest.c >&5
configure:8787: $? = 0
configure:8790: test -z || test ! -s conftest.err
configure:8793: $? = 0
configure:8796: test -s conftest
configure:8799: $? = 0
configure:8811: result: yes
configure:8827: checking for bison
configure:8856: result: no
configure:8897: checking whether NLS is requested
configure:8906: result: yes
configure:8922: checking whether included gettext is requested
configure:8932: result: no
configure:8943: checking for GNU gettext in libc
configure:8967: gcc -o conftest -g -O2 conftest.c >&5
configure:8973: $? = 0
configure:8976: test -z || test ! -s conftest.err
configure:8979: $? = 0
configure:8982: test -s conftest
configure:8985: $? = 0
configure:8997: result: yes
configure:9548: checking whether to use NLS
configure:9550: result: yes
configure:9553: checking where the gettext function comes from
configure:9564: result: libc
configure:9716: checking for gcc
configure:9742: result: gcc
configure:9986: checking for C compiler version
configure:9989: gcc --version </dev/null >&5
gcc (GCC) 4.0.3 (Ubuntu 4.0.3-1ubuntu5)
Copyright (C) 2006 Free Software Foundation, Inc.
This is free software; see the source for copying conditions. There is NO
warranty; not even for MERCHANTABILITY or FITNESS FOR A PARTICULAR PURPOSE.
configure:9992: $? = 0
configure:9994: gcc -v </dev/null >&5
Using built-in specs.
Target: i486-linux-gnu
Configured with: ../src/configure -v --enable-languages=c,c++,java,f95,objc,ada,treelang --prefix=/usr --enable-shared --with-system-zlib --libexecdir=/usr/lib --without-included-gettext --enable-threads=posix --enable-nls --program-suffix=-4.0 --enable-__cxa_atexit --enable-clocale=gnu --enable-libstdcxx-debug --enable-java-awt=gtk-default --enable-gtk-cairo --with-java-home=/usr/lib/jvm/java-1.4.2-gcj-4.0-1.4.2.0/jre --enable-mpfr --disable-werror --with-tune=pentium4 --enable-checking=release i486-linux-gnu
Thread model: posix
gcc version 4.0.3 (Ubuntu 4.0.3-1ubuntu5)
configure:9997: $? = 0
configure:9999: gcc -V </dev/null >&5
gcc: '-V' option must have argument
configure:10002: $? = 1
configure:10005: checking whether we are using the GNU C compiler
configure:10060: result: yes
configure:10066: checking whether gcc accepts -g
configure:10116: result: yes
configure:10133: checking for gcc option to accept ANSI C
configure:10239: result: none needed
configure:10257: gcc -c -g -O2 conftest.c >&5
conftest.c:2: error: syntax error before 'me'
configure:10263: $? = 1
configure: failed program was:
| #ifndef __cplusplus
| choke me
| #endif
configure:10665: checking for pkg-config
configure:10683: found /usr/bin/pkg-config
configure:10696: result: /usr/bin/pkg-config
configure:10713: checking for gaim
configure:10717: result: yes
configure:10721: checking GAIM_CFLAGS
configure:10724: result: -I/usr/include/gaim -I/usr/include/glib-2.0 -I/usr/lib/glib-2.0/include
configure:10727: checking GAIM_LIBS
configure:10730: result: -lglib-2.0
configure:10937: checking for Mozilla nspr4 includes in /usr/include/mozilla/nspr
configure:10939: result:
configure:10957: checking nspr.h usability
configure:10969: gcc -c -g -O2 -I/usr/include/mozilla/nspr conftest.c >&5
conftest.c:121:18: error: nspr.h: No such file or directory
configure:10975: $? = 1
configure: failed program was:
| /* confdefs.h. */
|
| #define PACKAGE_NAME ""
| #define PACKAGE_TARNAME ""
| #define PACKAGE_VERSION ""
| #define PACKAGE_STRING ""
| #define PACKAGE_BUGREPORT ""
| #define ENC_VERSION "2.38"
| #define ENC_PACKAGE "gaim-encryption"
| #define STDC_HEADERS 1
| #define HAVE_SYS_TYPES_H 1
| #define HAVE_SYS_STAT_H 1
| #define HAVE_STDLIB_H 1
| #define HAVE_STRING_H 1
| #define HAVE_MEMORY_H 1
| #define HAVE_STRINGS_H 1
| #define HAVE_INTTYPES_H 1
| #define HAVE_STDINT_H 1
| #define HAVE_UNISTD_H 1
| #define HAVE_LONG_LONG 1
| #define HAVE_LONG_DOUBLE 1
| #define HAVE_WCHAR_T 1
| #define HAVE_WINT_T 1
| #define HAVE_INTTYPES_H_WITH_UINTMAX 1
| #define HAVE_STDINT_H_WITH_UINTMAX 1
| #define HAVE_INTMAX_T 1
| #define HAVE_POSIX_PRINTF 1
| #define HAVE_ALLOCA_H 1
| #define HAVE_ALLOCA 1
| #define HAVE_STDLIB_H 1
| #define HAVE_UNISTD_H 1
| #define HAVE_GETPAGESIZE 1
| #define HAVE_MMAP 1
| #define INTDIV0_RAISES_SIGFPE 1
| #define HAVE_UNSIGNED_LONG_LONG 1
| #define HAVE_UINTMAX_T 1
| #define HAVE_INTTYPES_H 1
| #define HAVE_STDINT_H 1
| #define HAVE_STDINT_H 1
| #define HAVE_ARGZ_H 1
| #define HAVE_LIMITS_H 1
| #define HAVE_LOCALE_H 1
| #define HAVE_NL_TYPES_H 1
| #define HAVE_MALLOC_H 1
| #define HAVE_STDDEF_H 1
| #define HAVE_STDLIB_H 1
| #define HAVE_STRING_H 1
| #define HAVE_UNISTD_H 1
| #define HAVE_SYS_PARAM_H 1
| #define HAVE_ASPRINTF 1
| #define HAVE_FWPRINTF 1
| #define HAVE_GETCWD 1
| #define HAVE_GETEGID 1
| #define HAVE_GETEUID 1
| #define HAVE_GETGID 1
| #define HAVE_GETUID 1
| #define HAVE_MEMPCPY 1
| #define HAVE_MUNMAP 1
| #define HAVE_PUTENV 1
| #define HAVE_SETENV 1
| #define HAVE_SETLOCALE 1
| #define HAVE_SNPRINTF 1
| #define HAVE_STPCPY 1
| #define HAVE_STRCASECMP 1
| #define HAVE_STRDUP 1
| #define HAVE_STRTOUL 1
| #define HAVE_TSEARCH 1
| #define HAVE_WCSLEN 1
| #define HAVE___ARGZ_COUNT 1
| #define HAVE___ARGZ_STRINGIFY 1
| #define HAVE___ARGZ_NEXT 1
| #define HAVE___FSETLOCKING 1
| #define HAVE_DECL__SNPRINTF 0
| #define HAVE_DECL__SNWPRINTF 0
| #define HAVE_DECL_FEOF_UNLOCKED 1
| #define HAVE_DECL_FGETS_UNLOCKED 0
| #define HAVE_DECL_GETC_UNLOCKED 1
| #define HAVE_ICONV 1
| #define ICONV_CONST
| #define HAVE_LANGINFO_CODESET 1
| #define HAVE_LC_MESSAGES 1
| #define ENABLE_NLS 1
| #define HAVE_GETTEXT 1
| #define HAVE_DCGETTEXT 1
| #define HAVE_GAIM 1
| /* end confdefs.h. */
| #include <stdio.h>
| #if HAVE_SYS_TYPES_H
| # include <sys/types.h>
| #endif
| #if HAVE_SYS_STAT_H
| # include <sys/stat.h>
| #endif
| #if STDC_HEADERS
| # include <stdlib.h>
| # include <stddef.h>
| #else
| # if HAVE_STDLIB_H
| # include <stdlib.h>
| # endif
| #endif
| #if HAVE_STRING_H
| # if !STDC_HEADERS && HAVE_MEMORY_H
| # include <memory.h>
| # endif
| # include <string.h>
| #endif
| #if HAVE_STRINGS_H
| # include <strings.h>
| #endif
| #if HAVE_INTTYPES_H
| # include <inttypes.h>
| #else
| # if HAVE_STDINT_H
| # include <stdint.h>
| # endif
| #endif
| #if HAVE_UNISTD_H
| # include <unistd.h>
| #endif
| #include <nspr.h>
configure:10997: result: no
configure:11001: checking nspr.h presence
configure:11011: gcc -E -I/usr/include/mozilla/nspr conftest.c
conftest.c:87:18: error: nspr.h: No such file or directory
configure:11017: $? = 1
configure: failed program was:
| /* confdefs.h. */
|
| #define PACKAGE_NAME ""
| #define PACKAGE_TARNAME ""
| #define PACKAGE_VERSION ""
| #define PACKAGE_STRING ""
| #define PACKAGE_BUGREPORT ""
| #define ENC_VERSION "2.38"
| #define ENC_PACKAGE "gaim-encryption"
| #define STDC_HEADERS 1
| #define HAVE_SYS_TYPES_H 1
| #define HAVE_SYS_STAT_H 1
| #define HAVE_STDLIB_H 1
| #define HAVE_STRING_H 1
| #define HAVE_MEMORY_H 1
| #define HAVE_STRINGS_H 1
| #define HAVE_INTTYPES_H 1
| #define HAVE_STDINT_H 1
| #define HAVE_UNISTD_H 1
| #define HAVE_LONG_LONG 1
| #define HAVE_LONG_DOUBLE 1
| #define HAVE_WCHAR_T 1
| #define HAVE_WINT_T 1
| #define HAVE_INTTYPES_H_WITH_UINTMAX 1
| #define HAVE_STDINT_H_WITH_UINTMAX 1
| #define HAVE_INTMAX_T 1
| #define HAVE_POSIX_PRINTF 1
| #define HAVE_ALLOCA_H 1
| #define HAVE_ALLOCA 1
| #define HAVE_STDLIB_H 1
| #define HAVE_UNISTD_H 1
| #define HAVE_GETPAGESIZE 1
| #define HAVE_MMAP 1
| #define INTDIV0_RAISES_SIGFPE 1
| #define HAVE_UNSIGNED_LONG_LONG 1
| #define HAVE_UINTMAX_T 1
| #define HAVE_INTTYPES_H 1
| #define HAVE_STDINT_H 1
| #define HAVE_STDINT_H 1
| #define HAVE_ARGZ_H 1
| #define HAVE_LIMITS_H 1
| #define HAVE_LOCALE_H 1
| #define HAVE_NL_TYPES_H 1
| #define HAVE_MALLOC_H 1
| #define HAVE_STDDEF_H 1
| #define HAVE_STDLIB_H 1
| #define HAVE_STRING_H 1
| #define HAVE_UNISTD_H 1
| #define HAVE_SYS_PARAM_H 1
| #define HAVE_ASPRINTF 1
| #define HAVE_FWPRINTF 1
| #define HAVE_GETCWD 1
| #define HAVE_GETEGID 1
| #define HAVE_GETEUID 1
| #define HAVE_GETGID 1
| #define HAVE_GETUID 1
| #define HAVE_MEMPCPY 1
| #define HAVE_MUNMAP 1
| #define HAVE_PUTENV 1
| #define HAVE_SETENV 1
| #define HAVE_SETLOCALE 1
| #define HAVE_SNPRINTF 1
| #define HAVE_STPCPY 1
| #define HAVE_STRCASECMP 1
| #define HAVE_STRDUP 1
| #define HAVE_STRTOUL 1
| #define HAVE_TSEARCH 1
| #define HAVE_WCSLEN 1
| #define HAVE___ARGZ_COUNT 1
| #define HAVE___ARGZ_STRINGIFY 1
| #define HAVE___ARGZ_NEXT 1
| #define HAVE___FSETLOCKING 1
| #define HAVE_DECL__SNPRINTF 0
| #define HAVE_DECL__SNWPRINTF 0
| #define HAVE_DECL_FEOF_UNLOCKED 1
| #define HAVE_DECL_FGETS_UNLOCKED 0
| #define HAVE_DECL_GETC_UNLOCKED 1
| #define HAVE_ICONV 1
| #define ICONV_CONST
| #define HAVE_LANGINFO_CODESET 1
| #define HAVE_LC_MESSAGES 1
| #define ENABLE_NLS 1
| #define HAVE_GETTEXT 1
| #define HAVE_DCGETTEXT 1
| #define HAVE_GAIM 1
| /* end confdefs.h. */
| #include <nspr.h>
configure:11037: result: no
configure:11072: checking for nspr.h
configure:11079: result: no
configure:10957: checking prio.h usability
configure:10969: gcc -c -g -O2 -I/usr/include/mozilla/nspr conftest.c >&5
conftest.c:121:18: error: prio.h: No such file or directory
configure:10975: $? = 1
configure: failed program was:
| /* confdefs.h. */
|
| #define PACKAGE_NAME ""
| #define PACKAGE_TARNAME ""
| #define PACKAGE_VERSION ""
| #define PACKAGE_STRING ""
| #define PACKAGE_BUGREPORT ""
| #define ENC_VERSION "2.38"
| #define ENC_PACKAGE "gaim-encryption"
| #define STDC_HEADERS 1
| #define HAVE_SYS_TYPES_H 1
| #define HAVE_SYS_STAT_H 1
| #define HAVE_STDLIB_H 1
| #define HAVE_STRING_H 1
| #define HAVE_MEMORY_H 1
| #define HAVE_STRINGS_H 1
| #define HAVE_INTTYPES_H 1
| #define HAVE_STDINT_H 1
| #define HAVE_UNISTD_H 1
| #define HAVE_LONG_LONG 1
| #define HAVE_LONG_DOUBLE 1
| #define HAVE_WCHAR_T 1
| #define HAVE_WINT_T 1
| #define HAVE_INTTYPES_H_WITH_UINTMAX 1
| #define HAVE_STDINT_H_WITH_UINTMAX 1
| #define HAVE_INTMAX_T 1
| #define HAVE_POSIX_PRINTF 1
| #define HAVE_ALLOCA_H 1
| #define HAVE_ALLOCA 1
| #define HAVE_STDLIB_H 1
| #define HAVE_UNISTD_H 1
| #define HAVE_GETPAGESIZE 1
| #define HAVE_MMAP 1
| #define INTDIV0_RAISES_SIGFPE 1
| #define HAVE_UNSIGNED_LONG_LONG 1
| #define HAVE_UINTMAX_T 1
| #define HAVE_INTTYPES_H 1
| #define HAVE_STDINT_H 1
| #define HAVE_STDINT_H 1
| #define HAVE_ARGZ_H 1
| #define HAVE_LIMITS_H 1
| #define HAVE_LOCALE_H 1
| #define HAVE_NL_TYPES_H 1
| #define HAVE_MALLOC_H 1
| #define HAVE_STDDEF_H 1
| #define HAVE_STDLIB_H 1
| #define HAVE_STRING_H 1
| #define HAVE_UNISTD_H 1
| #define HAVE_SYS_PARAM_H 1
| #define HAVE_ASPRINTF 1
| #define HAVE_FWPRINTF 1
| #define HAVE_GETCWD 1
| #define HAVE_GETEGID 1
| #define HAVE_GETEUID 1
| #define HAVE_GETGID 1
| #define HAVE_GETUID 1
| #define HAVE_MEMPCPY 1
| #define HAVE_MUNMAP 1
| #define HAVE_PUTENV 1
| #define HAVE_SETENV 1
| #define HAVE_SETLOCALE 1
| #define HAVE_SNPRINTF 1
| #define HAVE_STPCPY 1
| #define HAVE_STRCASECMP 1
| #define HAVE_STRDUP 1
| #define HAVE_STRTOUL 1
| #define HAVE_TSEARCH 1
| #define HAVE_WCSLEN 1
| #define HAVE___ARGZ_COUNT 1
| #define HAVE___ARGZ_STRINGIFY 1
| #define HAVE___ARGZ_NEXT 1
| #define HAVE___FSETLOCKING 1
| #define HAVE_DECL__SNPRINTF 0
| #define HAVE_DECL__SNWPRINTF 0
| #define HAVE_DECL_FEOF_UNLOCKED 1
| #define HAVE_DECL_FGETS_UNLOCKED 0
| #define HAVE_DECL_GETC_UNLOCKED 1
| #define HAVE_ICONV 1
| #define ICONV_CONST
| #define HAVE_LANGINFO_CODESET 1
| #define HAVE_LC_MESSAGES 1
| #define ENABLE_NLS 1
| #define HAVE_GETTEXT 1
| #define HAVE_DCGETTEXT 1
| #define HAVE_GAIM 1
| /* end confdefs.h. */
| #include <stdio.h>
| #if HAVE_SYS_TYPES_H
| # include <sys/types.h>
| #endif
| #if HAVE_SYS_STAT_H
| # include <sys/stat.h>
| #endif
| #if STDC_HEADERS
| # include <stdlib.h>
| # include <stddef.h>
| #else
| # if HAVE_STDLIB_H
| # include <stdlib.h>
| # endif
| #endif
| #if HAVE_STRING_H
| # if !STDC_HEADERS && HAVE_MEMORY_H
| # include <memory.h>
| # endif
| # include <string.h>
| #endif
| #if HAVE_STRINGS_H
| # include <strings.h>
| #endif
| #if HAVE_INTTYPES_H
| # include <inttypes.h>
| #else
| # if HAVE_STDINT_H
| # include <stdint.h>
| # endif
| #endif
| #if HAVE_UNISTD_H
| # include <unistd.h>
| #endif
| #include <prio.h>
configure:10997: result: no
configure:11001: checking prio.h presence
configure:11011: gcc -E -I/usr/include/mozilla/nspr conftest.c
conftest.c:87:18: error: prio.h: No such file or directory
configure:11017: $? = 1
configure: failed program was:
| /* confdefs.h. */
|
| #define PACKAGE_NAME ""
| #define PACKAGE_TARNAME ""
| #define PACKAGE_VERSION ""
| #define PACKAGE_STRING ""
| #define PACKAGE_BUGREPORT ""
| #define ENC_VERSION "2.38"
| #define ENC_PACKAGE "gaim-encryption"
| #define STDC_HEADERS 1
| #define HAVE_SYS_TYPES_H 1
| #define HAVE_SYS_STAT_H 1
| #define HAVE_STDLIB_H 1
| #define HAVE_STRING_H 1
| #define HAVE_MEMORY_H 1
| #define HAVE_STRINGS_H 1
| #define HAVE_INTTYPES_H 1
| #define HAVE_STDINT_H 1
| #define HAVE_UNISTD_H 1
| #define HAVE_LONG_LONG 1
| #define HAVE_LONG_DOUBLE 1
| #define HAVE_WCHAR_T 1
| #define HAVE_WINT_T 1
| #define HAVE_INTTYPES_H_WITH_UINTMAX 1
| #define HAVE_STDINT_H_WITH_UINTMAX 1
| #define HAVE_INTMAX_T 1
| #define HAVE_POSIX_PRINTF 1
| #define HAVE_ALLOCA_H 1
| #define HAVE_ALLOCA 1
| #define HAVE_STDLIB_H 1
| #define HAVE_UNISTD_H 1
| #define HAVE_GETPAGESIZE 1
| #define HAVE_MMAP 1
| #define INTDIV0_RAISES_SIGFPE 1
| #define HAVE_UNSIGNED_LONG_LONG 1
| #define HAVE_UINTMAX_T 1
| #define HAVE_INTTYPES_H 1
| #define HAVE_STDINT_H 1
| #define HAVE_STDINT_H 1
| #define HAVE_ARGZ_H 1
| #define HAVE_LIMITS_H 1
| #define HAVE_LOCALE_H 1
| #define HAVE_NL_TYPES_H 1
| #define HAVE_MALLOC_H 1
| #define HAVE_STDDEF_H 1
| #define HAVE_STDLIB_H 1
| #define HAVE_STRING_H 1
| #define HAVE_UNISTD_H 1
| #define HAVE_SYS_PARAM_H 1
| #define HAVE_ASPRINTF 1
| #define HAVE_FWPRINTF 1
| #define HAVE_GETCWD 1
| #define HAVE_GETEGID 1
| #define HAVE_GETEUID 1
| #define HAVE_GETGID 1
| #define HAVE_GETUID 1
| #define HAVE_MEMPCPY 1
| #define HAVE_MUNMAP 1
| #define HAVE_PUTENV 1
| #define HAVE_SETENV 1
| #define HAVE_SETLOCALE 1
| #define HAVE_SNPRINTF 1
| #define HAVE_STPCPY 1
| #define HAVE_STRCASECMP 1
| #define HAVE_STRDUP 1
| #define HAVE_STRTOUL 1
| #define HAVE_TSEARCH 1
| #define HAVE_WCSLEN 1
| #define HAVE___ARGZ_COUNT 1
| #define HAVE___ARGZ_STRINGIFY 1
| #define HAVE___ARGZ_NEXT 1
| #define HAVE___FSETLOCKING 1
| #define HAVE_DECL__SNPRINTF 0
| #define HAVE_DECL__SNWPRINTF 0
| #define HAVE_DECL_FEOF_UNLOCKED 1
| #define HAVE_DECL_FGETS_UNLOCKED 0
| #define HAVE_DECL_GETC_UNLOCKED 1
| #define HAVE_ICONV 1
| #define ICONV_CONST
| #define HAVE_LANGINFO_CODESET 1
| #define HAVE_LC_MESSAGES 1
| #define ENABLE_NLS 1
| #define HAVE_GETTEXT 1
| #define HAVE_DCGETTEXT 1
| #define HAVE_GAIM 1
| /* end confdefs.h. */
| #include <prio.h>
configure:11037: result: no
configure:11072: checking for prio.h
configure:11079: result: no
configure:11106: checking again for Mozilla nspr4 includes in /usr/include/mozilla/nspr
configure:11108: result: no
configure:11111: error: --with-nspr-includes was specified, but nspr.h and prio.h
were not there.
## ---------------- ##
## Cache variables. ##
## ---------------- ##
ac_cv_build=i686-pc-linux-gnu
ac_cv_build_alias=i686-pc-linux-gnu
ac_cv_c_compiler_gnu=yes
ac_cv_c_const=yes
ac_cv_c_inline=inline
ac_cv_env_CC_set=
ac_cv_env_CC_value=
ac_cv_env_CFLAGS_set=
ac_cv_env_CFLAGS_value=
ac_cv_env_CPPFLAGS_set=
ac_cv_env_CPPFLAGS_value=
ac_cv_env_CPP_set=
ac_cv_env_CPP_value=
ac_cv_env_CXXCPP_set=
ac_cv_env_CXXCPP_value=
ac_cv_env_CXXFLAGS_set=
ac_cv_env_CXXFLAGS_value=
ac_cv_env_CXX_set=
ac_cv_env_CXX_value=
ac_cv_env_F77_set=
ac_cv_env_F77_value=
ac_cv_env_FFLAGS_set=
ac_cv_env_FFLAGS_value=
ac_cv_env_LDFLAGS_set=
ac_cv_env_LDFLAGS_value=
ac_cv_env_build_alias_set=
ac_cv_env_build_alias_value=
ac_cv_env_host_alias_set=
ac_cv_env_host_alias_value=
ac_cv_env_target_alias_set=
ac_cv_env_target_alias_value=
ac_cv_exeext=
ac_cv_func___argz_count=yes
ac_cv_func___argz_next=yes
ac_cv_func___argz_stringify=yes
ac_cv_func___fsetlocking=yes
ac_cv_func_alloca_works=yes
ac_cv_func_asprintf=yes
ac_cv_func_fwprintf=yes
ac_cv_func_getcwd=yes
ac_cv_func_getegid=yes
ac_cv_func_geteuid=yes
ac_cv_func_getgid=yes
ac_cv_func_getpagesize=yes
ac_cv_func_getuid=yes
ac_cv_func_mempcpy=yes
ac_cv_func_mmap_fixed_mapped=yes
ac_cv_func_munmap=yes
ac_cv_func_putenv=yes
ac_cv_func_setenv=yes
ac_cv_func_setlocale=yes
ac_cv_func_snprintf=yes
ac_cv_func_stpcpy=yes
ac_cv_func_strcasecmp=yes
ac_cv_func_strdup=yes
ac_cv_func_strtoul=yes
ac_cv_func_tsearch=yes
ac_cv_func_wcslen=yes
ac_cv_gnu_library_2_1=yes
ac_cv_have_decl__snprintf=no
ac_cv_have_decl__snwprintf=no
ac_cv_have_decl_feof_unlocked=yes
ac_cv_have_decl_fgets_unlocked=no
ac_cv_have_decl_getc_unlocked=yes
ac_cv_header_argz_h=yes
ac_cv_header_inttypes_h=yes
ac_cv_header_limits_h=yes
ac_cv_header_locale_h=yes
ac_cv_header_malloc_h=yes
ac_cv_header_memory_h=yes
ac_cv_header_nl_types_h=yes
ac_cv_header_nspr_h=no
ac_cv_header_prio_h=no
ac_cv_header_stdc=yes
ac_cv_header_stddef_h=yes
ac_cv_header_stdint_h=yes
ac_cv_header_stdlib_h=yes
ac_cv_header_string_h=yes
ac_cv_header_strings_h=yes
ac_cv_header_sys_param_h=yes
ac_cv_header_sys_stat_h=yes
ac_cv_header_sys_types_h=yes
ac_cv_header_unistd_h=yes
ac_cv_host=i686-pc-linux-gnu
ac_cv_host_alias=i686-pc-linux-gnu
ac_cv_lib_cposix_strerror=no
ac_cv_objext=o
ac_cv_path_GMSGFMT=/usr/bin/msgfmt
ac_cv_path_MSGFMT=/usr/bin/msgfmt
ac_cv_path_MSGMERGE=/usr/bin/msgmerge
ac_cv_path_PKG_CONFIG=/usr/bin/pkg-config
ac_cv_path_XGETTEXT=/usr/bin/xgettext
ac_cv_path_install='/usr/bin/install -c'
ac_cv_prog_CPP='gcc -E'
ac_cv_prog_ac_ct_CC=gcc
ac_cv_prog_ac_ct_RANLIB=ranlib
ac_cv_prog_cc_g=yes
ac_cv_prog_cc_stdc=
ac_cv_prog_egrep='grep -E'
ac_cv_prog_make_make_set=yes
ac_cv_target=i686-pc-linux-gnu
ac_cv_target_alias=i686-pc-linux-gnu
ac_cv_type_long_long=yes
ac_cv_type_off_t=yes
ac_cv_type_ptrdiff_t=yes
ac_cv_type_size_t=yes
ac_cv_type_unsigned_long_long=yes
ac_cv_working_alloca_h=yes
acl_cv_path_LD=/usr/bin/ld
acl_cv_prog_gnu_ld=yes
acl_cv_rpath=done
am_cv_func_iconv=yes
am_cv_langinfo_codeset=yes
am_cv_lib_iconv=no
am_cv_proto_iconv='extern size_t iconv (iconv_t cd, char * *inbuf, size_t *inbytesleft, char * *outbuf, size_t *outbytesleft);'
am_cv_proto_iconv_arg1=
am_cv_val_LC_MESSAGES=yes
bh_cv_c_signed=yes
gt_cv_c_intmax_t=yes
gt_cv_c_long_double=yes
gt_cv_c_wchar_t=yes
gt_cv_c_wint_t=yes
gt_cv_func_gnugettext1_libc=yes
gt_cv_func_printf_posix=yes
gt_cv_header_inttypes_h=yes
gt_cv_int_divbyzero_sigfpe=yes
gt_cv_inttypes_pri_broken=no
jm_ac_cv_header_inttypes_h=yes
jm_ac_cv_header_stdint_h=yes
nls_cv_force_use_gnu_gettext=no
nls_cv_header_intl=
nls_cv_header_libgt=
nls_cv_use_gnu_gettext=no
## ----------------- ##
## Output variables. ##
## ----------------- ##
ACLOCAL='aclocal-1.4'
ALLOCA=''
AR=''
AUTOCONF='autoconf'
AUTOHEADER='autoheader'
AUTOMAKE='automake-1.4'
BUILD_INCLUDED_LIBINTL='no'
CATOBJEXT='.gmo'
CC='gcc'
CFLAGS='-g -O2'
CPP='gcc -E'
CPPFLAGS=''
CXX=''
CXXCPP=''
CXXFLAGS=''
DATADIRNAME='share'
DEFS=''
ECHO='echo'
ECHO_C=''
ECHO_N='-n'
ECHO_T=''
EGREP='grep -E'
EXEEXT=''
F77=''
FFLAGS=''
GAIM_CFLAGS='-I/usr/include/gaim -I/usr/include/glib-2.0 -I/usr/lib/glib-2.0/include '
GAIM_LIBS='-lglib-2.0 '
GENCAT='gencat'
GLIBC21='yes'
GMSGFMT='/usr/bin/msgfmt'
GTK_CFLAGS=''
GTK_LIBS=''
HAVE_ASPRINTF='1'
HAVE_POSIX_PRINTF='1'
HAVE_SNPRINTF='1'
HAVE_WPRINTF='0'
INSTALL_DATA='${INSTALL} -m 644'
INSTALL_PROGRAM='${INSTALL}'
INSTALL_SCRIPT='${INSTALL}'
INSTOBJEXT='.mo'
INTLBISON=':'
INTLLIBS=''
INTLOBJS=''
INTL_LIBTOOL_SUFFIX_PREFIX=''
LDFLAGS=''
LIBICONV=''
LIBINTL=''
LIBOBJS=''
LIBS=''
LIBTOOL=''
LN_S=''
LTLIBICONV=''
LTLIBINTL=''
LTLIBOBJS=''
MAKEINFO='/home/gnomefreak/dapper_builds/gaim-encryption/2.38-1/gaim-encryption-2.38/missing makeinfo'
MKINSTALLDIRS='$(top_builddir)/./mkinstalldirs'
MSGFMT='/usr/bin/msgfmt'
MSGMERGE='/usr/bin/msgmerge'
NSS_CFLAGS=''
NSS_LIBS=''
OBJEXT='o'
PACKAGE='gaim-encryption'
PACKAGE_BUGREPORT=''
PACKAGE_NAME=''
PACKAGE_STRING=''
PACKAGE_TARNAME=''
PACKAGE_VERSION=''
PATH_SEPARATOR=':'
PKG_CONFIG='/usr/bin/pkg-config'
PLUGINS_FALSE=''
PLUGINS_TRUE=''
POSUB='po'
RANLIB='ranlib'
SET_MAKE=''
SHELL='/bin/sh'
STRIP=''
USE_INCLUDED_LIBINTL='no'
USE_NLS='yes'
VERSION='2.38'
XGETTEXT='/usr/bin/xgettext'
ac_ct_AR=''
ac_ct_CC='gcc'
ac_ct_CXX=''
ac_ct_F77=''
ac_ct_RANLIB='ranlib'
ac_ct_STRIP=''
bindir='${exec_prefix}/bin'
build='i686-pc-linux-gnu'
build_alias=''
build_cpu='i686'
build_os='linux-gnu'
build_vendor='pc'
datadir='${prefix}/share'
exec_prefix='NONE'
host='i686-pc-linux-gnu'
host_alias=''
host_cpu='i686'
host_os='linux-gnu'
host_vendor='pc'
includedir='${prefix}/include'
infodir='${prefix}/share/info'
libdir='${exec_prefix}/lib'
libexecdir='${exec_prefix}/libexec'
localstatedir='${prefix}/var'
mandir='${prefix}/share/man'
oldincludedir='/usr/include'
prefix='/usr'
program_transform_name='s,x,x,'
sbindir='${exec_prefix}/sbin'
sharedstatedir='${prefix}/com'
sysconfdir='${prefix}/etc'
target='i686-pc-linux-gnu'
target_alias=''
target_cpu='i686'
target_os='linux-gnu'
target_vendor='pc'
## ----------- ##
## confdefs.h. ##
## ----------- ##
#define ENABLE_NLS 1
#define ENC_PACKAGE "gaim-encryption"
#define ENC_VERSION "2.38"
#define HAVE_ALLOCA 1
#define HAVE_ALLOCA_H 1
#define HAVE_ARGZ_H 1
#define HAVE_ASPRINTF 1
#define HAVE_DCGETTEXT 1
#define HAVE_DECL_FEOF_UNLOCKED 1
#define HAVE_DECL_FGETS_UNLOCKED 0
#define HAVE_DECL_GETC_UNLOCKED 1
#define HAVE_DECL__SNPRINTF 0
#define HAVE_DECL__SNWPRINTF 0
#define HAVE_FWPRINTF 1
#define HAVE_GAIM 1
#define HAVE_GETCWD 1
#define HAVE_GETEGID 1
#define HAVE_GETEUID 1
#define HAVE_GETGID 1
#define HAVE_GETPAGESIZE 1
#define HAVE_GETTEXT 1
#define HAVE_GETUID 1
#define HAVE_ICONV 1
#define HAVE_INTMAX_T 1
#define HAVE_INTTYPES_H 1
#define HAVE_INTTYPES_H 1
#define HAVE_INTTYPES_H_WITH_UINTMAX 1
#define HAVE_LANGINFO_CODESET 1
#define HAVE_LC_MESSAGES 1
#define HAVE_LIMITS_H 1
#define HAVE_LOCALE_H 1
#define HAVE_LONG_DOUBLE 1
#define HAVE_LONG_LONG 1
#define HAVE_MALLOC_H 1
#define HAVE_MEMORY_H 1
#define HAVE_MEMPCPY 1
#define HAVE_MMAP 1
#define HAVE_MUNMAP 1
#define HAVE_NL_TYPES_H 1
#define HAVE_POSIX_PRINTF 1
#define HAVE_PUTENV 1
#define HAVE_SETENV 1
#define HAVE_SETLOCALE 1
#define HAVE_SNPRINTF 1
#define HAVE_STDDEF_H 1
#define HAVE_STDINT_H 1
#define HAVE_STDINT_H 1
#define HAVE_STDINT_H 1
#define HAVE_STDINT_H_WITH_UINTMAX 1
#define HAVE_STDLIB_H 1
#define HAVE_STDLIB_H 1
#define HAVE_STDLIB_H 1
#define HAVE_STPCPY 1
#define HAVE_STRCASECMP 1
#define HAVE_STRDUP 1
#define HAVE_STRINGS_H 1
#define HAVE_STRING_H 1
#define HAVE_STRING_H 1
#define HAVE_STRTOUL 1
#define HAVE_SYS_PARAM_H 1
#define HAVE_SYS_STAT_H 1
#define HAVE_SYS_TYPES_H 1
#define HAVE_TSEARCH 1
#define HAVE_UINTMAX_T 1
#define HAVE_UNISTD_H 1
#define HAVE_UNISTD_H 1
#define HAVE_UNISTD_H 1
#define HAVE_UNSIGNED_LONG_LONG 1
#define HAVE_WCHAR_T 1
#define HAVE_WCSLEN 1
#define HAVE_WINT_T 1
#define HAVE___ARGZ_COUNT 1
#define HAVE___ARGZ_NEXT 1
#define HAVE___ARGZ_STRINGIFY 1
#define HAVE___FSETLOCKING 1
#define ICONV_CONST
#define INTDIV0_RAISES_SIGFPE 1
#define PACKAGE_BUGREPORT ""
#define PACKAGE_NAME ""
#define PACKAGE_STRING ""
#define PACKAGE_TARNAME ""
#define PACKAGE_VERSION ""
#define STDC_HEADERS 1
configure: exit 1