All pastes #50020 Raw Edit

Anonymous

public text v1 · immutable
#50020 ·published 2006-04-19 22:01 UTC
rendered paste body
make[1]: Entering directory `/usr/src/kernel-source-2.6.15-chw-2'
  CC [M]  /home/scope/nin_rt2570/rtusb_main.o
/home/scope/nin_rt2570/rtusb_main.c:61: error: parse error before '/' token
/home/scope/nin_rt2570/rtusb_main.c:61: error: field name not in record or union initializer
/home/scope/nin_rt2570/rtusb_main.c:61: error: (near initialization for `rtusb_usb_id')
/home/scope/nin_rt2570/rtusb_main.c:61: warning: missing braces around initializer
/home/scope/nin_rt2570/rtusb_main.c:61: warning: (near initialization for `rtusb_usb_id[1]')
/home/scope/nin_rt2570/rtusb_main.c:61: error: field name not in record or union initializer
/home/scope/nin_rt2570/rtusb_main.c:61: error: (near initialization for `rtusb_usb_id')
/home/scope/nin_rt2570/rtusb_main.c:61: error: parse error before '/' token
make[2]: *** [/home/scope/nin_rt2570/rtusb_main.o] Error 1
make[1]: *** [_module_/home/scope/nin_rt2570] Error 2
make[1]: Leaving directory `/usr/src/kernel-source-2.6.15-chw-2'
nin_rt2570.ko failed to build!
make: *** [module] Error 1