All pastes #499904 Raw Edit

Anonymous

public text v1 · immutable
·published 2007-05-21 09:31 UTC
rendered paste body
make -f test/utils/CMakeFiles/unittestfunctions.dir/build.make test/utils/CMakeFiles/unittestfunctions.dir/depend
make[2]: Nothing to be done for `test/utils/CMakeFiles/unittestfunctions.dir/depend'.
make -f test/utils/CMakeFiles/unittestfunctions.dir/build.make test/utils/CMakeFiles/unittestfunctions.dir/build
Linking CXX static library libunittestfunctions.a
cd /home/flavio/hacking/strigi/build/test/utils && /usr/bin/cmake -P CMakeFiles/unittestfunctions.dir/cmake_clean_target.cmake
cd /home/flavio/hacking/strigi/build/test/utils && /usr/bin/cmake -E cmake_link_script CMakeFiles/unittestfunctions.dir/link.txt --verbose=1
/usr/bin/ar cr libunittestfunctions.a "CMakeFiles/unittestfunctions.dir/unittestfunctions.o" 
/usr/bin/ranlib libunittestfunctions.a 
/usr/bin/cmake -E cmake_progress_report /home/flavio/hacking/strigi/build/CMakeFiles 
[ 95%] Built target unittestfunctions
make -f test/daemon/CMakeFiles/daemonconfiguratortest.dir/build.make test/daemon/CMakeFiles/daemonconfiguratortest.dir/depend
make[2]: Nothing to be done for `test/daemon/CMakeFiles/daemonconfiguratortest.dir/depend'.
make -f test/daemon/CMakeFiles/daemonconfiguratortest.dir/build.make test/daemon/CMakeFiles/daemonconfiguratortest.dir/build
Linking CXX executable daemonconfiguratortest
cd /home/flavio/hacking/strigi/build/test/daemon && /usr/bin/cmake -P CMakeFiles/daemonconfiguratortest.dir/cmake_clean_target.cmake
cd /home/flavio/hacking/strigi/build/test/daemon && /usr/bin/c++ -Wnon-virtual-dtor -Wno-long-long -ansi -Wundef -Wcast-align -Wchar-subscripts -Wall -W -Wpointer-arith -Wformat-security -fno-check-new -fno-common -fno-exceptions -Wno-unused-parameter -fvisibility=hidden -fexceptions -g -fPIC "CMakeFiles/daemonconfiguratortest.dir/daemonconfiguratortest.o" -o daemonconfiguratortest -rdynamic -L/home/flavio/hacking/strigi/build/test -L/home/flavio/hacking/strigi/build/src/daemon -L/home/flavio/hacking/strigi/build/src/streamanalyzer -L/home/flavio/hacking/strigi/build/src/xsd -L/home/flavio/hacking/strigi/build/src/streams/pdf -L/home/flavio/hacking/strigi/build/src/streams -Wl,-Bstatic -ltest_runner -ldaemonconfigurator -Wl,-Bdynamic -lstreamanalyzer -llog4cxx -lcppunit -Wl,-Bstatic -lstrigidaemonconfiguration -lxmlstream -Wl,-Bdynamic -lxml2 -ldl -Wl,-Bstatic -lpdfstream -Wl,-Bdynamic -lstreams -lz -lbz2 -lc -lpthread -Wl,-rpath,/home/flavio/hacking/strigi/build/test:/home/flavio/hacking/strigi/build/src/daemon:/home/flavio/hacking/strigi/build/src/streamanalyzer:/home/flavio/hacking/strigi/build/src/xsd:/home/flavio/hacking/strigi/build/src/streams/pdf:/home/flavio/hacking/strigi/build/src/streams 
/usr/bin/cmake -E cmake_progress_report /home/flavio/hacking/strigi/build/CMakeFiles 
[ 95%] Built target daemonconfiguratortest
make -f test/indextesters/CMakeFiles/indextesters.dir/build.make test/indextesters/CMakeFiles/indextesters.dir/depend
make[2]: Nothing to be done for `test/indextesters/CMakeFiles/indextesters.dir/depend'.
make -f test/indextesters/CMakeFiles/indextesters.dir/build.make test/indextesters/CMakeFiles/indextesters.dir/build
Linking CXX static library libindextesters.a
cd /home/flavio/hacking/strigi/build/test/indextesters && /usr/bin/cmake -P CMakeFiles/indextesters.dir/cmake_clean_target.cmake
cd /home/flavio/hacking/strigi/build/test/indextesters && /usr/bin/cmake -E cmake_link_script CMakeFiles/indextesters.dir/link.txt --verbose=1
/usr/bin/ar cr libindextesters.a "CMakeFiles/indextesters.dir/indexmanagertester.o" "CMakeFiles/indextesters.dir/indexreadertester.o" "CMakeFiles/indextesters.dir/indexwritertester.o" "CMakeFiles/indextesters.dir/indexsearchtester.o" 
/usr/bin/ranlib libindextesters.a 
/usr/bin/cmake -E cmake_progress_report /home/flavio/hacking/strigi/build/CMakeFiles 96 97
[ 97%] Built target indextesters
make -f test/streamanalyzer/CMakeFiles/streamanalyzertesters.dir/build.make test/streamanalyzer/CMakeFiles/streamanalyzertesters.dir/depend
make[2]: Nothing to be done for `test/streamanalyzer/CMakeFiles/streamanalyzertesters.dir/depend'.
make -f test/streamanalyzer/CMakeFiles/streamanalyzertesters.dir/build.make test/streamanalyzer/CMakeFiles/streamanalyzertesters.dir/build
Linking CXX static library libstreamanalyzertesters.a
cd /home/flavio/hacking/strigi/build/test/streamanalyzer && /usr/bin/cmake -P CMakeFiles/streamanalyzertesters.dir/cmake_clean_target.cmake
cd /home/flavio/hacking/strigi/build/test/streamanalyzer && /usr/bin/cmake -E cmake_link_script CMakeFiles/streamanalyzertesters.dir/link.txt --verbose=1
/usr/bin/ar cr libstreamanalyzertesters.a "CMakeFiles/streamanalyzertesters.dir/diranalyzertester.o" 
/usr/bin/ranlib libstreamanalyzertesters.a 
/usr/bin/cmake -E cmake_progress_report /home/flavio/hacking/strigi/build/CMakeFiles 
[ 97%] Built target streamanalyzertesters
make -f test/luceneindexer/CMakeFiles/lucenetest.dir/build.make test/luceneindexer/CMakeFiles/lucenetest.dir/depend
make[2]: Nothing to be done for `test/luceneindexer/CMakeFiles/lucenetest.dir/depend'.
make -f test/luceneindexer/CMakeFiles/lucenetest.dir/build.make test/luceneindexer/CMakeFiles/lucenetest.dir/build
Linking CXX executable lucenetest
cd /home/flavio/hacking/strigi/build/test/luceneindexer && /usr/bin/cmake -P CMakeFiles/lucenetest.dir/cmake_clean_target.cmake
cd /home/flavio/hacking/strigi/build/test/luceneindexer && /usr/bin/c++ -Wnon-virtual-dtor -Wno-long-long -ansi -Wundef -Wcast-align -Wchar-subscripts -Wall -W -Wpointer-arith -Wformat-security -fno-check-new -fno-common -fno-exceptions -Wno-unused-parameter -fvisibility=hidden -fexceptions -g -fPIC "CMakeFiles/lucenetest.dir/luceneindexmanagertest.o" "CMakeFiles/lucenetest.dir/luceneindexreadertest.o" "CMakeFiles/lucenetest.dir/luceneindexwritertest.o" "CMakeFiles/lucenetest.dir/luceneindexsearchtest.o" "CMakeFiles/lucenetest.dir/lucenediranalyzertest.o" -o lucenetest -rdynamic -L/home/flavio/hacking/strigi/build/test -L/home/flavio/hacking/strigi/build/test/utils -L/home/flavio/hacking/strigi/build/test/streamanalyzer -L/home/flavio/hacking/strigi/build/test/indextesters -L/home/flavio/hacking/strigi/build/src/luceneindexer -L/home/flavio/hacking/strigi/build/src/combinedindexer -L/home/flavio/hacking/strigi/build/src/dummyindexer -L/home/flavio/hacking/strigi/build/src/streamanalyzer -L/home/flavio/hacking/strigi/build/src/streams/pdf -L/home/flavio/hacking/strigi/build/src/streams -Wl,-Bstatic -ltest_runner -lunittestfunctions -lstreamanalyzertesters -lindextesters -Wl,-Bdynamic -lcluceneindex -lcppunit -Wl,-Bstatic -lunittestfunctions -lcombinedindex -lgrepindex -Wl,-Bdynamic -lcluceneindex -lstreamanalyzer -lxml2 -ldl -Wl,-Bstatic -lpdfstream -Wl,-Bdynamic -lstreams -lz -lbz2 -lc -lpthread -lclucene -Wl,-rpath,/home/flavio/hacking/strigi/build/test:/home/flavio/hacking/strigi/build/test/utils:/home/flavio/hacking/strigi/build/test/streamanalyzer:/home/flavio/hacking/strigi/build/test/indextesters:/home/flavio/hacking/strigi/build/src/luceneindexer:/home/flavio/hacking/strigi/build/src/combinedindexer:/home/flavio/hacking/strigi/build/src/dummyindexer:/home/flavio/hacking/strigi/build/src/streamanalyzer:/home/flavio/hacking/strigi/build/src/streams/pdf:/home/flavio/hacking/strigi/build/src/streams 
/home/flavio/hacking/strigi/build/test/streamanalyzer/libstreamanalyzertesters.a(diranalyzertester.o): In function `strigiunittest::DirAnalyzerTester::setUp()':
/home/flavio/hacking/strigi/test/streamanalyzer/diranalyzertester.cpp:41: warning: the use of `tempnam' is dangerous, better use `mkstemp'
/home/flavio/hacking/strigi/build/test/streamanalyzer/libstreamanalyzertesters.a(diranalyzertester.o): In function `strigiunittest::DirAnalyzerTester::setUp()':
diranalyzertester.cpp:(.text+0x1cee): undefined reference to `strigiunittest::getIndexManager(std::basic_string<char, std::char_traits<char>, std::allocator<char> >&, std::basic_string<char, std::char_traits<char>, std::allocator<char> > const&)'
/home/flavio/hacking/strigi/build/test/indextesters/libindextesters.a(indexsearchtester.o): In function `strigiunittest::IndexSearchTester::setUp()':
/home/flavio/hacking/strigi/test/indextesters/indexsearchtester.cpp:85: undefined reference to `strigiunittest::getIndexManager(std::basic_string<char, std::char_traits<char>, std::allocator<char> >&, std::basic_string<char, std::char_traits<char>, std::allocator<char> > const&)'
collect2: ld returned 1 exit status
make[2]: *** [test/luceneindexer/lucenetest] Error 1
make[1]: *** [test/luceneindexer/CMakeFiles/lucenetest.dir/all] Error 2
make: *** [all] Error 2
*** Exited with status: 2 ***