cd '/home/flavio/hacking/strigi/build' && make -j1
built test_runner (test_runner)
built decodebase64 (decodebase64)
built streams (streams)
built oletest (oletest)
built testpt (testpt)
built pdfstream (pdfstream)
built streamanalyzer (streamanalyzer)
built filelister (filelister)
built archivecat (archivecat)
built metadataproperties (metadataproperties)
built xmlstream (xmlstream)
built metadatapropertiestest (metadatapropertiestest)
built strigidaemonconfiguration (strigidaemonconfiguration)
built strigidaemonconfigurationtest (strigidaemonconfigurationtest)
built deepfind (deepfind)
built grepindexer (grepindexer)
built deepgrep (deepgrep)
built dummyindexer (dummyindexer)
built grepindex (grepindex)
built greptest (greptest)
built ontoprint (ontoprint)
built peranalyzerxml (peranalyzerxml)
built perfieldxml (perfieldxml)
built xmlindexer (xmlindexer)
built combinedindex (combinedindex)
built indexertests (indexertests)
built cluceneindex (cluceneindex)
built strigicmd (strigicmd)
built luceneindexer (luceneindexer)
built daemonconfigurator (daemonconfigurator)
built searchclient (searchclient)
built eventlistener (eventlistener)
built xesam (xesam)
built dbusserver (dbusserver)
built dbuscpp (dbuscpp)
built strigidaemon (strigidaemon)
built strigihtmlgui (strigihtmlgui)
built strigiqtdbusclient (strigiqtdbusclient)
built filterwidget (filterwidget)
built strigiclient (strigiclient)
built archiveengine (archiveengine)
built archivecat (archivecat)
built archivedialog (archivedialog)
built qclient (qclient)
built testrunner-streams (testrunner-streams)
built pdf (pdf)
built au (au)
built pcx (pcx)
built xbm (xbm)
built cpp (cpp)
built deb (deb)
built xpm (xpm)
built streamanalyzertest (streamanalyzertest)
built qclient (qclient)
built indexdump (indexdump)
built testrunner-lucene (testrunner-lucene)
built parsertest (parsertest)
built testserver (testserver)
built strigiasynctest (strigiasynctest)
built strigiqtdbustest (strigiqtdbustest)
built filterwidgettest (filterwidgettest)
compiling test/utils/CMakeFiles/unittestfunctions.dir/unittestfunctions.o (test/utils/CMakeFiles/unittestfunctions.dir/unittestfunctions.o)
linking CXX static library libunittestfunctions.a (CXX static library libunittestfunctions.a)
built unittestfunctions (unittestfunctions)
built daemonconfiguratortest (daemonconfiguratortest)
Scanning dependencies of target indextesters
compiling test/indextesters/CMakeFiles/indextesters.dir/indexsearchtester.o (test/indextesters/CMakeFiles/indextesters.dir/indexsearchtester.o)
linking CXX static library libindextesters.a (CXX static library libindextesters.a)
built indextesters (indextesters)
Scanning dependencies of target streamanalyzertesters
compiling test/streamanalyzer/CMakeFiles/streamanalyzertesters.dir/diranalyzertester.o (test/streamanalyzer/CMakeFiles/streamanalyzertesters.dir/diranalyzertester.o)
linking CXX static library libstreamanalyzertesters.a (CXX static library libstreamanalyzertesters.a)
built streamanalyzertesters (streamanalyzertesters)
linking CXX executable lucenetest (CXX executable lucenetest)
/home/flavio/hacking/strigi/build/test/streamanalyzer/libstreamanalyzertesters.a(diranalyzertester.o): In function `strigiunittest::DirAnalyzerTester::setUp()':
/home/flavio/hacking/strigi/test/streamanalyzer/diranalyzertester.cpp:41: warning: the use of `tempnam' is dangerous, better use `mkstemp'
/home/flavio/hacking/strigi/build/test/streamanalyzer/libstreamanalyzertesters.a(diranalyzertester.o): In function `strigiunittest::DirAnalyzerTester::setUp()':
diranalyzertester.cpp:(.text+0x1cee): undefined reference to `strigiunittest::getIndexManager(std::basic_string<char, std::char_traits<char>, std::allocator<char> >&, std::basic_string<char, std::char_traits<char>, std::allocator<char> > const&)'
/home/flavio/hacking/strigi/build/test/indextesters/libindextesters.a(indexsearchtester.o): In function `strigiunittest::IndexSearchTester::setUp()':
/home/flavio/hacking/strigi/test/indextesters/indexsearchtester.cpp:85: undefined reference to `strigiunittest::getIndexManager(std::basic_string<char, std::char_traits<char>, std::allocator<char> >&, std::basic_string<char, std::char_traits<char>, std::allocator<char> > const&)'
collect2: ld returned 1 exit status
make[2]: *** [test/luceneindexer/lucenetest] Error 1
make[1]: *** [test/luceneindexer/CMakeFiles/lucenetest.dir/all] Error 2
make: *** [all] Error 2
*** Exited with status: 2 ***