- esmart ..................... ERROR!
--------------------------------------------------------------------------------
----------------------------------- Last loglines ------------------------------
config.status: creating src/config.h
config.status: src/config.h is unchanged
make all-recursive
make[2]: Entering directory `/home/raventux/e17_cvs/e17/libs/esmart/src'
Making all in lib
make[3]: Entering directory `/home/raventux/e17_cvs/e17/libs/esmart/src/lib'
Making all in esmart_draggies
make[4]: Entering directory `/home/raventux/e17_cvs/e17/libs/esmart/src/lib/esmart_draggies'
make[4]: Nothing to be done for `all'.
make[4]: Leaving directory `/home/raventux/e17_cvs/e17/libs/esmart/src/lib/esmart_draggies'
Making all in esmart_text_entry
make[4]: Entering directory `/home/raventux/e17_cvs/e17/libs/esmart/src/lib/esmart_text_entry'
make[4]: Nothing to be done for `all'.
make[4]: Leaving directory `/home/raventux/e17_cvs/e17/libs/esmart/src/lib/esmart_text_entry'
Making all in esmart_file_dialog
make[4]: Entering directory `/home/raventux/e17_cvs/e17/libs/esmart/src/lib/esmart_file_dialog'
make[4]: *** No rule to make target `../../../src/lib/esmart_container/libesmart_container.la', needed by `libesmart_file_dialog.la'. Stop.
make[4]: Leaving directory `/home/raventux/e17_cvs/e17/libs/esmart/src/lib/esmart_file_dialog'
make[3]: *** [all-recursive] Error 1
make[3]: Leaving directory `/home/raventux/e17_cvs/e17/libs/esmart/src/lib'
make[2]: *** [all-recursive] Error 1
make[2]: Leaving directory `/home/raventux/e17_cvs/e17/libs/esmart/src'
make[1]: *** [all] Error 2
make[1]: Leaving directory `/home/raventux/e17_cvs/e17/libs/esmart/src'
make: *** [all-recursive] Error 1
--------------------------------------------------------------------------------