All pastes #498882 Raw Edit

Someone

public text v1 · immutable
·published 2007-05-20 18:57 UTC
rendered paste body
astkte100p:/usr/src/zaptel# make
cc -I. -O4 -g -Wall -DBUILDING_TONEZONE    -DSTANDALONE_ZAPATA -DZAPTEL_CONFIG=\"/etc/zaptel.conf\"   -c -o gendigits.o gendigits.c
cc -o gendigits gendigits.o -lm
./gendigits > tones.h
cc -I. -O4 -g -Wall -DBUILDING_TONEZONE    -DSTANDALONE_ZAPATA -DZAPTEL_CONFIG=\"/etc/zaptel.conf\"    makefw.c   -o makefw
./makefw tormenta2.rbt tor2fw > tor2fw.h
Loaded 69900 bytes from file
./makefw pciradio.rbt radfw > radfw.h
Loaded 42096 bytes from file
ZAPTELVERSION="1.2.11" build_tools/make_version_h > version.h.tmp
if cmp -s version.h.tmp version.h ; then echo; else \
        mv version.h.tmp version.h ; \
fi

rm -f version.h.tmp
cc -I/lib/modules/2.4.30/build/include -O6 -DMODULE -D__KERNEL__ -DEXPORT_SYMTAB -I/lib/modules/2.4.30/build/drivers/net -Wall -I. -Wstrict-prototypes -fomit-frame-pointer -I/lib/modules/2.4.30/build/drivers/net/wan -I/lib/modules/2.4.30/build/include/net -DMODVERSIONS -include /lib/modules/2.4.30/build/include/linux/modversions.h   -DSTANDALONE_ZAPATA -o zaptel.o -c zaptel.c
In file included from /lib/modules/2.4.30/build/include/linux/config.h:4,
                 from zconfig.h:11,
                 from zaptel.c:40:
/lib/modules/2.4.30/build/include/linux/autoconf.h:433:28: missing terminating " character
/lib/modules/2.4.30/build/include/linux/autoconf.h:434:1: missing terminating " character
In file included from /lib/modules/2.4.30/build/include/linux/config.h:4,
                 from zconfig.h:11,
                 from zaptel.c:40:
/lib/modules/2.4.30/build/include/linux/autoconf.h:522: error: syntax error before string constant
In file included from /lib/modules/2.4.30/build/include/linux/kernel.h:10,
                 from zaptel.c:43:
/usr/lib/gcc-lib/i486-linux/3.3.5/include/stdarg.h:105: error: syntax error before "va_list"
In file included from zaptel.c:43:
/lib/modules/2.4.30/build/include/linux/kernel.h:76: error: syntax error before "va_list"
/lib/modules/2.4.30/build/include/linux/kernel.h:77: warning: function declaration isn't a prototype
/lib/modules/2.4.30/build/include/linux/kernel.h:80: error: syntax error before "va_list"
/lib/modules/2.4.30/build/include/linux/kernel.h:81: warning: function declaration isn't a prototype
/lib/modules/2.4.30/build/include/linux/kernel.h:85: error: syntax error before "va_list"
/lib/modules/2.4.30/build/include/linux/kernel.h:86: warning: function declaration isn't a prototype
In file included from /lib/modules/2.4.30/build/include/linux/spinlock.h:6,
                 from /lib/modules/2.4.30/build/include/linux/module.h:12,
                 from zaptel.c:45:
/lib/modules/2.4.30/build/include/asm/system.h: In function `__set_64bit_var':
/lib/modules/2.4.30/build/include/asm/system.h:190: warning: dereferencing type-punned pointer will break strict-aliasing rules
/lib/modules/2.4.30/build/include/asm/system.h:190: warning: dereferencing type-punned pointer will break strict-aliasing rules
In file included from /lib/modules/2.4.30/build/include/linux/module.h:12,
                 from zaptel.c:45:
/lib/modules/2.4.30/build/include/linux/spinlock.h:67:1: warning: "atomic_dec_and_lock" redefined
In file included from /lib/modules/2.4.30/build/include/linux/modversions.h:137,
                 from <command line>:9:
/lib/modules/2.4.30/build/include/linux/modules/i386_ksyms.ver:124:1: warning: this is the location of the previous definition
In file included from /lib/modules/2.4.30/build/include/linux/prefetch.h:13,
                 from /lib/modules/2.4.30/build/include/linux/list.h:6,
                 from /lib/modules/2.4.30/build/include/linux/module.h:13,
                 from zaptel.c:45:
/lib/modules/2.4.30/build/include/asm/processor.h:81:1: warning: "cpu_data" redefined
In file included from /lib/modules/2.4.30/build/include/linux/modversions.h:137,
                 from <command line>:9:
/lib/modules/2.4.30/build/include/linux/modules/i386_ksyms.ver:88:1: warning: this is the location of the previous definition
In file included from /lib/modules/2.4.30/build/include/linux/ext3_fs_sb.h:20,
                 from /lib/modules/2.4.30/build/include/linux/fs.h:715,
                 from /lib/modules/2.4.30/build/include/linux/capability.h:17,
                 from /lib/modules/2.4.30/build/include/linux/binfmts.h:5,
                 from /lib/modules/2.4.30/build/include/linux/sched.h:9,
                 from /lib/modules/2.4.30/build/include/linux/mm.h:4,
                 from /lib/modules/2.4.30/build/include/linux/slab.h:14,
                 from /lib/modules/2.4.30/build/include/linux/proc_fs.h:5,
                 from zaptel.c:46:
/lib/modules/2.4.30/build/include/linux/timer.h:30:1: warning: "del_timer_sync" redefined
In file included from /lib/modules/2.4.30/build/include/linux/modversions.h:175,
                 from <command line>:9:
/lib/modules/2.4.30/build/include/linux/modules/ksyms.ver:576:1: warning: this is the location of the previous definition
In file included from /lib/modules/2.4.30/build/include/linux/sched.h:23,
                 from /lib/modules/2.4.30/build/include/linux/mm.h:4,
                 from /lib/modules/2.4.30/build/include/linux/slab.h:14,
                 from /lib/modules/2.4.30/build/include/linux/proc_fs.h:5,
                 from zaptel.c:46:
/lib/modules/2.4.30/build/include/linux/smp.h:80:1: warning: "smp_num_cpus" redefined
In file included from /lib/modules/2.4.30/build/include/linux/modversions.h:137,
                 from <command line>:9:
/lib/modules/2.4.30/build/include/linux/modules/i386_ksyms.ver:92:1: warning: this is the location of the previous definition
In file included from /lib/modules/2.4.30/build/include/linux/sched.h:23,
                 from /lib/modules/2.4.30/build/include/linux/mm.h:4,
                 from /lib/modules/2.4.30/build/include/linux/slab.h:14,
                 from /lib/modules/2.4.30/build/include/linux/proc_fs.h:5,
                 from zaptel.c:46:
/lib/modules/2.4.30/build/include/linux/smp.h:87:1: warning: "smp_call_function" redefined
In file included from /lib/modules/2.4.30/build/include/linux/modversions.h:137,
                 from <command line>:9:
/lib/modules/2.4.30/build/include/linux/modules/i386_ksyms.ver:108:1: warning: this is the location of the previous definition
In file included from /lib/modules/2.4.30/build/include/linux/sched.h:23,
                 from /lib/modules/2.4.30/build/include/linux/mm.h:4,
                 from /lib/modules/2.4.30/build/include/linux/slab.h:14,
                 from /lib/modules/2.4.30/build/include/linux/proc_fs.h:5,
                 from zaptel.c:46:
/lib/modules/2.4.30/build/include/linux/smp.h:88:1: warning: "cpu_online_map" redefined
In file included from /lib/modules/2.4.30/build/include/linux/modversions.h:137,
                 from <command line>:9:
/lib/modules/2.4.30/build/include/linux/modules/i386_ksyms.ver:94:1: warning: this is the location of the previous definition
In file included from /lib/modules/2.4.30/build/include/linux/mm.h:4,
                 from /lib/modules/2.4.30/build/include/linux/slab.h:14,
                 from /lib/modules/2.4.30/build/include/linux/proc_fs.h:5,
                 from zaptel.c:46:
/lib/modules/2.4.30/build/include/linux/sched.h:159:1: warning: "set_cpus_allowed" redefined
In file included from /lib/modules/2.4.30/build/include/linux/modversions.h:175,
                 from <command line>:9:
/lib/modules/2.4.30/build/include/linux/modules/ksyms.ver:660:1: warning: this is the location of the previous definition
In file included from zaptel.c:46:
/lib/modules/2.4.30/build/include/linux/proc_fs.h:193:1: warning: "proc_root_driver" redefined
In file included from /lib/modules/2.4.30/build/include/linux/modversions.h:259,
                 from <command line>:9:
/lib/modules/2.4.30/build/include/linux/modules/root.ver:24:1: warning: this is the location of the previous definition
make: *** [zaptel.o] Error 1