main.o libbackend.a ../libcpp/libcpp.a ../libcpp/libcpp.a ../libiberty/libiberty.a
/usr/lib/gcc/i686-pc-linux-gnu/4.1.2/libgcc.a: could not read symbols: Malformed archive
collect2: ld returned 1 exit status
make[2]: *** [cc1-dummy] Error 1
make[2]: Leaving directory `/var/tmp/portage/sys-devel/gcc-4.1.2/work/build/gcc'
make[1]: *** [stage1_build] Error 2
make[1]: Leaving directory `/var/tmp/portage/sys-devel/gcc-4.1.2/work/build/gcc'
make: *** [profiledbootstrap] Error 2
!!! ERROR: sys-devel/gcc-4.1.2 failed.
Call stack:
ebuild.sh, line 1615: Called dyn_compile
ebuild.sh, line 972: Called qa_call 'src_compile'
ebuild.sh, line 44: Called src_compile
ebuild.sh, line 1305: Called toolchain_src_compile
toolchain.eclass, line 26: Called gcc_src_compile
toolchain.eclass, line 1537: Called gcc_do_make
toolchain.eclass, line 1411: Called die
!!! emake failed with profiledbootstrap
!!! If you need support, post the topmost build error, and the call stack if relevant.
!!! A complete build log is located at '/var/tmp/portage/sys-devel/gcc-4.1.2/temp/build.log'.