All pastes #498117 Raw Edit

Someone

public text v1 · immutable
·published 2007-05-20 06:21 UTC
rendered paste body
Creating pyrcc4 Makefile...
Creating pyqtconfig.py...
sip/QtCore/qobject.sip:1088: error: expected unqualified-id before numeric constant
sip/QtCore/qobject.sip:1089: error: expected unqualified-id before numeric constant
sip/QtCore/qobject.sip:1089: error: expected initializer before numeric constant
sip/QtCore/qobject.sip:1091: error: expected unqualified-id before numeric constant
sip/QtCore/qobject.sip:1091: error: expected initializer before numeric constant
sip/QtCore/qobject.sip:1093: error: expected unqualified-id before numeric constant
sip/QtCore/qobject.sip:1093: error: expected initializer before numeric constant
sip/QtCore/qobject.sip:1095: error: expected unqualified-id before numeric constant
sip/QtCore/qobject.sip:1095: error: expected initializer before numeric constant
sip/QtCore/qobject.sip:1096: error: expected unqualified-id before numeric constant
sip/QtCore/qobject.sip:1098: error: expected unqualified-id before numeric constant
sip/QtCore/qobject.sip:1117: error: expected unqualified-id before numeric constant
sip/QtCore/qobject.sip:1126: error: expected unqualified-id before numeric constant
sip/QtCore/qobject.sip:1126: error: expected initializer before numeric constant
sip/QtCore/qobject.sip:1143: error: expected unqualified-id before numeric constant
sip/QtCore/qobject.sip:1143: error: expected initializer before numeric constant
sip/QtCore/qobject.sip:1160: error: expected unqualified-id before numeric constant
sip/QtCore/qobject.sip:1160: error: expected initializer before numeric constant
sip/QtCore/qobject.sip:1175: error: expected unqualified-id before numeric constant
sip/QtCore/qobject.sip:1175: error: expected initializer before numeric constant
sip/QtCore/qobject.sip:1189: error: expected unqualified-id before numeric constant
sip/QtCore/qobject.sip:1216: error: expected unqualified-id before numeric constant
sipQtCorecmodule.cpp:8934: error: ‘sipQtFindConnection’ was not declared in this scope
make[1]: *** [sipQtCorecmodule.o] Error 1
make[1]: *** Waiting for unfinished jobs....
make: *** [all] Error 2

!!! ERROR: dev-python/PyQt4-4.1.1 failed.
Call stack:
  ebuild.sh, line 1615:   Called dyn_compile
  ebuild.sh, line 972:   Called qa_call 'src_compile'
  ebuild.sh, line 44:   Called src_compile
  PyQt4-4.1.1.ebuild, line 48:   Called die

!!! emake failed
!!! If you need support, post the topmost build error, and the call stack if relevant.
!!! A complete build log is located at '/var/tmp/portage/dev-python/PyQt4-4.1.1/temp/build.log'.

zero@localhost ~ $