dump of module assis
public text v1 · immutable /usr/bin/make clean KERNDIR=/lib/modules/2.6.20-15-386/build ↑
│ make[1]: Entering directory `/usr/src/modules/rt2x00' ▮
│ make[1]: Leaving directory `/usr/src/modules/rt2x00' ▒
│ dh_clean ▒
│ /usr/bin/make -f debian/rules kdist_clean kdist_config binary-modules ▒
│ make[1]: Entering directory `/usr/src/modules/rt2x00' ▒
│ /usr/bin/make clean KERNDIR=/lib/modules/2.6.20-15-386/build ▒
│ make[2]: Entering directory `/usr/src/modules/rt2x00' ▒
│ make[2]: Leaving directory `/usr/src/modules/rt2x00' ▒
│ dh_clean ▒
│ for templ in ; do \ ▒
│ cp $templ `echo $templ | sed -e 's/_KVERS_/2.6.20-15-386/g'` ; \ ▒
│ done ▒
│ for templ in `ls debian/*.modules.in` ; do \ ▒
│ test -e ${templ%.modules.in}.backup || cp ${templ%.modules.in}
sed -e 's/##KVERS##/2.6.20-15-386/g ;s/#KVERS#/2.6.20-15-386/g ; ▒
│ s/_KVERS_/2.6.20-15-386/g ; s/##KDREV##/2.6.20-15.27/g ; ▒
│ s/#KDREV#/2.6.20-15.27/g ; s/_KDREV_/2.6.20-15.27/g ' < $templ > ▒
│ ${templ%.modules.in}; \ ▒
│ done ▒
│ # Install module ▮
│ dh_installdirs lib/modules/2.6.20-15-386/kernel/drivers/net/wireless ▒
│ # Build modules ▒
│ /usr/bin/make KERNDIR=/lib/modules/2.6.20-15-386/build ▒
│ make[2]: Entering directory `/usr/src/modules/rt2x00' ▒
│ CC [M] /usr/src/modules/rt2x00/ieee80211/ieee80211.o ▒
│ /usr/src/modules/rt2x00/ieee80211/ieee80211.c: In function ▒
│ ieee80211_if_shutdown: ▒
│ /usr/src/modules/rt2x00/ieee80211/ieee80211.c:2094: warning: passing
argument 1 of cancel_delayed_work from incompatible pointer type ↑
│ /usr/src/modules/rt2x00/ieee80211/ieee80211.c:2095: error: invalid ▒
│ operands to binary == ▒
│ /usr/src/modules/rt2x00/ieee80211/ieee80211.c:2097: warning: passing ▒
│ argument 1 of cancel_delayed_work from incompatible pointer type ▒
│ /usr/src/modules/rt2x00/ieee80211/ieee80211.c:2101: error: incompatible ▒
│ types in assignment ▒
│ /usr/src/modules/rt2x00/ieee80211/ieee80211.c: In function ▒
│ ieee80211_unregister_hw: ▒
│ /usr/src/modules/rt2x00/ieee80211/ieee80211.c:4689: error: used struct ▒
│ type value where scalar is required ▒
│ /usr/src/modules/rt2x00/ieee80211/ieee80211.c:4691: warning: passing ▮
│ argument 1 of cancel_delayed_work from incompatible pointer type ▒
│ make[4]: *** [/usr/src/modules/rt2x00/ieee80211/ieee80211.o] Error 1 ▒
│ make[3]: *** [_module_/usr/src/modules/rt2x00] Error 2
make[2]: *** [default] Error 2 ▒
│ make[2]: Leaving directory `/usr/src/modules/rt2x00' ▒
│ make[1]: *** [binary_modules] Error 2 ▒
│ make[1]: Leaving directory `/usr/src/modules/rt2x00' ▮
│ make: *** [kdist_build] Error 2