All pastes #497079 Raw Edit

Someone

public text v1 · immutable
·published 2007-05-19 16:51 UTC
rendered paste body
I followed this -> http://wiki.winehq.org/WineOn64bit#head-7a277214ee284c1915cd6c431f6369cfcde97e3c

error -> 

make[2]: Entering directory `/opt/wine-0.9.37/libs/port'
gcc -c -I. -I. -I../../include -I../../include  -D__WINESRC__ -D_REENTRANT -fPIC -Wall -pipe -fno-strict-aliasing -Wdeclaration-after-statement -Wwrite-strings -Wpointer-arith  -g -O2 -D__i386__  -o ffs.o ffs.c
gcc -c -I. -I. -I../../include -I../../include  -D__WINESRC__ -D_REENTRANT -fPIC -Wall -pipe -fno-strict-aliasing -Wdeclaration-after-statement -Wwrite-strings -Wpointer-arith  -g -O2 -D__i386__  -o fstatvfs.o fstatvfs.c
gcc -c -I. -I. -I../../include -I../../include  -D__WINESRC__ -D_REENTRANT -fPIC -Wall -pipe -fno-strict-aliasing -Wdeclaration-after-statement -Wwrite-strings -Wpointer-arith  -g -O2 -D__i386__  -o futimes.o futimes.c
gcc -c -I. -I. -I../../include -I../../include  -D__WINESRC__ -D_REENTRANT -fPIC -Wall -pipe -fno-strict-aliasing -Wdeclaration-after-statement -Wwrite-strings -Wpointer-arith  -g -O2 -D__i386__  -o getopt.o getopt.c
gcc -c -I. -I. -I../../include -I../../include  -D__WINESRC__ -D_REENTRANT -fPIC -Wall -pipe -fno-strict-aliasing -Wdeclaration-after-statement -Wwrite-strings -Wpointer-arith  -g -O2 -D__i386__  -o getopt1.o getopt1.c
gcc -c -I. -I. -I../../include -I../../include  -D__WINESRC__ -D_REENTRANT -fPIC -Wall -pipe -fno-strict-aliasing -Wdeclaration-after-statement -Wwrite-strings -Wpointer-arith  -g -O2 -D__i386__  -o getpagesize.o getpagesize.c
gcc -c -I. -I. -I../../include -I../../include  -D__WINESRC__ -D_REENTRANT -fPIC -Wall -pipe -fno-strict-aliasing -Wdeclaration-after-statement -Wwrite-strings -Wpointer-arith  -g -O2 -D__i386__  -o gettid.o gettid.c
gcc -c -I. -I. -I../../include -I../../include  -D__WINESRC__ -D_REENTRANT -fPIC -Wall -pipe -fno-strict-aliasing -Wdeclaration-after-statement -Wwrite-strings -Wpointer-arith  -g -O2 -D__i386__  -o interlocked.o interlocked.c
{standard input}: Assembler messages:
{standard input}:38: Error: suffix or operands invalid for `push'
{standard input}:39: Error: suffix or operands invalid for `push'
{standard input}:46: Error: suffix or operands invalid for `pop'
{standard input}:47: Error: suffix or operands invalid for `pop'
make[2]: *** [interlocked.o] Error 1
make[2]: Leaving directory `/opt/wine-0.9.37/libs/port'
make[1]: *** [port] Error 2
make[1]: Leaving directory `/opt/wine-0.9.37/libs'
make: *** [libs] Error 2