All pastes #495591 Raw Edit

Unnamed

public text v1 · immutable
·published 2007-05-18 20:49 UTC
rendered paste body
Wp,-MD,.deps/mozMySpell.pp mozMySpell.cpp
In file included from mozMySpell.cpp:60:
mozMySpell.h:59:24: error: hunspell.hxx: No such file or directory
mozMySpell.h:107: error: ISO C++ forbids declaration of ‘MySpell’ with no type
mozMySpell.h:107: error: expected ‘;’ before ‘*’ token
mozMySpell.h: In constructor ‘mozMySpell::mozMySpell()’:
mozMySpell.h:85: error: class ‘mozMySpell’ does not have any field named ‘mMySpell’
mozMySpell.cpp: In destructor ‘virtual mozMySpell::~mozMySpell()’:
mozMySpell.cpp:104: error: ‘mMySpell’ was not declared in this scope
mozMySpell.cpp: In member function ‘virtual nsresult mozMySpell::SetDictionary(const PRUnichar*)’:
mozMySpell.cpp:153: error: ‘mMySpell’ was not declared in this scope
mozMySpell.cpp:157: error: expected type-specifier before ‘MySpell’
mozMySpell.cpp:157: error: expected `;' before ‘MySpell’
mozMySpell.cpp: In member function ‘virtual nsresult mozMySpell::Check(const PRUnichar*, PRBool*)’:
mozMySpell.cpp:416: error: ‘mMySpell’ was not declared in this scope
mozMySpell.cpp:422: error: ‘mMySpell’ was not declared in this scope
mozMySpell.cpp: In member function ‘virtual nsresult mozMySpell::Suggest(const PRUnichar*, PRUnichar***, PRUint32*)’:
mozMySpell.cpp:436: error: ‘mMySpell’ was not declared in this scope
mozMySpell.cpp:446: error: ‘mMySpell’ was not declared in this scope
make[6]: *** [mozMySpell.o] Error 1
make[6]: Leaving directory `/home/gnomefreak/dapper_builds/firefox/2.0.0.3/firefox-2.0.0.3+1/extensions/spellcheck/myspell/src'
make[5]: *** [libs] Error 2
make[5]: Leaving directory `/home/gnomefreak/dapper_builds/firefox/2.0.0.3/firefox-2.0.0.3+1/extensions/spellcheck/myspell'
make[4]: *** [libs] Error 2
make[4]: Leaving directory `/home/gnomefreak/dapper_builds/firefox/2.0.0.3/firefox-2.0.0.3+1/extensions/spellcheck'
make[3]: *** [libs] Error 2
make[3]: Leaving directory `/home/gnomefreak/dapper_builds/firefox/2.0.0.3/firefox-2.0.0.3+1/extensions'
make[2]: *** [tier_99] Error 2
make[2]: Leaving directory `/home/gnomefreak/dapper_builds/firefox/2.0.0.3/firefox-2.0.0.3+1'
make[1]: *** [default] Error 2
make[1]: Leaving directory `/home/gnomefreak/dapper_builds/firefox/2.0.0.3/firefox-2.0.0.3+1'
make: *** [build-stamp] Error 2
(Dapper)gnomefreak@Gutsy:~/dapper_builds/firefox/2.0.0.3/firefox-2.0.0.3+1$