rendered paste bodyard.all_cc.o ksysguard.all_cc.cc
/bin/sh ../../libtool --silent --tag=CXX --mode=link i686-pc-linux-gnu-g++ -Wno-long-long -Wundef -ansi -D_XOPEN_SOURCE=500 -D_BSD_SOURCE -Wcast-align -Wconversion -Wchar-subscripts -Wall -W -Wpointer-arith -DNDEBUG -DNO_DEBUG -O2 -march=i686 -mtune=i686 -O2 -mmmx -pipe -msse -msse2 -mfpmath=sse -Wformat-security -Wmissing-format-attribute -Wno-non-virtual-dtor -fno-exceptions -fno-check-new -fno-common -DQT_CLEAN_NAMESPACE -DQT_NO_ASCII_CAST -DQT_NO_STL -DQT_NO_COMPAT -DQT_NO_TRANSLATION -o sysguard_panelapplet.la -rpath /usr/kde/3.5/lib/kde3 -module -avoid-version -module -no-undefined -Wl,--no-undefined -Wl,--allow-shlib-undefined -R /usr/kde/3.5/lib -R /usr/kde/3.5/lib -R /usr/qt/3/lib -R /usr/lib -L/usr/kde/3.5/lib -L/usr/qt/3/lib -L/usr/lib sysguard_panelapplet_la.all_cc.lo ksgrd/libksgrd.la SensorDisplayLib/libsensordisplays.la -lkdeui -lkio
/bin/sh ../../libtool --silent --tag=CXX --mode=link i686-pc-linux-gnu-g++ -Wno-long-long -Wundef -ansi -D_XOPEN_SOURCE=500 -D_BSD_SOURCE -Wcast-align -Wconversion -Wchar-subscripts -Wall -W -Wpointer-arith -DNDEBUG -DNO_DEBUG -O2 -march=i686 -mtune=i686 -O2 -mmmx -pipe -msse -msse2 -mfpmath=sse -Wformat-security -Wmissing-format-attribute -Wno-non-virtual-dtor -fno-exceptions -fno-check-new -fno-common -DQT_CLEAN_NAMESPACE -DQT_NO_ASCII_CAST -DQT_NO_STL -DQT_NO_COMPAT -DQT_NO_TRANSLATION -o ksysguard -L/usr/kde/3.5/lib -L/usr/qt/3/lib -L/usr/lib -R /usr/kde/3.5/lib -R /usr/kde/3.5/lib -R /usr/qt/3/lib -R /usr/lib ksysguard.all_cc.o ksgrd/libksgrd.la SensorDisplayLib/libsensordisplays.la -lkdeui -lkio -lkdnssd
/usr/lib/gcc/i686-pc-linux-gnu/4.1.2/../../../../i686-pc-linux-gnu/bin/ld: cannot find -lkdnssd
collect2: ld returned 1 exit status
make[4]: *** [ksysguard] Error 1
make[4]: *** Waiting for unfinished jobs....
make[4]: Leaving directory `/var/tmp/portage/kde-base/ksysguard-3.5.6-r1/work/ksysguard-3.5.6/ksysguard/gui'
make[3]: *** [all-recursive] Error 1
make[3]: Leaving directory `/var/tmp/portage/kde-base/ksysguard-3.5.6-r1/work/ksysguard-3.5.6/ksysguard/gui'
make[2]: *** [all-recursive] Error 1
make[2]: Leaving directory `/var/tmp/portage/kde-base/ksysguard-3.5.6-r1/work/ksysguard-3.5.6/ksysguard'
make[1]: *** [all-recursive] Error 1
make[1]: Leaving directory `/var/tmp/portage/kde-base/ksysguard-3.5.6-r1/work/ksysguard-3.5.6'
make: *** [all] Error 2
!!! ERROR: kde-base/ksysguard-3.5.6-r1 failed.
Call stack:
ebuild.sh, line 1615: Called dyn_compile
ebuild.sh, line 972: Called qa_call 'src_compile'
ebuild.sh, line 44: Called src_compile
ksysguard-3.5.6-r1.ebuild, line 20: Called kde-meta_src_compile
kde-meta.eclass, line 380: Called kde_src_compile
kde.eclass, line 170: Called kde_src_compile 'all'
kde.eclass, line 340: Called kde_src_compile 'myconf' 'configure' 'make'
kde.eclass, line 336: Called die
!!! died running emake, kde_src_compile:make
!!! If you need support, post the topmost build error, and the call stack if relevant.
!!! A complete build log is located at '/var/tmp/portage/kde-base/ksysguard-3.5.6-r1/temp/build.log'.