./makedrv
ieee80211/
ieee80211/license
ieee80211/ieee80211_crypt.c
ieee80211/ieee80211_tx.c
tar: ieee80211/ieee80211_tx.c: time stamp 2007-12-05 03:53:21 is 17336776 s in the future
ieee80211/ieee80211_softmac.c
tar: ieee80211/ieee80211_softmac.c: time stamp 2007-12-05 03:26:56 is 17335191 s in the future
ieee80211/ieee80211_softmac_wx.c
ieee80211/ieee80211_module.c
tar: ieee80211/ieee80211_module.c: time stamp 2007-12-03 04:07:33 is 17164828 s in the future
ieee80211/ieee80211_crypt_ccmp.c
ieee80211/ieee80211_rx.c
ieee80211/tags
tar: ieee80211/tags: time stamp 2007-12-03 04:06:42 is 17164777 s in the future
ieee80211/ieee80211_crypt_tkip.c
ieee80211/Makefile
ieee80211/readme
ieee80211/.tmp_versions/
ieee80211/.tmp_versions/ieee80211-rtl.mod
ieee80211/.tmp_versions/ieee80211_crypt_wep-rtl.mod
ieee80211/.tmp_versions/ieee80211_crypt_tkip-rtl.mod
ieee80211/.tmp_versions/ieee80211_crypt-rtl.mod
ieee80211/.tmp_versions/ieee80211_crypt_ccmp-rtl.mod
ieee80211/ieee80211_crypt_wep.c
ieee80211/ieee80211.h
tar: ieee80211/ieee80211.h: time stamp 2007-12-05 03:27:45 is 17335240 s in the future
ieee80211/ieee80211_wx.c
ieee80211/ieee80211_crypt.h
rtl8187/
rtl8187/license
rtl8187/r8180_rtl8225z2.c
rtl8187/r8180_rtl8225.h
rtl8187/r8187_led.c
rtl8187/r8180_93cx6.h
rtl8187/r8180_wx.h
rtl8187/r8180_hw.h
tar: rtl8187/r8180_hw.h: time stamp 2007-12-03 06:30:10 is 17173385 s in the future
rtl8187/copying
rtl8187/r8187_led.h
rtl8187/r8180_pm.h
rtl8187/tags
tar: rtl8187/tags: time stamp 2007-12-04 22:59:01 is 17319116 s in the future
rtl8187/r8187.h
tar: rtl8187/r8187.h: time stamp 2007-12-04 22:22:20 is 17316915 s in the future
rtl8187/Makefile
rtl8187/r8180_rtl8225.c
rtl8187/readme
rtl8187/install
rtl8187/.tmp_versions/
rtl8187/.tmp_versions/r8187.mod
rtl8187/changes
rtl8187/r8180_wx.c
rtl8187/r8180_pm.c
rtl8187/r8187_core.c
rtl8187/r8180_93cx6.c
rtl8187/authors
rtl8187/ieee80211.h
tar: rtl8187/ieee80211.h: time stamp 2007-12-05 03:50:41 is 17336616 s in the future
rtl8187/ieee80211_crypt.h
rm -f *.mod.c *.mod *.o .*.cmd *.ko *~
rm -rf /usr/src/redhat/BUILD/rtl8187_linux_26.1025.0328.2007/ieee80211/tmp
make -C /lib/modules/2.6.20-1.2948.fc6/build M=/usr/src/redhat/BUILD/rtl8187_linux_26.1025.0328.2007/ieee80211 modules
make[1]: Entering directory `/usr/src/kernels/2.6.20-1.2948.fc6-i586'
make[2]: Warning: File `/usr/src/redhat/BUILD/rtl8187_linux_26.1025.0328.2007/ieee80211/ieee80211_softmac.c' has modification time 1.7e+07 s in the future
CC [M] /usr/src/redhat/BUILD/rtl8187_linux_26.1025.0328.2007/ieee80211/ieee80211_softmac.o
/usr/src/redhat/BUILD/rtl8187_linux_26.1025.0328.2007/ieee80211/ieee80211_softmac.c: In function 'ieee80211_softmac_scan_wq':
/usr/src/redhat/BUILD/rtl8187_linux_26.1025.0328.2007/ieee80211/ieee80211_softmac.c:421: warning: passing argument 2 of 'queue_delayed_work' from incompatible pointer type
/usr/src/redhat/BUILD/rtl8187_linux_26.1025.0328.2007/ieee80211/ieee80211_softmac.c: In function 'ieee80211_softmac_stop_scan':
/usr/src/redhat/BUILD/rtl8187_linux_26.1025.0328.2007/ieee80211/ieee80211_softmac.c:495: warning: passing argument 1 of 'cancel_delayed_work' from incompatible pointer type
/usr/src/redhat/BUILD/rtl8187_linux_26.1025.0328.2007/ieee80211/ieee80211_softmac.c: In function 'ieee80211_associate_abort':
/usr/src/redhat/BUILD/rtl8187_linux_26.1025.0328.2007/ieee80211/ieee80211_softmac.c:915: warning: passing argument 2 of 'queue_delayed_work' from incompatible pointer type
/usr/src/redhat/BUILD/rtl8187_linux_26.1025.0328.2007/ieee80211/ieee80211_softmac.c: In function 'ieee80211_stop_protocol_rtl':
/usr/src/redhat/BUILD/rtl8187_linux_26.1025.0328.2007/ieee80211/ieee80211_softmac.c:2120: warning: passing argument 1 of 'cancel_delayed_work' from incompatible pointer type
/usr/src/redhat/BUILD/rtl8187_linux_26.1025.0328.2007/ieee80211/ieee80211_softmac.c:2229:78: error: macro "INIT_WORK" passed 3 arguments, but takes just 2
/usr/src/redhat/BUILD/rtl8187_linux_26.1025.0328.2007/ieee80211/ieee80211_softmac.c: In function 'ieee80211_softmac_init':
/usr/src/redhat/BUILD/rtl8187_linux_26.1025.0328.2007/ieee80211/ieee80211_softmac.c:2229: error: 'INIT_WORK' undeclared (first use in this function)
/usr/src/redhat/BUILD/rtl8187_linux_26.1025.0328.2007/ieee80211/ieee80211_softmac.c:2229: error: (Each undeclared identifier is reported only once
/usr/src/redhat/BUILD/rtl8187_linux_26.1025.0328.2007/ieee80211/ieee80211_softmac.c:2229: error: for each function it appears in.)
/usr/src/redhat/BUILD/rtl8187_linux_26.1025.0328.2007/ieee80211/ieee80211_softmac.c:2230:88: error: macro "INIT_WORK" passed 3 arguments, but takes just 2
/usr/src/redhat/BUILD/rtl8187_linux_26.1025.0328.2007/ieee80211/ieee80211_softmac.c:2231:94: error: macro "INIT_WORK" passed 3 arguments, but takes just 2
/usr/src/redhat/BUILD/rtl8187_linux_26.1025.0328.2007/ieee80211/ieee80211_softmac.c:2232:96: error: macro "INIT_WORK" passed 3 arguments, but takes just 2
/usr/src/redhat/BUILD/rtl8187_linux_26.1025.0328.2007/ieee80211/ieee80211_softmac.c:2233:82: error: macro "INIT_WORK" passed 3 arguments, but takes just 2
/usr/src/redhat/BUILD/rtl8187_linux_26.1025.0328.2007/ieee80211/ieee80211_softmac.c:2234:82: error: macro "INIT_WORK" passed 3 arguments, but takes just 2
/usr/src/redhat/BUILD/rtl8187_linux_26.1025.0328.2007/ieee80211/ieee80211_softmac.c: In function 'ieee80211_softmac_free':
/usr/src/redhat/BUILD/rtl8187_linux_26.1025.0328.2007/ieee80211/ieee80211_softmac.c:2255: warning: passing argument 1 of 'cancel_delayed_work' from incompatible pointer type
make[2]: *** [/usr/src/redhat/BUILD/rtl8187_linux_26.1025.0328.2007/ieee80211/ieee80211_softmac.o] Error 1
make[1]: *** [_module_/usr/src/redhat/BUILD/rtl8187_linux_26.1025.0328.2007/ieee80211] Error 2
make[1]: Leaving directory `/usr/src/kernels/2.6.20-1.2948.fc6-i586'
make: *** [modules] Error 2
rm -f *.mod.c *.mod *.o .*.cmd *.ko *~
rm -rf /usr/src/redhat/BUILD/rtl8187_linux_26.1025.0328.2007/rtl8187/tmp
make -C /lib/modules/2.6.20-1.2948.fc6/build M=/usr/src/redhat/BUILD/rtl8187_linux_26.1025.0328.2007/rtl8187 modules
make[1]: Entering directory `/usr/src/kernels/2.6.20-1.2948.fc6-i586'
CC [M] /usr/src/redhat/BUILD/rtl8187_linux_26.1025.0328.2007/rtl8187/r8187_core.o
In file included from /usr/src/redhat/BUILD/rtl8187_linux_26.1025.0328.2007/rtl8187/r8187_core.c:64:
/usr/src/redhat/BUILD/rtl8187_linux_26.1025.0328.2007/rtl8187/r8187.h:29:26: error: linux/config.h: No such file or directory
/usr/src/redhat/BUILD/rtl8187_linux_26.1025.0328.2007/rtl8187/r8187_core.c: In function 'rtl8187_rx_urbsubmit':
/usr/src/redhat/BUILD/rtl8187_linux_26.1025.0328.2007/rtl8187/r8187_core.c:730: warning: passing argument 6 of 'usb_fill_bulk_urb' from incompatible pointer type
/usr/src/redhat/BUILD/rtl8187_linux_26.1025.0328.2007/rtl8187/r8187_core.c: In function 'rtl8180_tx':
/usr/src/redhat/BUILD/rtl8187_linux_26.1025.0328.2007/rtl8187/r8187_core.c:1648: warning: passing argument 6 of 'usb_fill_bulk_urb' from incompatible pointer type
/usr/src/redhat/BUILD/rtl8187_linux_26.1025.0328.2007/rtl8187/r8187_core.c:2053:64: error: macro "INIT_WORK" passed 3 arguments, but takes just 2
/usr/src/redhat/BUILD/rtl8187_linux_26.1025.0328.2007/rtl8187/r8187_core.c: In function 'rtl8180_init':
/usr/src/redhat/BUILD/rtl8187_linux_26.1025.0328.2007/rtl8187/r8187_core.c:2053: error: 'INIT_WORK' undeclared (first use in this function)
/usr/src/redhat/BUILD/rtl8187_linux_26.1025.0328.2007/rtl8187/r8187_core.c:2053: error: (Each undeclared identifier is reported only once
/usr/src/redhat/BUILD/rtl8187_linux_26.1025.0328.2007/rtl8187/r8187_core.c:2053: error: for each function it appears in.)
/usr/src/redhat/BUILD/rtl8187_linux_26.1025.0328.2007/rtl8187/r8187_core.c:2054:77: error: macro "INIT_WORK" passed 3 arguments, but takes just 2
/usr/src/redhat/BUILD/rtl8187_linux_26.1025.0328.2007/rtl8187/r8187_core.c:2055:88: error: macro "INIT_WORK" passed 3 arguments, but takes just 2
/usr/src/redhat/BUILD/rtl8187_linux_26.1025.0328.2007/rtl8187/r8187_core.c:2056:80: error: macro "INIT_WORK" passed 3 arguments, but takes just 2
/usr/src/redhat/BUILD/rtl8187_linux_26.1025.0328.2007/rtl8187/r8187_core.c:2057:78: error: macro "INIT_WORK" passed 3 arguments, but takes just 2
/usr/src/redhat/BUILD/rtl8187_linux_26.1025.0328.2007/rtl8187/r8187_core.c: In function 'rtl8187_usb_probe':
/usr/src/redhat/BUILD/rtl8187_linux_26.1025.0328.2007/rtl8187/r8187_core.c:2956: error: 'struct net_device' has no member named 'get_wireless_stats'
make[2]: *** [/usr/src/redhat/BUILD/rtl8187_linux_26.1025.0328.2007/rtl8187/r8187_core.o] Error 1
make[1]: *** [_module_/usr/src/redhat/BUILD/rtl8187_linux_26.1025.0328.2007/rtl8187] Error 2
make[1]: Leaving directory `/usr/src/kernels/2.6.20-1.2948.fc6-i586'
make: *** [modules] Error 2