All pastes #494870 Raw Edit

Mine

public text v1 · immutable
·published 2007-05-18 13:32 UTC
rendered paste body
make[4]: Entering directory `/home/sasa/DEVELOPMENT/DROPLINE_GNOME/DBS/DLG/WORK/hal-0.5.9-1/hal-0.5.9/hald/linux'
Making all in probing
make[5]: Entering directory `/home/sasa/DEVELOPMENT/DROPLINE_GNOME/DBS/DLG/WORK/hal-0.5.9-1/hal-0.5.9/hald/linux/probing'
gcc -DHAVE_CONFIG_H -I. -I../../.. -DPACKAGE_SYSCONF_DIR=\""/etc"\" -DPACKAGE_DATA_DIR=\""/usr/share"\" -DPACKAGE_BIN_DIR=\""/usr/bin"\" -DPACKAGE_LOCALE_DIR=\""/usr/share/locale"\" -DPACKAGE_LOCALSTATEDIR=\""/var"\" -I../../.. -I/usr/include/glib-2.0 -I/usr/lib64/glib-2.0/include -I/usr/include/dbus-1.0 -I/usr/lib64/dbus-1.0/include   -I/usr/include/dbus-1.0 -I/usr/lib64/dbus-1.0/include        -O2 -fPIC -pipe -march=x86-64 -Wall -Wchar-subscripts -Wmissing-declarations -Wnested-externs -Wpointer-arith -Wcast-align -Wsign-compare -MT probe-input.o -MD -MP -MF .deps/probe-input.Tpo -c -o probe-input.o probe-input.c
gcc -DHAVE_CONFIG_H -I. -I../../.. -DPACKAGE_SYSCONF_DIR=\""/etc"\" -DPACKAGE_DATA_DIR=\""/usr/share"\" -DPACKAGE_BIN_DIR=\""/usr/bin"\" -DPACKAGE_LOCALE_DIR=\""/usr/share/locale"\" -DPACKAGE_LOCALSTATEDIR=\""/var"\" -I../../.. -I/usr/include/glib-2.0 -I/usr/lib64/glib-2.0/include -I/usr/include/dbus-1.0 -I/usr/lib64/dbus-1.0/include   -I/usr/include/dbus-1.0 -I/usr/lib64/dbus-1.0/include        -O2 -fPIC -pipe -march=x86-64 -Wall -Wchar-subscripts -Wmissing-declarations -Wnested-externs -Wpointer-arith -Wcast-align -Wsign-compare -MT logger.o -MD -MP -MF .deps/logger.Tpo -c -o logger.o `test -f '../../logger.c' || echo './'`../../logger.c
probe-input.c: In function `main':
probe-input.c:74: error: `SW_LID' undeclared (first use in this function)
probe-input.c:74: error: (Each undeclared identifier is reported only once
probe-input.c:74: error: for each function it appears in.)
probe-input.c:76: error: `SW_TABLET_MODE' undeclared (first use in this function)
probe-input.c:78: error: `SW_HEADPHONE_INSERT' undeclared (first use in this function)
make[5]: *** [probe-input.o] Error 1
make[5]: *** Waiting for unfinished jobs....
mv -f .deps/logger.Tpo .deps/logger.Po
make[5]: Leaving directory `/home/sasa/DEVELOPMENT/DROPLINE_GNOME/DBS/DLG/WORK/hal-0.5.9-1/hal-0.5.9/hald/linux/probing'
make[4]: *** [all-recursive] Error 1
make[4]: Leaving directory `/home/sasa/DEVELOPMENT/DROPLINE_GNOME/DBS/DLG/WORK/hal-0.5.9-1/hal-0.5.9/hald/linux'
make[3]: *** [all-recursive] Error 1
make[3]: Leaving directory `/home/sasa/DEVELOPMENT/DROPLINE_GNOME/DBS/DLG/WORK/hal-0.5.9-1/hal-0.5.9/hald'
make[2]: *** [all] Error 2
make[2]: Leaving directory `/home/sasa/DEVELOPMENT/DROPLINE_GNOME/DBS/DLG/WORK/hal-0.5.9-1/hal-0.5.9/hald'
make[1]: *** [all-recursive] Error 1
make[1]: Leaving directory `/home/sasa/DEVELOPMENT/DROPLINE_GNOME/DBS/DLG/WORK/hal-0.5.9-1/hal-0.5.9'
make: *** [all] Error 2
Error!  make exited with status: 2
Failed package hal