rendered paste bodyccache mips-linux-uclibc-gcc -Wmissing-declarations -Wmissing-prototypes -Os -pipe -mips32 -mtune=mips32 -funit-at-a-time -I/home/ubuntu/test/staging_dir_mips/usr/include -I/home/ubuntu/test/staging_dir_mips/include -Wall -g -o .libs/print-camera-list print-camera-list.o -L/home/ubuntu/test/staging_dir_mips/usr/lib -L/home/ubuntu/test/staging_dir_mips/lib -L/home/ubuntu/test/staging_dir_mips/usr/lib/libiconv/lib ../../libgphoto2/.libs/libgphoto2.so ../../libgphoto2_port/libgphoto2_port/.libs/libgphoto2_port.so -lexif -lltdl
creating print-camera-list
make[6]: Leaving directory `/home/ubuntu/test/build_mips/libgphoto2-2.3.1/packaging/generic'
Making all in rpm
make[6]: Entering directory `/home/ubuntu/test/build_mips/libgphoto2-2.3.1/packaging/rpm'
make[6]: Nothing to be done for `all'.
make[6]: Leaving directory `/home/ubuntu/test/build_mips/libgphoto2-2.3.1/packaging/rpm'
make[6]: Entering directory `/home/ubuntu/test/build_mips/libgphoto2-2.3.1/packaging'
make[6]: Nothing to be done for `all-am'.
make[6]: Leaving directory `/home/ubuntu/test/build_mips/libgphoto2-2.3.1/packaging'
make[5]: Leaving directory `/home/ubuntu/test/build_mips/libgphoto2-2.3.1/packaging'
Making all in doc
make[5]: Entering directory `/home/ubuntu/test/build_mips/libgphoto2-2.3.1/doc'
Making all in api
make[6]: Entering directory `/home/ubuntu/test/build_mips/libgphoto2-2.3.1/doc/api'
Dummy target all-local.
make[6]: Leaving directory `/home/ubuntu/test/build_mips/libgphoto2-2.3.1/doc/api'
make[6]: Entering directory `/home/ubuntu/test/build_mips/libgphoto2-2.3.1/doc'
make[6]: Nothing to be done for `all-am'.
make[6]: Leaving directory `/home/ubuntu/test/build_mips/libgphoto2-2.3.1/doc'
make[5]: Leaving directory `/home/ubuntu/test/build_mips/libgphoto2-2.3.1/doc'
make[5]: Entering directory `/home/ubuntu/test/build_mips/libgphoto2-2.3.1'
make[5]: Nothing to be done for `all-am'.
make[5]: Leaving directory `/home/ubuntu/test/build_mips/libgphoto2-2.3.1'
make[4]: Leaving directory `/home/ubuntu/test/build_mips/libgphoto2-2.3.1'
make[3]: Leaving directory `/home/ubuntu/test/build_mips/libgphoto2-2.3.1'
make[2]: *** [/home/ubuntu/test/build_mips/libgphoto2-2.3.1/.built] Error 2
make[2]: Leaving directory `/home/ubuntu/test/feeds/packages/libs/libgphoto2'
make[1]: *** [libgphoto2-compile] Error 2
make[1]: Leaving directory `/home/ubuntu/test/package'
make: *** [package/libgphoto2-compile] Fehler 2