rendered paste bodyccache mips-linux-uclibc-gcc -Wmissing-declarations -Wmissing-prototypes -Os -pipe -mips32 -mtune=mips32 -funit-at-a-time -I/home/ubuntu/test/staging_dir_mips/usr/include -I/home/ubuntu/test/staging_dir_mips/include -Wall -g -o .libs/test-gphoto2 test-gphoto2.o -L/home/ubuntu/test/staging_dir_mips/usr/lib -L/home/ubuntu/test/staging_dir_mips/lib -L/home/ubuntu/test/staging_dir_mips/usr/lib/libiconv/lib ../libgphoto2/.libs/libgphoto2.so ../libgphoto2_port/libgphoto2_port/.libs/libgphoto2_port.so -lexif -lltdl
creating test-gphoto2
ccache mips-linux-uclibc-gcc -Wmissing-declarations -Wmissing-prototypes -Os -pipe -mips32 -mtune=mips32 -funit-at-a-time -I/home/ubuntu/test/staging_dir_mips/usr/include -I/home/ubuntu/test/staging_dir_mips/include -Wall -g -o .libs/test-filesys test-filesys.o -L/home/ubuntu/test/staging_dir_mips/usr/lib -L/home/ubuntu/test/staging_dir_mips/lib -L/home/ubuntu/test/staging_dir_mips/usr/lib/libiconv/lib ../libgphoto2/.libs/libgphoto2.so ../libgphoto2_port/libgphoto2_port/.libs/libgphoto2_port.so -lexif -lltdl
creating test-filesys
make[6]: Leaving directory `/home/ubuntu/test/build_mips/libgphoto2-2.3.1/tests'
make[5]: Leaving directory `/home/ubuntu/test/build_mips/libgphoto2-2.3.1/tests'
Making all in po
make[5]: Entering directory `/home/ubuntu/test/build_mips/libgphoto2-2.3.1/po'
make[5]: Nothing to be done for `all'.
make[5]: Leaving directory `/home/ubuntu/test/build_mips/libgphoto2-2.3.1/po'
Making all in packaging
make[5]: Entering directory `/home/ubuntu/test/build_mips/libgphoto2-2.3.1/packaging'
Making all in linux-hotplug
make[6]: Entering directory `/home/ubuntu/test/build_mips/libgphoto2-2.3.1/packaging/linux-hotplug'
make[6]: Nothing to be done for `all'.
make[6]: Leaving directory `/home/ubuntu/test/build_mips/libgphoto2-2.3.1/packaging/linux-hotplug'
Making all in generic
make[6]: Entering directory `/home/ubuntu/test/build_mips/libgphoto2-2.3.1/packaging/generic'
if ccache mips-linux-uclibc-gcc -DHAVE_CONFIG_H -I. -I. -I../.. -I/home/ubuntu/test/staging_dir_mips/usr/include -I/home/ubuntu/test/staging_dir_mips/include -I/home/ubuntu/test/staging_dir_mips/usr/include -I/home/ubuntu/test/staging_dir_mips/include -I/home/ubuntu/test/staging_dir_mips/usr/lib/libiconv/include -I../.. -I../.. -I../../libgphoto2_port -I../../libgphoto2 -I../../libgphoto2 -DLOCALEDIR=\"/usr/share/locale\" -DCAMLIBS=\"/usr/lib/libgphoto2/2.3.1\" -Wall -g -D_GPHOTO2_INTERNAL_CODE -I/home/ubuntu/test/staging_dir_mips/usr/include -I/home/ubuntu/test/staging_dir_mips/include -I/home/ubuntu/test/staging_dir_mips/usr/include -I/home/ubuntu/test/staging_dir_mips/include -I/home/ubuntu/test/staging_dir_mips/usr/lib/libiconv/include -Wmissing-declarations -Wmissing-prototypes -Os -pipe -mips32 -mtune=mips32 -funit-at-a-time -I/home/ubuntu/test/staging_dir_mips/usr/include -I/home/ubuntu/test/staging_dir_mips/include -MT print-camera-list.o -MD -MP -MF ".deps/print-camera-list.Tpo" -c -o print-camera-list.o print-camera-list.c; \
then mv -f ".deps/print-camera-list.Tpo" ".deps/print-camera-list.Po"; else rm -f ".deps/print-camera-list.Tpo"; exit 1; fi
/bin/bash ../../libtool --tag=CC --mode=link ccache mips-linux-uclibc-gcc -Wmissing-declarations -Wmissing-prototypes -Os -pipe -mips32 -mtune=mips32 -funit-at-a-time -I/home/ubuntu/test/staging_dir_mips/usr/include -I/home/ubuntu/test/staging_dir_mips/include -Wall -g -L/home/ubuntu/test/staging_dir_mips/usr/lib -L/home/ubuntu/test/staging_dir_mips/lib -L/home/ubuntu/test/staging_dir_mips/usr/lib/libiconv/lib -o print-camera-list print-camera-list.o ../../libgphoto2/libgphoto2.la ../../libgphoto2_port/libgphoto2_port/libgphoto2_port.la -L/home/ubuntu/test/staging_dir_mips/usr/lib -L/home/ubuntu/test/staging_dir_mips/lib -L/home/ubuntu/test/staging_dir_mips/usr/lib/libiconv/lib -lexif -lltdl
mkdir .libs
ccache mips-linux-uclibc-gcc -Wmissing-declarations -Wmissing-prototypes -Os -pipe -mips32 -mtune=mips32 -funit-at-a-time -I/home/ubuntu/test/staging_dir_mips/usr/include -I/home/ubuntu/test/staging_dir_mips/include -Wall -g -o .libs/print-camera-list print-camera-list.o -L/home/ubuntu/test/staging_dir_mips/usr/lib -L/home/ubuntu/test/staging_dir_mips/lib -L/home/ubuntu/test/staging_dir_mips/usr/lib/libiconv/lib ../../libgphoto2/.libs/libgphoto2.so ../../libgphoto2_port/libgphoto2_port/.libs/libgphoto2_port.so -lexif -lltdl
creating print-camera-list
make[6]: Leaving directory `/home/ubuntu/test/build_mips/libgphoto2-2.3.1/packaging/generic'
Making all in rpm
make[6]: Entering directory `/home/ubuntu/test/build_mips/libgphoto2-2.3.1/packaging/rpm'
make[6]: Nothing to be done for `all'.
make[6]: Leaving directory `/home/ubuntu/test/build_mips/libgphoto2-2.3.1/packaging/rpm'
make[6]: Entering directory `/home/ubuntu/test/build_mips/libgphoto2-2.3.1/packaging'
make[6]: Nothing to be done for `all-am'.
make[6]: Leaving directory `/home/ubuntu/test/build_mips/libgphoto2-2.3.1/packaging'
make[5]: Leaving directory `/home/ubuntu/test/build_mips/libgphoto2-2.3.1/packaging'
Making all in doc
make[5]: Entering directory `/home/ubuntu/test/build_mips/libgphoto2-2.3.1/doc'
Making all in api
make[6]: Entering directory `/home/ubuntu/test/build_mips/libgphoto2-2.3.1/doc/api'
Dummy target all-local.
make[6]: Leaving directory `/home/ubuntu/test/build_mips/libgphoto2-2.3.1/doc/api'
make[6]: Entering directory `/home/ubuntu/test/build_mips/libgphoto2-2.3.1/doc'
make[6]: Nothing to be done for `all-am'.
make[6]: Leaving directory `/home/ubuntu/test/build_mips/libgphoto2-2.3.1/doc'
make[5]: Leaving directory `/home/ubuntu/test/build_mips/libgphoto2-2.3.1/doc'
make[5]: Entering directory `/home/ubuntu/test/build_mips/libgphoto2-2.3.1'
make[5]: Nothing to be done for `all-am'.
make[5]: Leaving directory `/home/ubuntu/test/build_mips/libgphoto2-2.3.1'
make[4]: Leaving directory `/home/ubuntu/test/build_mips/libgphoto2-2.3.1'
make[3]: Leaving directory `/home/ubuntu/test/build_mips/libgphoto2-2.3.1'
make[2]: *** [/home/ubuntu/test/build_mips/libgphoto2-2.3.1/.built] Error 2
make[2]: Leaving directory `/home/ubuntu/test/feeds/packages/libs/libgphoto2'
make[1]: *** [libgphoto2-compile] Error 2
make[1]: Leaving directory `/home/ubuntu/test/package'
make: *** [package/libgphoto2-compile] Fehler 2