rendered paste body/assert/assert.o -MD -MP -MF /usr/local/redhat/glibc-build/assert/assert.o.dt -MT /usr/local/redhat/glibc-build/assert/assert.o
In file included from ../include/pthread.h:1,
from ../sysdeps/unix/sysv/linux/fatal-prepare.h:19,
from assert.c:42:
/usr/include/pthread.h:163: syntax error before '*' token
/usr/include/pthread.h:165: `pthread_create' declared as function returning a function
/usr/include/pthread.h:166: syntax error before "void"
/usr/include/pthread.h:169: syntax error before "pthread_self"
/usr/include/pthread.h:172: syntax error before "__thread1"
/usr/include/pthread.h:180: syntax error before "__th"
/usr/include/pthread.h:186: syntax error before "__th"
/usr/include/pthread.h:194: syntax error before '*' token
/usr/include/pthread.h:197: syntax error before '*' token
/usr/include/pthread.h:200: syntax error before '*' token
/usr/include/pthread.h:204: syntax error before '*' token
/usr/include/pthread.h:208: syntax error before '*' token
/usr/include/pthread.h:213: syntax error before '*' token
/usr/include/pthread.h:219: syntax error before '*' token
/usr/include/pthread.h:223: syntax error before '*' token
/usr/include/pthread.h:228: syntax error before '*' token
/usr/include/pthread.h:232: syntax error before '*' token
/usr/include/pthread.h:237: syntax error before '*' token
/usr/include/pthread.h:241: syntax error before '*' token
/usr/include/pthread.h:246: syntax error before '*' token
/usr/include/pthread.h:250: syntax error before '*' token
/usr/include/pthread.h:259: syntax error before '*' token
/usr/include/pthread.h:263: syntax error before '*' token
/usr/include/pthread.h:271: syntax error before '*' token
/usr/include/pthread.h:275: syntax error before '*' token
/usr/include/pthread.h:283: syntax error before '*' token
/usr/include/pthread.h:287: syntax error before '*' token
/usr/include/pthread.h:295: syntax error before "__th"
/usr/include/pthread.h:302: syntax error before "__target_thread"
/usr/include/pthread.h:307: syntax error before "__target_thread"
/usr/include/pthread.h:332: syntax error before '*' token
/usr/include/pthread.h:337: syntax error before '*' token
/usr/include/pthread.h:340: syntax error before '*' token
/usr/include/pthread.h:343: syntax error before '*' token
/usr/include/pthread.h:347: syntax error before '*' token
/usr/include/pthread.h:353: syntax error before '*' token
/usr/include/pthread.h:360: syntax error before '*' token
/usr/include/pthread.h:363: syntax error before '*' token
/usr/include/pthread.h:366: syntax error before '*' token
/usr/include/pthread.h:371: syntax error before '*' token
/usr/include/pthread.h:378: syntax error before '*' token
/usr/include/pthread.h:382: syntax error before '*' token
/usr/include/pthread.h:391: syntax error before '*' token
/usr/include/pthread.h:396: syntax error before '*' token
/usr/include/pthread.h:399: syntax error before '*' token
/usr/include/pthread.h:402: syntax error before '*' token
/usr/include/pthread.h:406: syntax error before '*' token
/usr/include/pthread.h:413: syntax error before '*' token
/usr/include/pthread.h:421: syntax error before '*' token
/usr/include/pthread.h:424: syntax error before '*' token
/usr/include/pthread.h:427: syntax error before '*' token
/usr/include/pthread.h:432: syntax error before '*' token
/usr/include/pthread.h:441: syntax error before '*' token
/usr/include/pthread.h:446: syntax error before '*' token
/usr/include/pthread.h:449: syntax error before '*' token
/usr/include/pthread.h:452: syntax error before '*' token
/usr/include/pthread.h:456: syntax error before '*' token
/usr/include/pthread.h:462: syntax error before '*' token
/usr/include/pthread.h:465: syntax error before '*' token
/usr/include/pthread.h:469: syntax error before '*' token
/usr/include/pthread.h:475: syntax error before '*' token
/usr/include/pthread.h:481: syntax error before '*' token
/usr/include/pthread.h:484: syntax error before '*' token
/usr/include/pthread.h:487: syntax error before '*' token
/usr/include/pthread.h:492: syntax error before '*' token
/usr/include/pthread.h:496: syntax error before '*' token
/usr/include/pthread.h:500: syntax error before '*' token
/usr/include/pthread.h:510: syntax error before '*' token
/usr/include/pthread.h:514: syntax error before '*' token
/usr/include/pthread.h:517: syntax error before '*' token
/usr/include/pthread.h:520: syntax error before '*' token
/usr/include/pthread.h:523: syntax error before '*' token
/usr/include/pthread.h:528: syntax error before '*' token
/usr/include/pthread.h:532: syntax error before '*' token
/usr/include/pthread.h:534: syntax error before '*' token
/usr/include/pthread.h:536: syntax error before '*' token
/usr/include/pthread.h:538: syntax error before '*' token
/usr/include/pthread.h:542: syntax error before '*' token
/usr/include/pthread.h:545: syntax error before '*' token
/usr/include/pthread.h:557: syntax error before '*' token
/usr/include/pthread.h:558: syntax error before ')' token
/usr/include/pthread.h:561: syntax error before "__key"
/usr/include/pthread.h:564: syntax error before "__key"
/usr/include/pthread.h:568: syntax error before "__key"
/usr/include/pthread.h:580: syntax error before '*' token
/usr/include/pthread.h:581: syntax error before ')' token
/usr/include/pthread.h:595: syntax error before "__cancelthread"
/usr/include/pthread.h:653: syntax error before "__thread_id"
make[2]: *** [/usr/local/redhat/glibc-build/assert/assert.o] Error 1
make[2]: Leaving directory `/usr/local/redhat/glibc-2.3.4/assert'
make[1]: *** [assert/subdir_lib] Error 2
make[1]: Leaving directory `/usr/local/redhat/glibc-2.3.4'
make: *** [all] Error 2
[redhat@plesk glibc-build]$