All pastes #49170 Raw Edit

helpme

public text v1 · immutable
#49170 ·published 2006-04-12 15:27 UTC
rendered paste body
  LD      sound/isa/built-in.o
  LD      sound/mips/built-in.o
  LD      sound/oss/built-in.o
  LD      sound/oss/dmasound/built-in.o
  CC [M]  sound/oss/dmasound/dmasound_core.o
  CC [M]  sound/oss/dmasound/dmasound_awacs.o
sound/oss/dmasound/dmasound_awacs.c:263: warning: 'struct pmu_sleep_notifier' declared inside parameter list
sound/oss/dmasound/dmasound_awacs.c:263: warning: its scope is only this definition or declaration, which is probably not what you want
sound/oss/dmasound/dmasound_awacs.c:264: error: variable 'awacs_sleep_notifier' has initializer but incomplete type
sound/oss/dmasound/dmasound_awacs.c:265: warning: excess elements in struct initializer
sound/oss/dmasound/dmasound_awacs.c:265: warning: (near initialization for 'awacs_sleep_notifier')
sound/oss/dmasound/dmasound_awacs.c:265: error: 'SLEEP_LEVEL_SOUND' undeclared here (not in a function)
sound/oss/dmasound/dmasound_awacs.c:265: warning: excess elements in struct initializer
sound/oss/dmasound/dmasound_awacs.c:265: warning: (near initialization for 'awacs_sleep_notifier')
sound/oss/dmasound/dmasound_awacs.c: In function 'PMacIrqCleanup':
sound/oss/dmasound/dmasound_awacs.c:683: warning: implicit declaration of function 'pmu_unregister_sleep_notifier'
sound/oss/dmasound/dmasound_awacs.c: At top level:
sound/oss/dmasound/dmasound_awacs.c:1428: error: conflicting types for 'awacs_sleep_notify'
sound/oss/dmasound/dmasound_awacs.c:263: error: previous declaration of 'awacs_sleep_notify' was here
sound/oss/dmasound/dmasound_awacs.c: In function 'awacs_sleep_notify':
sound/oss/dmasound/dmasound_awacs.c:1432: error: 'PBOOK_SLEEP_NOW' undeclared (first use in this function)
sound/oss/dmasound/dmasound_awacs.c:1432: error: (Each undeclared identifier is reported only once
sound/oss/dmasound/dmasound_awacs.c:1432: error: for each function it appears in.)
sound/oss/dmasound/dmasound_awacs.c:1485: error: 'PBOOK_WAKE' undeclared (first use in this function)
sound/oss/dmasound/dmasound_awacs.c:1556: error: 'PBOOK_SLEEP_OK' undeclared (first use in this function)
sound/oss/dmasound/dmasound_awacs.c: In function 'dmasound_awacs_init':
sound/oss/dmasound/dmasound_awacs.c:3080: warning: implicit declaration of function 'pmu_register_sleep_notifier'
make[3]: *** [sound/oss/dmasound/dmasound_awacs.o] Error 1
make[2]: *** [sound/oss/dmasound] Error 2
make[1]: *** [sound/oss] Error 2
make: *** [sound] Error 2
mini:/usr/src/linux#