All pastes #49158 Raw Edit

root

public text v1 · immutable
#49158 ·published 2006-04-12 13:55 UTC
rendered paste body
This file contains any messages produced by compilers whilerunning configure, to aid debugging if configure makes a mistake.It was created by configure, which wasgenerated by GNU Autoconf 2.59.  Invocation command line was  $ ./configure --prefix=/usr --host=i686-pc-linux-gnu --mandir=/usr/share/man --infodir=/usr/share/info --datadir=/usr/share --sysconfdir=/etc --localstatedir=/var/lib --enable-everything --enable-xft --enable-perl --disable-text-blink --disable-iso14755 --build=i686-pc-linux-gnu## --------- #### Platform. #### --------- ##hostname = umbrauname -m = i686uname -r = 2.6.17-rc1uname -s = Linuxuname -v = #1 Sat Apr 8 05:03:47 CDT 2006/usr/bin/uname -p = Mobile Pentium II/bin/uname -X     = unknown/bin/arch              = i686/usr/bin/arch -k       = unknown/usr/convex/getsysinfo = unknownhostinfo               = unknown/bin/machine           = unknown/usr/bin/oslevel       = unknown/bin/universe          = unknownPATH: /usr/local/sbinPATH: /sbinPATH: /usr/sbinPATH: /usr/lib/portage/binPATH: /usr/local/binPATH: /binPATH: /usr/binPATH: /opt/binPATH: /usr/i686-pc-linux-gnu/gcc-bin/4.1.0PATH: /usr/i386-pc-linux-gnu/gcc-bin/3.3.5-20050130## ----------- #### Core tests. #### ----------- ##configure:1404: checking build system typeconfigure:1422: result: i686-pc-linux-gnuconfigure:1430: checking host system typeconfigure:1444: result: i686-pc-linux-gnuconfigure:1470: checking for i686-pc-linux-gnu-gccconfigure:1486: found /usr/bin/i686-pc-linux-gnu-gccconfigure:1496: result: i686-pc-linux-gnu-gccconfigure:1778: checking for C compiler versionconfigure:1781: i686-pc-linux-gnu-gcc --version </dev/null >&5i686-pc-linux-gnu-gcc (GCC) 4.1.0 (Gentoo 4.1.0)Copyright (C) 2006 Free Software Foundation, Inc.This is free software; see the source for copying conditions.  There is NOwarranty; not even for MERCHANTABILITY or FITNESS FOR A PARTICULAR PURPOSE.configure:1784: $? = 0configure:1786: i686-pc-linux-gnu-gcc -v </dev/null >&5Using built-in specs.Target: i686-pc-linux-gnuConfigured with: /var/tmp/portage/gcc-4.1.0/work/gcc-4.1.0/configure --prefix=/usr --bindir=/usr/i686-pc-linux-gnu/gcc-bin/4.1.0 --includedir=/usr/lib/gcc/i686-pc-linux-gnu/4.1.0/include --datadir=/usr/share/gcc-data/i686-pc-linux-gnu/4.1.0 --mandir=/usr/share/gcc-data/i686-pc-linux-gnu/4.1.0/man --infodir=/usr/share/gcc-data/i686-pc-linux-gnu/4.1.0/info --with-gxx-include-dir=/usr/lib/gcc/i686-pc-linux-gnu/4.1.0/include/g++-v4 --host=i686-pc-linux-gnu --build=i686-pc-linux-gnu --disable-altivec --enable-nls --without-included-gettext --with-system-zlib --disable-checking --disable-werror --disable-libunwind-exceptions --disable-multilib --disable-libmudflap --disable-libssp --disable-libgcj --enable-languages=c,c++,fortran --enable-shared --enable-threads=posix --enable-__cxa_atexit --enable-clocale=gnuThread model: posixgcc version 4.1.0 (Gentoo 4.1.0)configure:1789: $? = 0configure:1791: i686-pc-linux-gnu-gcc -V </dev/null >&5i686-pc-linux-gnu-gcc: '-V' option must have argumentconfigure:1794: $? = 1configure:1817: checking for C compiler default output file nameconfigure:1820: i686-pc-linux-gnu-gcc -march=pentium2 -O2 -fomit-frame-pointer -pipe  -Wl,--as-needed conftest.c  >&5configure:1823: $? = 0configure:1869: result: a.outconfigure:1874: checking whether the C compiler worksconfigure:1880: ./a.outconfigure:1883: $? = 0configure:1900: result: yesconfigure:1907: checking whether we are cross compilingconfigure:1909: result: noconfigure:1912: checking for suffix of executablesconfigure:1914: i686-pc-linux-gnu-gcc -o conftest -march=pentium2 -O2 -fomit-frame-pointer -pipe  -Wl,--as-needed conftest.c  >&5configure:1917: $? = 0configure:1942: result: configure:1948: checking for suffix of object filesconfigure:1969: i686-pc-linux-gnu-gcc -c -march=pentium2 -O2 -fomit-frame-pointer -pipe  conftest.c >&5configure:1972: $? = 0configure:1994: result: oconfigure:1998: checking whether we are using the GNU C compilerconfigure:2022: i686-pc-linux-gnu-gcc -c -march=pentium2 -O2 -fomit-frame-pointer -pipe  conftest.c >&5configure:2028: $? = 0configure:2031: test -z 			 || test ! -s conftest.errconfigure:2034: $? = 0configure:2037: test -s conftest.oconfigure:2040: $? = 0configure:2053: result: yesconfigure:2059: checking whether i686-pc-linux-gnu-gcc accepts -gconfigure:2080: i686-pc-linux-gnu-gcc -c -g  conftest.c >&5configure:2086: $? = 0configure:2089: test -z 			 || test ! -s conftest.errconfigure:2092: $? = 0configure:2095: test -s conftest.oconfigure:2098: $? = 0configure:2109: result: yesconfigure:2126: checking for i686-pc-linux-gnu-gcc option to accept ANSI Cconfigure:2196: i686-pc-linux-gnu-gcc  -c -march=pentium2 -O2 -fomit-frame-pointer -pipe  conftest.c >&5configure:2202: $? = 0configure:2205: test -z 			 || test ! -s conftest.errconfigure:2208: $? = 0configure:2211: test -s conftest.oconfigure:2214: $? = 0configure:2232: result: none neededconfigure:2250: i686-pc-linux-gnu-gcc -c -march=pentium2 -O2 -fomit-frame-pointer -pipe  conftest.c >&5conftest.c:2: error: expected '=', ',', ';', 'asm' or '__attribute__' before 'me'configure:2256: $? = 1configure: failed program was:| #ifndef __cplusplus|   choke me| #endifconfigure:2396: checking for i686-pc-linux-gnu-g++configure:2412: found /usr/bin/i686-pc-linux-gnu-g++configure:2422: result: i686-pc-linux-gnu-g++configure:2480: checking for C++ compiler versionconfigure:2483: i686-pc-linux-gnu-g++ --version </dev/null >&5i686-pc-linux-gnu-g++ (GCC) 4.1.0 (Gentoo 4.1.0)Copyright (C) 2006 Free Software Foundation, Inc.This is free software; see the source for copying conditions.  There is NOwarranty; not even for MERCHANTABILITY or FITNESS FOR A PARTICULAR PURPOSE.configure:2486: $? = 0configure:2488: i686-pc-linux-gnu-g++ -v </dev/null >&5Using built-in specs.Target: i686-pc-linux-gnuConfigured with: /var/tmp/portage/gcc-4.1.0/work/gcc-4.1.0/configure --prefix=/usr --bindir=/usr/i686-pc-linux-gnu/gcc-bin/4.1.0 --includedir=/usr/lib/gcc/i686-pc-linux-gnu/4.1.0/include --datadir=/usr/share/gcc-data/i686-pc-linux-gnu/4.1.0 --mandir=/usr/share/gcc-data/i686-pc-linux-gnu/4.1.0/man --infodir=/usr/share/gcc-data/i686-pc-linux-gnu/4.1.0/info --with-gxx-include-dir=/usr/lib/gcc/i686-pc-linux-gnu/4.1.0/include/g++-v4 --host=i686-pc-linux-gnu --build=i686-pc-linux-gnu --disable-altivec --enable-nls --without-included-gettext --with-system-zlib --disable-checking --disable-werror --disable-libunwind-exceptions --disable-multilib --disable-libmudflap --disable-libssp --disable-libgcj --enable-languages=c,c++,fortran --enable-shared --enable-threads=posix --enable-__cxa_atexit --enable-clocale=gnuThread model: posixgcc version 4.1.0 (Gentoo 4.1.0)configure:2491: $? = 0configure:2493: i686-pc-linux-gnu-g++ -V </dev/null >&5i686-pc-linux-gnu-g++: '-V' option must have argumentconfigure:2496: $? = 1configure:2499: checking whether we are using the GNU C++ compilerconfigure:2523: i686-pc-linux-gnu-g++ -c -march=pentium2 -O2 -fomit-frame-pointer -pipe  conftest.cc >&5configure:2529: $? = 0configure:2532: test -z 			 || test ! -s conftest.errconfigure:2535: $? = 0configure:2538: test -s conftest.oconfigure:2541: $? = 0configure:2554: result: yesconfigure:2560: checking whether i686-pc-linux-gnu-g++ accepts -gconfigure:2581: i686-pc-linux-gnu-g++ -c -g  conftest.cc >&5configure:2587: $? = 0configure:2590: test -z 			 || test ! -s conftest.errconfigure:2593: $? = 0configure:2596: test -s conftest.oconfigure:2599: $? = 0configure:2610: result: yesconfigure:2652: i686-pc-linux-gnu-g++ -c -march=pentium2 -O2 -fomit-frame-pointer -pipe  conftest.cc >&5configure:2658: $? = 0configure:2661: test -z 			 || test ! -s conftest.errconfigure:2664: $? = 0configure:2667: test -s conftest.oconfigure:2670: $? = 0configure:2696: i686-pc-linux-gnu-g++ -c -march=pentium2 -O2 -fomit-frame-pointer -pipe  conftest.cc >&5conftest.cc: In function 'int main()':conftest.cc:13: error: 'exit' was not declared in this scopeconfigure:2702: $? = 1configure: failed program was:| /* confdefs.h.  */| | #define PACKAGE_NAME ""| #define PACKAGE_TARNAME ""| #define PACKAGE_VERSION ""| #define PACKAGE_STRING ""| #define PACKAGE_BUGREPORT ""| /* end confdefs.h.  */| | int| main ()| {| exit (42);|   ;|   return 0;| }configure:2652: i686-pc-linux-gnu-g++ -c -march=pentium2 -O2 -fomit-frame-pointer -pipe  conftest.cc >&5configure:2658: $? = 0configure:2661: test -z 			 || test ! -s conftest.errconfigure:2664: $? = 0configure:2667: test -s conftest.oconfigure:2670: $? = 0configure:2696: i686-pc-linux-gnu-g++ -c -march=pentium2 -O2 -fomit-frame-pointer -pipe  conftest.cc >&5configure:2702: $? = 0configure:2705: test -z 			 || test ! -s conftest.errconfigure:2708: $? = 0configure:2711: test -s conftest.oconfigure:2714: $? = 0configure:2742: checking how to run the C preprocessorconfigure:2777: i686-pc-linux-gnu-gcc -E  conftest.cconfigure:2783: $? = 0configure:2815: i686-pc-linux-gnu-gcc -E  conftest.cconftest.c:12:28: error: ac_nonexistent.h: No such file or directoryconfigure:2821: $? = 1configure: failed program was:| /* confdefs.h.  */| | #define PACKAGE_NAME ""| #define PACKAGE_TARNAME ""| #define PACKAGE_VERSION ""| #define PACKAGE_STRING ""| #define PACKAGE_BUGREPORT ""| #ifdef __cplusplus| extern "C" void std::exit (int) throw (); using std::exit;| #endif| /* end confdefs.h.  */| #include <ac_nonexistent.h>configure:2860: result: i686-pc-linux-gnu-gcc -Econfigure:2884: i686-pc-linux-gnu-gcc -E  conftest.cconfigure:2890: $? = 0configure:2922: i686-pc-linux-gnu-gcc -E  conftest.cconftest.c:12:28: error: ac_nonexistent.h: No such file or directoryconfigure:2928: $? = 1configure: failed program was:| /* confdefs.h.  */| | #define PACKAGE_NAME ""| #define PACKAGE_TARNAME ""| #define PACKAGE_VERSION ""| #define PACKAGE_STRING ""| #define PACKAGE_BUGREPORT ""| #ifdef __cplusplus| extern "C" void std::exit (int) throw (); using std::exit;| #endif| /* end confdefs.h.  */| #include <ac_nonexistent.h>configure:2984: checking for a BSD-compatible installconfigure:3039: result: /bin/install -cconfigure:3053: checking for egrepconfigure:3063: result: grep -Econfigure:3069: checking for AIXconfigure:3091: result: noconfigure:3097: checking for library containing strerrorconfigure:3127: i686-pc-linux-gnu-gcc -o conftest -march=pentium2 -O2 -fomit-frame-pointer -pipe  -Wl,--as-needed conftest.c  >&5configure:3133: $? = 0configure:3136: test -z 			 || test ! -s conftest.errconfigure:3139: $? = 0configure:3142: test -s conftestconfigure:3145: $? = 0configure:3214: result: none requiredconfigure:3229: checking for working libsupc++configure:3253: i686-pc-linux-gnu-gcc -o conftest -march=pentium2 -O2 -fomit-frame-pointer -pipe  -Wl,--as-needed conftest.cc  -lsupc++ >&5configure:3259: $? = 0configure:3262: test -z 			 || test ! -s conftest.errconfigure:3265: $? = 0configure:3268: test -s conftestconfigure:3271: $? = 0configure:3273: result: okconfigure:3374: checking for setlocaleconfigure:3431: i686-pc-linux-gnu-g++ -o conftest -march=pentium2 -O2 -fomit-frame-pointer -pipe  -Wl,--as-needed conftest.cc  -lsupc++ >&5/usr/lib/gcc/i686-pc-linux-gnu/4.1.0/../../../../i686-pc-linux-gnu/bin/ld: BFD 2.16.1 assertion fail /var/tmp/portage/binutils-2.16.1-r2/work/binutils-2.16.1/bfd/elflink.c:2356/usr/lib/gcc/i686-pc-linux-gnu/4.1.0/../../../../i686-pc-linux-gnu/bin/ld: BFD 2.16.1 assertion fail /var/tmp/portage/binutils-2.16.1-r2/work/binutils-2.16.1/bfd/elflink.c:2357/usr/lib/gcc/i686-pc-linux-gnu/4.1.0/../../../../i686-pc-linux-gnu/bin/ld: BFD 2.16.1 assertion fail /var/tmp/portage/binutils-2.16.1-r2/work/binutils-2.16.1/bfd/elflink.c:2356/usr/lib/gcc/i686-pc-linux-gnu/4.1.0/../../../../i686-pc-linux-gnu/bin/ld: BFD 2.16.1 assertion fail /var/tmp/portage/binutils-2.16.1-r2/work/binutils-2.16.1/bfd/elflink.c:2357/usr/lib/gcc/i686-pc-linux-gnu/4.1.0/../../../../i686-pc-linux-gnu/bin/ld: BFD 2.16.1 assertion fail /var/tmp/portage/binutils-2.16.1-r2/work/binutils-2.16.1/bfd/elflink.c:2356/usr/lib/gcc/i686-pc-linux-gnu/4.1.0/../../../../i686-pc-linux-gnu/bin/ld: BFD 2.16.1 assertion fail /var/tmp/portage/binutils-2.16.1-r2/work/binutils-2.16.1/bfd/elflink.c:2357/usr/lib/gcc/i686-pc-linux-gnu/4.1.0/../../../../i686-pc-linux-gnu/bin/ld: BFD 2.16.1 assertion fail /var/tmp/portage/binutils-2.16.1-r2/work/binutils-2.16.1/bfd/elflink.c:2356/usr/lib/gcc/i686-pc-linux-gnu/4.1.0/../../../../i686-pc-linux-gnu/bin/ld: BFD 2.16.1 assertion fail /var/tmp/portage/binutils-2.16.1-r2/work/binutils-2.16.1/bfd/elflink.c:2357/usr/lib/gcc/i686-pc-linux-gnu/4.1.0/../../../../i686-pc-linux-gnu/bin/ld: BFD 2.16.1 assertion fail /var/tmp/portage/binutils-2.16.1-r2/work/binutils-2.16.1/bfd/elflink.c:2356/usr/lib/gcc/i686-pc-linux-gnu/4.1.0/../../../../i686-pc-linux-gnu/bin/ld: BFD 2.16.1 assertion fail /var/tmp/portage/binutils-2.16.1-r2/work/binutils-2.16.1/bfd/elflink.c:2357/usr/lib/gcc/i686-pc-linux-gnu/4.1.0/../../../../i686-pc-linux-gnu/bin/ld: BFD 2.16.1 assertion fail /var/tmp/portage/binutils-2.16.1-r2/work/binutils-2.16.1/bfd/elflink.c:2356/usr/lib/gcc/i686-pc-linux-gnu/4.1.0/../../../../i686-pc-linux-gnu/bin/ld: BFD 2.16.1 assertion fail /var/tmp/portage/binutils-2.16.1-r2/work/binutils-2.16.1/bfd/elflink.c:2357/usr/lib/gcc/i686-pc-linux-gnu/4.1.0/../../../../i686-pc-linux-gnu/bin/ld: BFD 2.16.1 assertion fail /var/tmp/portage/binutils-2.16.1-r2/work/binutils-2.16.1/bfd/elflink.c:2356/usr/lib/gcc/i686-pc-linux-gnu/4.1.0/../../../../i686-pc-linux-gnu/bin/ld: BFD 2.16.1 assertion fail /var/tmp/portage/binutils-2.16.1-r2/work/binutils-2.16.1/bfd/elflink.c:2357/usr/lib/gcc/i686-pc-linux-gnu/4.1.0/../../../../i686-pc-linux-gnu/bin/ld: BFD 2.16.1 assertion fail /var/tmp/portage/binutils-2.16.1-r2/work/binutils-2.16.1/bfd/elflink.c:2356/usr/lib/gcc/i686-pc-linux-gnu/4.1.0/../../../../i686-pc-linux-gnu/bin/ld: BFD 2.16.1 assertion fail /var/tmp/portage/binutils-2.16.1-r2/work/binutils-2.16.1/bfd/elflink.c:2357/usr/lib/gcc/i686-pc-linux-gnu/4.1.0/../../../../i686-pc-linux-gnu/bin/ld: BFD 2.16.1 assertion fail /var/tmp/portage/binutils-2.16.1-r2/work/binutils-2.16.1/bfd/elflink.c:2356/usr/lib/gcc/i686-pc-linux-gnu/4.1.0/../../../../i686-pc-linux-gnu/bin/ld: BFD 2.16.1 assertion fail /var/tmp/portage/binutils-2.16.1-r2/work/binutils-2.16.1/bfd/elflink.c:2357/usr/lib/gcc/i686-pc-linux-gnu/4.1.0/../../../../i686-pc-linux-gnu/bin/ld: BFD 2.16.1 assertion fail /var/tmp/portage/binutils-2.16.1-r2/work/binutils-2.16.1/bfd/elflink.c:2356/usr/lib/gcc/i686-pc-linux-gnu/4.1.0/../../../../i686-pc-linux-gnu/bin/ld: BFD 2.16.1 assertion fail /var/tmp/portage/binutils-2.16.1-r2/work/binutils-2.16.1/bfd/elflink.c:2357/usr/lib/gcc/i686-pc-linux-gnu/4.1.0/../../../../i686-pc-linux-gnu/bin/ld: BFD 2.16.1 assertion fail /var/tmp/portage/binutils-2.16.1-r2/work/binutils-2.16.1/bfd/elflink.c:2356/usr/lib/gcc/i686-pc-linux-gnu/4.1.0/../../../../i686-pc-linux-gnu/bin/ld: BFD 2.16.1 assertion fail /var/tmp/portage/binutils-2.16.1-r2/work/binutils-2.16.1/bfd/elflink.c:2357/usr/lib/gcc/i686-pc-linux-gnu/4.1.0/../../../../i686-pc-linux-gnu/bin/ld: BFD 2.16.1 assertion fail /var/tmp/portage/binutils-2.16.1-r2/work/binutils-2.16.1/bfd/elflink.c:2356/usr/lib/gcc/i686-pc-linux-gnu/4.1.0/../../../../i686-pc-linux-gnu/bin/ld: BFD 2.16.1 assertion fail /var/tmp/portage/binutils-2.16.1-r2/work/binutils-2.16.1/bfd/elflink.c:2357/usr/lib/gcc/i686-pc-linux-gnu/4.1.0/../../../../i686-pc-linux-gnu/bin/ld: BFD 2.16.1 assertion fail /var/tmp/portage/binutils-2.16.1-r2/work/binutils-2.16.1/bfd/elflink.c:2356/usr/lib/gcc/i686-pc-linux-gnu/4.1.0/../../../../i686-pc-linux-gnu/bin/ld: BFD 2.16.1 assertion fail /var/tmp/portage/binutils-2.16.1-r2/work/binutils-2.16.1/bfd/elflink.c:2357/usr/lib/gcc/i686-pc-linux-gnu/4.1.0/../../../../i686-pc-linux-gnu/bin/ld: BFD 2.16.1 assertion fail /var/tmp/portage/binutils-2.16.1-r2/work/binutils-2.16.1/bfd/elflink.c:2356/usr/lib/gcc/i686-pc-linux-gnu/4.1.0/../../../../i686-pc-linux-gnu/bin/ld: BFD 2.16.1 assertion fail /var/tmp/portage/binutils-2.16.1-r2/work/binutils-2.16.1/bfd/elflink.c:2357/usr/lib/gcc/i686-pc-linux-gnu/4.1.0/../../../../i686-pc-linux-gnu/bin/ld: BFD 2.16.1 assertion fail /var/tmp/portage/binutils-2.16.1-r2/work/binutils-2.16.1/bfd/elflink.c:2356/usr/lib/gcc/i686-pc-linux-gnu/4.1.0/../../../../i686-pc-linux-gnu/bin/ld: BFD 2.16.1 assertion fail /var/tmp/portage/binutils-2.16.1-r2/work/binutils-2.16.1/bfd/elflink.c:2357/usr/lib/gcc/i686-pc-linux-gnu/4.1.0/../../../../i686-pc-linux-gnu/bin/ld: BFD 2.16.1 assertion fail /var/tmp/portage/binutils-2.16.1-r2/work/binutils-2.16.1/bfd/elflink.c:2356/usr/lib/gcc/i686-pc-linux-gnu/4.1.0/../../../../i686-pc-linux-gnu/bin/ld: BFD 2.16.1 assertion fail /var/tmp/portage/binutils-2.16.1-r2/work/binutils-2.16.1/bfd/elflink.c:2357/usr/lib/gcc/i686-pc-linux-gnu/4.1.0/../../../../i686-pc-linux-gnu/bin/ld: BFD 2.16.1 assertion fail /var/tmp/portage/binutils-2.16.1-r2/work/binutils-2.16.1/bfd/elflink.c:2356/usr/lib/gcc/i686-pc-linux-gnu/4.1.0/../../../../i686-pc-linux-gnu/bin/ld: BFD 2.16.1 assertion fail /var/tmp/portage/binutils-2.16.1-r2/work/binutils-2.16.1/bfd/elflink.c:2357/usr/lib/gcc/i686-pc-linux-gnu/4.1.0/../../../../i686-pc-linux-gnu/bin/ld: BFD 2.16.1 assertion fail /var/tmp/portage/binutils-2.16.1-r2/work/binutils-2.16.1/bfd/elflink.c:2356/usr/lib/gcc/i686-pc-linux-gnu/4.1.0/../../../../i686-pc-linux-gnu/bin/ld: BFD 2.16.1 assertion fail /var/tmp/portage/binutils-2.16.1-r2/work/binutils-2.16.1/bfd/elflink.c:2357/usr/lib/gcc/i686-pc-linux-gnu/4.1.0/../../../../i686-pc-linux-gnu/bin/ld: BFD 2.16.1 assertion fail /var/tmp/portage/binutils-2.16.1-r2/work/binutils-2.16.1/bfd/elflink.c:2356/usr/lib/gcc/i686-pc-linux-gnu/4.1.0/../../../../i686-pc-linux-gnu/bin/ld: BFD 2.16.1 assertion fail /var/tmp/portage/binutils-2.16.1-r2/work/binutils-2.16.1/bfd/elflink.c:2357/usr/lib/gcc/i686-pc-linux-gnu/4.1.0/../../../../i686-pc-linux-gnu/bin/ld: BFD 2.16.1 assertion fail /var/tmp/portage/binutils-2.16.1-r2/work/binutils-2.16.1/bfd/elflink.c:2356/usr/lib/gcc/i686-pc-linux-gnu/4.1.0/../../../../i686-pc-linux-gnu/bin/ld: BFD 2.16.1 assertion fail /var/tmp/portage/binutils-2.16.1-r2/work/binutils-2.16.1/bfd/elflink.c:2357/usr/lib/gcc/i686-pc-linux-gnu/4.1.0/../../../../i686-pc-linux-gnu/bin/ld: BFD 2.16.1 assertion fail /var/tmp/portage/binutils-2.16.1-r2/work/binutils-2.16.1/bfd/elflink.c:2356/usr/lib/gcc/i686-pc-linux-gnu/4.1.0/../../../../i686-pc-linux-gnu/bin/ld: BFD 2.16.1 assertion fail /var/tmp/portage/binutils-2.16.1-r2/work/binutils-2.16.1/bfd/elflink.c:2357/usr/lib/gcc/i686-pc-linux-gnu/4.1.0/../../../../i686-pc-linux-gnu/bin/ld: BFD 2.16.1 assertion fail /var/tmp/portage/binutils-2.16.1-r2/work/binutils-2.16.1/bfd/elflink.c:2356/usr/lib/gcc/i686-pc-linux-gnu/4.1.0/../../../../i686-pc-linux-gnu/bin/ld: BFD 2.16.1 assertion fail /var/tmp/portage/binutils-2.16.1-r2/work/binutils-2.16.1/bfd/elflink.c:2357/usr/lib/gcc/i686-pc-linux-gnu/4.1.0/../../../../i686-pc-linux-gnu/bin/ld: BFD 2.16.1 assertion fail /var/tmp/portage/binutils-2.16.1-r2/work/binutils-2.16.1/bfd/elflink.c:2356/usr/lib/gcc/i686-pc-linux-gnu/4.1.0/../../../../i686-pc-linux-gnu/bin/ld: BFD 2.16.1 assertion fail /var/tmp/portage/binutils-2.16.1-r2/work/binutils-2.16.1/bfd/elflink.c:2357/usr/lib/gcc/i686-pc-linux-gnu/4.1.0/../../../../i686-pc-linux-gnu/bin/ld: BFD 2.16.1 assertion fail /var/tmp/portage/binutils-2.16.1-r2/work/binutils-2.16.1/bfd/elflink.c:2356/usr/lib/gcc/i686-pc-linux-gnu/4.1.0/../../../../i686-pc-linux-gnu/bin/ld: BFD 2.16.1 assertion fail /var/tmp/portage/binutils-2.16.1-r2/work/binutils-2.16.1/bfd/elflink.c:2357/usr/lib/gcc/i686-pc-linux-gnu/4.1.0/../../../../i686-pc-linux-gnu/bin/ld: BFD 2.16.1 internal error, aborting at /var/tmp/portage/binutils-2.16.1-r2/work/binutils-2.16.1/bfd/elflink.c line 6536 in elf_link_output_extsym/usr/lib/gcc/i686-pc-linux-gnu/4.1.0/../../../../i686-pc-linux-gnu/bin/ld: Please report this bug.collect2: ld returned 1 exit statusconfigure:3437: $? = 1configure: failed program was:| /* confdefs.h.  */| | #define PACKAGE_NAME ""| #define PACKAGE_TARNAME ""| #define PACKAGE_VERSION ""| #define PACKAGE_STRING ""| #define PACKAGE_BUGREPORT ""| #ifdef __cplusplus| extern "C" void std::exit (int) throw (); using std::exit;| #endif| #define _GNU_SOURCE 1| /* end confdefs.h.  */| /* Define setlocale to an innocuous variant, in case <limits.h> declares setlocale.|    For example, HP-UX 11i <limits.h> declares gettimeofday.  */| #define setlocale innocuous_setlocale| | /* System header to define __stub macros and hopefully few prototypes,|     which can conflict with char setlocale (); below.|     Prefer <limits.h> to <assert.h> if __STDC__ is defined, since|     <limits.h> exists even on freestanding compilers.  */| | #ifdef __STDC__| # include <limits.h>| #else| # include <assert.h>| #endif| | #undef setlocale| | /* Override any gcc2 internal prototype to avoid an error.  */| #ifdef __cplusplus| extern "C"| {| #endif| /* We use char because int might match the return type of a gcc2|    builtin and then its argument prototype would still apply.  */| char setlocale ();| /* The GNU C library defines this for functions which it implements|     to always fail with ENOSYS.  Some functions are actually named|     something starting with __ and the normal name is an alias.  */| #if defined (__stub_setlocale) || defined (__stub___setlocale)| choke me| #else| char (*f) () = setlocale;| #endif| #ifdef __cplusplus| }| #endif| | int| main ()| {| return f != setlocale;|   ;|   return 0;| }configure:3461: result: noconfigure:3466: checking for setlocale in -lxpg4configure:3496: i686-pc-linux-gnu-g++ -o conftest -march=pentium2 -O2 -fomit-frame-pointer -pipe  -Wl,--as-needed conftest.cc -lxpg4   -lsupc++ >&5/usr/lib/gcc/i686-pc-linux-gnu/4.1.0/../../../../i686-pc-linux-gnu/bin/ld: cannot find -lxpg4collect2: ld returned 1 exit statusconfigure:3502: $? = 1configure: failed program was:| /* confdefs.h.  */| | #define PACKAGE_NAME ""| #define PACKAGE_TARNAME ""| #define PACKAGE_VERSION ""| #define PACKAGE_STRING ""| #define PACKAGE_BUGREPORT ""| #ifdef __cplusplus| extern "C" void std::exit (int) throw (); using std::exit;| #endif| #define _GNU_SOURCE 1| /* end confdefs.h.  */| | /* Override any gcc2 internal prototype to avoid an error.  */| #ifdef __cplusplus| extern "C"| #endif| /* We use char because int might match the return type of a gcc2|    builtin and then its argument prototype would still apply.  */| char setlocale ();| int| main ()| {| setlocale ();|   ;|   return 0;| }configure:3527: result: noconfigure:3536: checking for gethostbynameconfigure:3593: i686-pc-linux-gnu-g++ -o conftest -march=pentium2 -O2 -fomit-frame-pointer -pipe  -Wl,--as-needed conftest.cc  -lsupc++ >&5/usr/lib/gcc/i686-pc-linux-gnu/4.1.0/../../../../i686-pc-linux-gnu/bin/ld: BFD 2.16.1 assertion fail /var/tmp/portage/binutils-2.16.1-r2/work/binutils-2.16.1/bfd/elflink.c:2356/usr/lib/gcc/i686-pc-linux-gnu/4.1.0/../../../../i686-pc-linux-gnu/bin/ld: BFD 2.16.1 assertion fail /var/tmp/portage/binutils-2.16.1-r2/work/binutils-2.16.1/bfd/elflink.c:2357/usr/lib/gcc/i686-pc-linux-gnu/4.1.0/../../../../i686-pc-linux-gnu/bin/ld: BFD 2.16.1 assertion fail /var/tmp/portage/binutils-2.16.1-r2/work/binutils-2.16.1/bfd/elflink.c:2356/usr/lib/gcc/i686-pc-linux-gnu/4.1.0/../../../../i686-pc-linux-gnu/bin/ld: BFD 2.16.1 assertion fail /var/tmp/portage/binutils-2.16.1-r2/work/binutils-2.16.1/bfd/elflink.c:2357/usr/lib/gcc/i686-pc-linux-gnu/4.1.0/../../../../i686-pc-linux-gnu/bin/ld: BFD 2.16.1 assertion fail /var/tmp/portage/binutils-2.16.1-r2/work/binutils-2.16.1/bfd/elflink.c:2356/usr/lib/gcc/i686-pc-linux-gnu/4.1.0/../../../../i686-pc-linux-gnu/bin/ld: BFD 2.16.1 assertion fail /var/tmp/portage/binutils-2.16.1-r2/work/binutils-2.16.1/bfd/elflink.c:2357/usr/lib/gcc/i686-pc-linux-gnu/4.1.0/../../../../i686-pc-linux-gnu/bin/ld: BFD 2.16.1 assertion fail /var/tmp/portage/binutils-2.16.1-r2/work/binutils-2.16.1/bfd/elflink.c:2356/usr/lib/gcc/i686-pc-linux-gnu/4.1.0/../../../../i686-pc-linux-gnu/bin/ld: BFD 2.16.1 assertion fail /var/tmp/portage/binutils-2.16.1-r2/work/binutils-2.16.1/bfd/elflink.c:2357/usr/lib/gcc/i686-pc-linux-gnu/4.1.0/../../../../i686-pc-linux-gnu/bin/ld: BFD 2.16.1 assertion fail /var/tmp/portage/binutils-2.16.1-r2/work/binutils-2.16.1/bfd/elflink.c:2356/usr/lib/gcc/i686-pc-linux-gnu/4.1.0/../../../../i686-pc-linux-gnu/bin/ld: BFD 2.16.1 assertion fail /var/tmp/portage/binutils-2.16.1-r2/work/binutils-2.16.1/bfd/elflink.c:2357/usr/lib/gcc/i686-pc-linux-gnu/4.1.0/../../../../i686-pc-linux-gnu/bin/ld: BFD 2.16.1 assertion fail /var/tmp/portage/binutils-2.16.1-r2/work/binutils-2.16.1/bfd/elflink.c:2356/usr/lib/gcc/i686-pc-linux-gnu/4.1.0/../../../../i686-pc-linux-gnu/bin/ld: BFD 2.16.1 assertion fail /var/tmp/portage/binutils-2.16.1-r2/work/binutils-2.16.1/bfd/elflink.c:2357/usr/lib/gcc/i686-pc-linux-gnu/4.1.0/../../../../i686-pc-linux-gnu/bin/ld: BFD 2.16.1 assertion fail /var/tmp/portage/binutils-2.16.1-r2/work/binutils-2.16.1/bfd/elflink.c:2356/usr/lib/gcc/i686-pc-linux-gnu/4.1.0/../../../../i686-pc-linux-gnu/bin/ld: BFD 2.16.1 assertion fail /var/tmp/portage/binutils-2.16.1-r2/work/binutils-2.16.1/bfd/elflink.c:2357/usr/lib/gcc/i686-pc-linux-gnu/4.1.0/../../../../i686-pc-linux-gnu/bin/ld: BFD 2.16.1 assertion fail /var/tmp/portage/binutils-2.16.1-r2/work/binutils-2.16.1/bfd/elflink.c:2356/usr/lib/gcc/i686-pc-linux-gnu/4.1.0/../../../../i686-pc-linux-gnu/bin/ld: BFD 2.16.1 assertion fail /var/tmp/portage/binutils-2.16.1-r2/work/binutils-2.16.1/bfd/elflink.c:2357/usr/lib/gcc/i686-pc-linux-gnu/4.1.0/../../../../i686-pc-linux-gnu/bin/ld: BFD 2.16.1 assertion fail /var/tmp/portage/binutils-2.16.1-r2/work/binutils-2.16.1/bfd/elflink.c:2356/usr/lib/gcc/i686-pc-linux-gnu/4.1.0/../../../../i686-pc-linux-gnu/bin/ld: BFD 2.16.1 assertion fail /var/tmp/portage/binutils-2.16.1-r2/work/binutils-2.16.1/bfd/elflink.c:2357/usr/lib/gcc/i686-pc-linux-gnu/4.1.0/../../../../i686-pc-linux-gnu/bin/ld: BFD 2.16.1 assertion fail /var/tmp/portage/binutils-2.16.1-r2/work/binutils-2.16.1/bfd/elflink.c:2356/usr/lib/gcc/i686-pc-linux-gnu/4.1.0/../../../../i686-pc-linux-gnu/bin/ld: BFD 2.16.1 assertion fail /var/tmp/portage/binutils-2.16.1-r2/work/binutils-2.16.1/bfd/elflink.c:2357/usr/lib/gcc/i686-pc-linux-gnu/4.1.0/../../../../i686-pc-linux-gnu/bin/ld: BFD 2.16.1 assertion fail /var/tmp/portage/binutils-2.16.1-r2/work/binutils-2.16.1/bfd/elflink.c:2356/usr/lib/gcc/i686-pc-linux-gnu/4.1.0/../../../../i686-pc-linux-gnu/bin/ld: BFD 2.16.1 assertion fail /var/tmp/portage/binutils-2.16.1-r2/work/binutils-2.16.1/bfd/elflink.c:2357/usr/lib/gcc/i686-pc-linux-gnu/4.1.0/../../../../i686-pc-linux-gnu/bin/ld: BFD 2.16.1 assertion fail /var/tmp/portage/binutils-2.16.1-r2/work/binutils-2.16.1/bfd/elflink.c:2356/usr/lib/gcc/i686-pc-linux-gnu/4.1.0/../../../../i686-pc-linux-gnu/bin/ld: BFD 2.16.1 assertion fail /var/tmp/portage/binutils-2.16.1-r2/work/binutils-2.16.1/bfd/elflink.c:2357/usr/lib/gcc/i686-pc-linux-gnu/4.1.0/../../../../i686-pc-linux-gnu/bin/ld: BFD 2.16.1 assertion fail /var/tmp/portage/binutils-2.16.1-r2/work/binutils-2.16.1/bfd/elflink.c:2356/usr/lib/gcc/i686-pc-linux-gnu/4.1.0/../../../../i686-pc-linux-gnu/bin/ld: BFD 2.16.1 assertion fail /var/tmp/portage/binutils-2.16.1-r2/work/binutils-2.16.1/bfd/elflink.c:2357/usr/lib/gcc/i686-pc-linux-gnu/4.1.0/../../../../i686-pc-linux-gnu/bin/ld: BFD 2.16.1 assertion fail /var/tmp/portage/binutils-2.16.1-r2/work/binutils-2.16.1/bfd/elflink.c:2356/usr/lib/gcc/i686-pc-linux-gnu/4.1.0/../../../../i686-pc-linux-gnu/bin/ld: BFD 2.16.1 assertion fail /var/tmp/portage/binutils-2.16.1-r2/work/binutils-2.16.1/bfd/elflink.c:2357/usr/lib/gcc/i686-pc-linux-gnu/4.1.0/../../../../i686-pc-linux-gnu/bin/ld: BFD 2.16.1 assertion fail /var/tmp/portage/binutils-2.16.1-r2/work/binutils-2.16.1/bfd/elflink.c:2356/usr/lib/gcc/i686-pc-linux-gnu/4.1.0/../../../../i686-pc-linux-gnu/bin/ld: BFD 2.16.1 assertion fail /var/tmp/portage/binutils-2.16.1-r2/work/binutils-2.16.1/bfd/elflink.c:2357/usr/lib/gcc/i686-pc-linux-gnu/4.1.0/../../../../i686-pc-linux-gnu/bin/ld: BFD 2.16.1 assertion fail /var/tmp/portage/binutils-2.16.1-r2/work/binutils-2.16.1/bfd/elflink.c:2356/usr/lib/gcc/i686-pc-linux-gnu/4.1.0/../../../../i686-pc-linux-gnu/bin/ld: BFD 2.16.1 assertion fail /var/tmp/portage/binutils-2.16.1-r2/work/binutils-2.16.1/bfd/elflink.c:2357/usr/lib/gcc/i686-pc-linux-gnu/4.1.0/../../../../i686-pc-linux-gnu/bin/ld: BFD 2.16.1 assertion fail /var/tmp/portage/binutils-2.16.1-r2/work/binutils-2.16.1/bfd/elflink.c:2356/usr/lib/gcc/i686-pc-linux-gnu/4.1.0/../../../../i686-pc-linux-gnu/bin/ld: BFD 2.16.1 assertion fail /var/tmp/portage/binutils-2.16.1-r2/work/binutils-2.16.1/bfd/elflink.c:2357/usr/lib/gcc/i686-pc-linux-gnu/4.1.0/../../../../i686-pc-linux-gnu/bin/ld: BFD 2.16.1 assertion fail /var/tmp/portage/binutils-2.16.1-r2/work/binutils-2.16.1/bfd/elflink.c:2356/usr/lib/gcc/i686-pc-linux-gnu/4.1.0/../../../../i686-pc-linux-gnu/bin/ld: BFD 2.16.1 assertion fail /var/tmp/portage/binutils-2.16.1-r2/work/binutils-2.16.1/bfd/elflink.c:2357/usr/lib/gcc/i686-pc-linux-gnu/4.1.0/../../../../i686-pc-linux-gnu/bin/ld: BFD 2.16.1 assertion fail /var/tmp/portage/binutils-2.16.1-r2/work/binutils-2.16.1/bfd/elflink.c:2356/usr/lib/gcc/i686-pc-linux-gnu/4.1.0/../../../../i686-pc-linux-gnu/bin/ld: BFD 2.16.1 assertion fail /var/tmp/portage/binutils-2.16.1-r2/work/binutils-2.16.1/bfd/elflink.c:2357/usr/lib/gcc/i686-pc-linux-gnu/4.1.0/../../../../i686-pc-linux-gnu/bin/ld: BFD 2.16.1 assertion fail /var/tmp/portage/binutils-2.16.1-r2/work/binutils-2.16.1/bfd/elflink.c:2356/usr/lib/gcc/i686-pc-linux-gnu/4.1.0/../../../../i686-pc-linux-gnu/bin/ld: BFD 2.16.1 assertion fail /var/tmp/portage/binutils-2.16.1-r2/work/binutils-2.16.1/bfd/elflink.c:2357/usr/lib/gcc/i686-pc-linux-gnu/4.1.0/../../../../i686-pc-linux-gnu/bin/ld: BFD 2.16.1 assertion fail /var/tmp/portage/binutils-2.16.1-r2/work/binutils-2.16.1/bfd/elflink.c:2356/usr/lib/gcc/i686-pc-linux-gnu/4.1.0/../../../../i686-pc-linux-gnu/bin/ld: BFD 2.16.1 assertion fail /var/tmp/portage/binutils-2.16.1-r2/work/binutils-2.16.1/bfd/elflink.c:2357/usr/lib/gcc/i686-pc-linux-gnu/4.1.0/../../../../i686-pc-linux-gnu/bin/ld: BFD 2.16.1 assertion fail /var/tmp/portage/binutils-2.16.1-r2/work/binutils-2.16.1/bfd/elflink.c:2356/usr/lib/gcc/i686-pc-linux-gnu/4.1.0/../../../../i686-pc-linux-gnu/bin/ld: BFD 2.16.1 assertion fail /var/tmp/portage/binutils-2.16.1-r2/work/binutils-2.16.1/bfd/elflink.c:2357/usr/lib/gcc/i686-pc-linux-gnu/4.1.0/../../../../i686-pc-linux-gnu/bin/ld: BFD 2.16.1 assertion fail /var/tmp/portage/binutils-2.16.1-r2/work/binutils-2.16.1/bfd/elflink.c:2356/usr/lib/gcc/i686-pc-linux-gnu/4.1.0/../../../../i686-pc-linux-gnu/bin/ld: BFD 2.16.1 assertion fail /var/tmp/portage/binutils-2.16.1-r2/work/binutils-2.16.1/bfd/elflink.c:2357/usr/lib/gcc/i686-pc-linux-gnu/4.1.0/../../../../i686-pc-linux-gnu/bin/ld: BFD 2.16.1 assertion fail /var/tmp/portage/binutils-2.16.1-r2/work/binutils-2.16.1/bfd/elflink.c:2356/usr/lib/gcc/i686-pc-linux-gnu/4.1.0/../../../../i686-pc-linux-gnu/bin/ld: BFD 2.16.1 assertion fail /var/tmp/portage/binutils-2.16.1-r2/work/binutils-2.16.1/bfd/elflink.c:2357/usr/lib/gcc/i686-pc-linux-gnu/4.1.0/../../../../i686-pc-linux-gnu/bin/ld: BFD 2.16.1 internal error, aborting at /var/tmp/portage/binutils-2.16.1-r2/work/binutils-2.16.1/bfd/elflink.c line 6536 in elf_link_output_extsym/usr/lib/gcc/i686-pc-linux-gnu/4.1.0/../../../../i686-pc-linux-gnu/bin/ld: Please report this bug.collect2: ld returned 1 exit statusconfigure:3599: $? = 1configure: failed program was:| /* confdefs.h.  */| | #define PACKAGE_NAME ""| #define PACKAGE_TARNAME ""| #define PACKAGE_VERSION ""| #define PACKAGE_STRING ""| #define PACKAGE_BUGREPORT ""| #ifdef __cplusplus| extern "C" void std::exit (int) throw (); using std::exit;| #endif| #define _GNU_SOURCE 1| /* end confdefs.h.  */| /* Define gethostbyname to an innocuous variant, in case <limits.h> declares gethostbyname.|    For example, HP-UX 11i <limits.h> declares gettimeofday.  */| #define gethostbyname innocuous_gethostbyname| | /* System header to define __stub macros and hopefully few prototypes,|     which can conflict with char gethostbyname (); below.|     Prefer <limits.h> to <assert.h> if __STDC__ is defined, since|     <limits.h> exists even on freestanding compilers.  */| | #ifdef __STDC__| # include <limits.h>| #else| # include <assert.h>| #endif| | #undef gethostbyname| | /* Override any gcc2 internal prototype to avoid an error.  */| #ifdef __cplusplus| extern "C"| {| #endif| /* We use char because int might match the return type of a gcc2|    builtin and then its argument prototype would still apply.  */| char gethostbyname ();| /* The GNU C library defines this for functions which it implements|     to always fail with ENOSYS.  Some functions are actually named|     something starting with __ and the normal name is an alias.  */| #if defined (__stub_gethostbyname) || defined (__stub___gethostbyname)| choke me| #else| char (*f) () = gethostbyname;| #endif| #ifdef __cplusplus| }| #endif| | int| main ()| {| return f != gethostbyname;|   ;|   return 0;| }configure:3623: result: noconfigure:3628: checking for gethostbyname in -lnslconfigure:3658: i686-pc-linux-gnu-g++ -o conftest -march=pentium2 -O2 -fomit-frame-pointer -pipe  -Wl,--as-needed conftest.cc -lnsl   -lsupc++ >&5/usr/lib/gcc/i686-pc-linux-gnu/4.1.0/../../../../i686-pc-linux-gnu/bin/ld: BFD 2.16.1 assertion fail /var/tmp/portage/binutils-2.16.1-r2/work/binutils-2.16.1/bfd/elflink.c:2356/usr/lib/gcc/i686-pc-linux-gnu/4.1.0/../../../../i686-pc-linux-gnu/bin/ld: BFD 2.16.1 assertion fail /var/tmp/portage/binutils-2.16.1-r2/work/binutils-2.16.1/bfd/elflink.c:2357/usr/lib/gcc/i686-pc-linux-gnu/4.1.0/../../../../i686-pc-linux-gnu/bin/ld: BFD 2.16.1 assertion fail /var/tmp/portage/binutils-2.16.1-r2/work/binutils-2.16.1/bfd/elflink.c:2356/usr/lib/gcc/i686-pc-linux-gnu/4.1.0/../../../../i686-pc-linux-gnu/bin/ld: BFD 2.16.1 assertion fail /var/tmp/portage/binutils-2.16.1-r2/work/binutils-2.16.1/bfd/elflink.c:2357/usr/lib/gcc/i686-pc-linux-gnu/4.1.0/../../../../i686-pc-linux-gnu/bin/ld: BFD 2.16.1 assertion fail /var/tmp/portage/binutils-2.16.1-r2/work/binutils-2.16.1/bfd/elflink.c:2356/usr/lib/gcc/i686-pc-linux-gnu/4.1.0/../../../../i686-pc-linux-gnu/bin/ld: BFD 2.16.1 assertion fail /var/tmp/portage/binutils-2.16.1-r2/work/binutils-2.16.1/bfd/elflink.c:2357/usr/lib/gcc/i686-pc-linux-gnu/4.1.0/../../../../i686-pc-linux-gnu/bin/ld: BFD 2.16.1 assertion fail /var/tmp/portage/binutils-2.16.1-r2/work/binutils-2.16.1/bfd/elflink.c:2356/usr/lib/gcc/i686-pc-linux-gnu/4.1.0/../../../../i686-pc-linux-gnu/bin/ld: BFD 2.16.1 assertion fail /var/tmp/portage/binutils-2.16.1-r2/work/binutils-2.16.1/bfd/elflink.c:2357/usr/lib/gcc/i686-pc-linux-gnu/4.1.0/../../../../i686-pc-linux-gnu/bin/ld: BFD 2.16.1 assertion fail /var/tmp/portage/binutils-2.16.1-r2/work/binutils-2.16.1/bfd/elflink.c:2356/usr/lib/gcc/i686-pc-linux-gnu/4.1.0/../../../../i686-pc-linux-gnu/bin/ld: BFD 2.16.1 assertion fail /var/tmp/portage/binutils-2.16.1-r2/work/binutils-2.16.1/bfd/elflink.c:2357/usr/lib/gcc/i686-pc-linux-gnu/4.1.0/../../../../i686-pc-linux-gnu/bin/ld: BFD 2.16.1 assertion fail /var/tmp/portage/binutils-2.16.1-r2/work/binutils-2.16.1/bfd/elflink.c:2356/usr/lib/gcc/i686-pc-linux-gnu/4.1.0/../../../../i686-pc-linux-gnu/bin/ld: BFD 2.16.1 assertion fail /var/tmp/portage/binutils-2.16.1-r2/work/binutils-2.16.1/bfd/elflink.c:2357/usr/lib/gcc/i686-pc-linux-gnu/4.1.0/../../../../i686-pc-linux-gnu/bin/ld: BFD 2.16.1 assertion fail /var/tmp/portage/binutils-2.16.1-r2/work/binutils-2.16.1/bfd/elflink.c:2356/usr/lib/gcc/i686-pc-linux-gnu/4.1.0/../../../../i686-pc-linux-gnu/bin/ld: BFD 2.16.1 assertion fail /var/tmp/portage/binutils-2.16.1-r2/work/binutils-2.16.1/bfd/elflink.c:2357/usr/lib/gcc/i686-pc-linux-gnu/4.1.0/../../../../i686-pc-linux-gnu/bin/ld: BFD 2.16.1 assertion fail /var/tmp/portage/binutils-2.16.1-r2/work/binutils-2.16.1/bfd/elflink.c:2356/usr/lib/gcc/i686-pc-linux-gnu/4.1.0/../../../../i686-pc-linux-gnu/bin/ld: BFD 2.16.1 assertion fail /var/tmp/portage/binutils-2.16.1-r2/work/binutils-2.16.1/bfd/elflink.c:2357/usr/lib/gcc/i686-pc-linux-gnu/4.1.0/../../../../i686-pc-linux-gnu/bin/ld: BFD 2.16.1 assertion fail /var/tmp/portage/binutils-2.16.1-r2/work/binutils-2.16.1/bfd/elflink.c:2356/usr/lib/gcc/i686-pc-linux-gnu/4.1.0/../../../../i686-pc-linux-gnu/bin/ld: BFD 2.16.1 assertion fail /var/tmp/portage/binutils-2.16.1-r2/work/binutils-2.16.1/bfd/elflink.c:2357/usr/lib/gcc/i686-pc-linux-gnu/4.1.0/../../../../i686-pc-linux-gnu/bin/ld: BFD 2.16.1 assertion fail /var/tmp/portage/binutils-2.16.1-r2/work/binutils-2.16.1/bfd/elflink.c:2356/usr/lib/gcc/i686-pc-linux-gnu/4.1.0/../../../../i686-pc-linux-gnu/bin/ld: BFD 2.16.1 assertion fail /var/tmp/portage/binutils-2.16.1-r2/work/binutils-2.16.1/bfd/elflink.c:2357/usr/lib/gcc/i686-pc-linux-gnu/4.1.0/../../../../i686-pc-linux-gnu/bin/ld: BFD 2.16.1 assertion fail /var/tmp/portage/binutils-2.16.1-r2/work/binutils-2.16.1/bfd/elflink.c:2356/usr/lib/gcc/i686-pc-linux-gnu/4.1.0/../../../../i686-pc-linux-gnu/bin/ld: BFD 2.16.1 assertion fail /var/tmp/portage/binutils-2.16.1-r2/work/binutils-2.16.1/bfd/elflink.c:2357/usr/lib/gcc/i686-pc-linux-gnu/4.1.0/../../../../i686-pc-linux-gnu/bin/ld: BFD 2.16.1 assertion fail /var/tmp/portage/binutils-2.16.1-r2/work/binutils-2.16.1/bfd/elflink.c:2356/usr/lib/gcc/i686-pc-linux-gnu/4.1.0/../../../../i686-pc-linux-gnu/bin/ld: BFD 2.16.1 assertion fail /var/tmp/portage/binutils-2.16.1-r2/work/binutils-2.16.1/bfd/elflink.c:2357/usr/lib/gcc/i686-pc-linux-gnu/4.1.0/../../../../i686-pc-linux-gnu/bin/ld: BFD 2.16.1 assertion fail /var/tmp/portage/binutils-2.16.1-r2/work/binutils-2.16.1/bfd/elflink.c:2356/usr/lib/gcc/i686-pc-linux-gnu/4.1.0/../../../../i686-pc-linux-gnu/bin/ld: BFD 2.16.1 assertion fail /var/tmp/portage/binutils-2.16.1-r2/work/binutils-2.16.1/bfd/elflink.c:2357/usr/lib/gcc/i686-pc-linux-gnu/4.1.0/../../../../i686-pc-linux-gnu/bin/ld: BFD 2.16.1 assertion fail /var/tmp/portage/binutils-2.16.1-r2/work/binutils-2.16.1/bfd/elflink.c:2356/usr/lib/gcc/i686-pc-linux-gnu/4.1.0/../../../../i686-pc-linux-gnu/bin/ld: BFD 2.16.1 assertion fail /var/tmp/portage/binutils-2.16.1-r2/work/binutils-2.16.1/bfd/elflink.c:2357/usr/lib/gcc/i686-pc-linux-gnu/4.1.0/../../../../i686-pc-linux-gnu/bin/ld: BFD 2.16.1 assertion fail /var/tmp/portage/binutils-2.16.1-r2/work/binutils-2.16.1/bfd/elflink.c:2356/usr/lib/gcc/i686-pc-linux-gnu/4.1.0/../../../../i686-pc-linux-gnu/bin/ld: BFD 2.16.1 assertion fail /var/tmp/portage/binutils-2.16.1-r2/work/binutils-2.16.1/bfd/elflink.c:2357/usr/lib/gcc/i686-pc-linux-gnu/4.1.0/../../../../i686-pc-linux-gnu/bin/ld: BFD 2.16.1 assertion fail /var/tmp/portage/binutils-2.16.1-r2/work/binutils-2.16.1/bfd/elflink.c:2356/usr/lib/gcc/i686-pc-linux-gnu/4.1.0/../../../../i686-pc-linux-gnu/bin/ld: BFD 2.16.1 assertion fail /var/tmp/portage/binutils-2.16.1-r2/work/binutils-2.16.1/bfd/elflink.c:2357/usr/lib/gcc/i686-pc-linux-gnu/4.1.0/../../../../i686-pc-linux-gnu/bin/ld: BFD 2.16.1 assertion fail /var/tmp/portage/binutils-2.16.1-r2/work/binutils-2.16.1/bfd/elflink.c:2356/usr/lib/gcc/i686-pc-linux-gnu/4.1.0/../../../../i686-pc-linux-gnu/bin/ld: BFD 2.16.1 assertion fail /var/tmp/portage/binutils-2.16.1-r2/work/binutils-2.16.1/bfd/elflink.c:2357/usr/lib/gcc/i686-pc-linux-gnu/4.1.0/../../../../i686-pc-linux-gnu/bin/ld: BFD 2.16.1 assertion fail /var/tmp/portage/binutils-2.16.1-r2/work/binutils-2.16.1/bfd/elflink.c:2356/usr/lib/gcc/i686-pc-linux-gnu/4.1.0/../../../../i686-pc-linux-gnu/bin/ld: BFD 2.16.1 assertion fail /var/tmp/portage/binutils-2.16.1-r2/work/binutils-2.16.1/bfd/elflink.c:2357/usr/lib/gcc/i686-pc-linux-gnu/4.1.0/../../../../i686-pc-linux-gnu/bin/ld: BFD 2.16.1 assertion fail /var/tmp/portage/binutils-2.16.1-r2/work/binutils-2.16.1/bfd/elflink.c:2356/usr/lib/gcc/i686-pc-linux-gnu/4.1.0/../../../../i686-pc-linux-gnu/bin/ld: BFD 2.16.1 assertion fail /var/tmp/portage/binutils-2.16.1-r2/work/binutils-2.16.1/bfd/elflink.c:2357/usr/lib/gcc/i686-pc-linux-gnu/4.1.0/../../../../i686-pc-linux-gnu/bin/ld: BFD 2.16.1 assertion fail /var/tmp/portage/binutils-2.16.1-r2/work/binutils-2.16.1/bfd/elflink.c:2356/usr/lib/gcc/i686-pc-linux-gnu/4.1.0/../../../../i686-pc-linux-gnu/bin/ld: BFD 2.16.1 assertion fail /var/tmp/portage/binutils-2.16.1-r2/work/binutils-2.16.1/bfd/elflink.c:2357/usr/lib/gcc/i686-pc-linux-gnu/4.1.0/../../../../i686-pc-linux-gnu/bin/ld: BFD 2.16.1 assertion fail /var/tmp/portage/binutils-2.16.1-r2/work/binutils-2.16.1/bfd/elflink.c:2356/usr/lib/gcc/i686-pc-linux-gnu/4.1.0/../../../../i686-pc-linux-gnu/bin/ld: BFD 2.16.1 assertion fail /var/tmp/portage/binutils-2.16.1-r2/work/binutils-2.16.1/bfd/elflink.c:2357/usr/lib/gcc/i686-pc-linux-gnu/4.1.0/../../../../i686-pc-linux-gnu/bin/ld: BFD 2.16.1 assertion fail /var/tmp/portage/binutils-2.16.1-r2/work/binutils-2.16.1/bfd/elflink.c:2356/usr/lib/gcc/i686-pc-linux-gnu/4.1.0/../../../../i686-pc-linux-gnu/bin/ld: BFD 2.16.1 assertion fail /var/tmp/portage/binutils-2.16.1-r2/work/binutils-2.16.1/bfd/elflink.c:2357/usr/lib/gcc/i686-pc-linux-gnu/4.1.0/../../../../i686-pc-linux-gnu/bin/ld: BFD 2.16.1 assertion fail /var/tmp/portage/binutils-2.16.1-r2/work/binutils-2.16.1/bfd/elflink.c:2356/usr/lib/gcc/i686-pc-linux-gnu/4.1.0/../../../../i686-pc-linux-gnu/bin/ld: BFD 2.16.1 assertion fail /var/tmp/portage/binutils-2.16.1-r2/work/binutils-2.16.1/bfd/elflink.c:2357/usr/lib/gcc/i686-pc-linux-gnu/4.1.0/../../../../i686-pc-linux-gnu/bin/ld: BFD 2.16.1 assertion fail /var/tmp/portage/binutils-2.16.1-r2/work/binutils-2.16.1/bfd/elflink.c:2356/usr/lib/gcc/i686-pc-linux-gnu/4.1.0/../../../../i686-pc-linux-gnu/bin/ld: BFD 2.16.1 assertion fail /var/tmp/portage/binutils-2.16.1-r2/work/binutils-2.16.1/bfd/elflink.c:2357/usr/lib/gcc/i686-pc-linux-gnu/4.1.0/../../../../i686-pc-linux-gnu/bin/ld: BFD 2.16.1 internal error, aborting at /var/tmp/portage/binutils-2.16.1-r2/work/binutils-2.16.1/bfd/elflink.c line 6536 in elf_link_output_extsym/usr/lib/gcc/i686-pc-linux-gnu/4.1.0/../../../../i686-pc-linux-gnu/bin/ld: Please report this bug.collect2: ld returned 1 exit statusconfigure:3664: $? = 1configure: failed program was:| /* confdefs.h.  */| | #define PACKAGE_NAME ""| #define PACKAGE_TARNAME ""| #define PACKAGE_VERSION ""| #define PACKAGE_STRING ""| #define PACKAGE_BUGREPORT ""| #ifdef __cplusplus| extern "C" void std::exit (int) throw (); using std::exit;| #endif| #define _GNU_SOURCE 1| /* end confdefs.h.  */| | /* Override any gcc2 internal prototype to avoid an error.  */| #ifdef __cplusplus| extern "C"| #endif| /* We use char because int might match the return type of a gcc2|    builtin and then its argument prototype would still apply.  */| char gethostbyname ();| int| main ()| {| gethostbyname ();|   ;|   return 0;| }configure:3689: result: noconfigure:3697: checking for socketconfigure:3754: i686-pc-linux-gnu-g++ -o conftest -march=pentium2 -O2 -fomit-frame-pointer -pipe  -Wl,--as-needed conftest.cc  -lsupc++ >&5/usr/lib/gcc/i686-pc-linux-gnu/4.1.0/../../../../i686-pc-linux-gnu/bin/ld: BFD 2.16.1 assertion fail /var/tmp/portage/binutils-2.16.1-r2/work/binutils-2.16.1/bfd/elflink.c:2356/usr/lib/gcc/i686-pc-linux-gnu/4.1.0/../../../../i686-pc-linux-gnu/bin/ld: BFD 2.16.1 assertion fail /var/tmp/portage/binutils-2.16.1-r2/work/binutils-2.16.1/bfd/elflink.c:2357/usr/lib/gcc/i686-pc-linux-gnu/4.1.0/../../../../i686-pc-linux-gnu/bin/ld: BFD 2.16.1 assertion fail /var/tmp/portage/binutils-2.16.1-r2/work/binutils-2.16.1/bfd/elflink.c:2356/usr/lib/gcc/i686-pc-linux-gnu/4.1.0/../../../../i686-pc-linux-gnu/bin/ld: BFD 2.16.1 assertion fail /var/tmp/portage/binutils-2.16.1-r2/work/binutils-2.16.1/bfd/elflink.c:2357/usr/lib/gcc/i686-pc-linux-gnu/4.1.0/../../../../i686-pc-linux-gnu/bin/ld: BFD 2.16.1 assertion fail /var/tmp/portage/binutils-2.16.1-r2/work/binutils-2.16.1/bfd/elflink.c:2356/usr/lib/gcc/i686-pc-linux-gnu/4.1.0/../../../../i686-pc-linux-gnu/bin/ld: BFD 2.16.1 assertion fail /var/tmp/portage/binutils-2.16.1-r2/work/binutils-2.16.1/bfd/elflink.c:2357/usr/lib/gcc/i686-pc-linux-gnu/4.1.0/../../../../i686-pc-linux-gnu/bin/ld: BFD 2.16.1 assertion fail /var/tmp/portage/binutils-2.16.1-r2/work/binutils-2.16.1/bfd/elflink.c:2356/usr/lib/gcc/i686-pc-linux-gnu/4.1.0/../../../../i686-pc-linux-gnu/bin/ld: BFD 2.16.1 assertion fail /var/tmp/portage/binutils-2.16.1-r2/work/binutils-2.16.1/bfd/elflink.c:2357/usr/lib/gcc/i686-pc-linux-gnu/4.1.0/../../../../i686-pc-linux-gnu/bin/ld: BFD 2.16.1 assertion fail /var/tmp/portage/binutils-2.16.1-r2/work/binutils-2.16.1/bfd/elflink.c:2356/usr/lib/gcc/i686-pc-linux-gnu/4.1.0/../../../../i686-pc-linux-gnu/bin/ld: BFD 2.16.1 assertion fail /var/tmp/portage/binutils-2.16.1-r2/work/binutils-2.16.1/bfd/elflink.c:2357/usr/lib/gcc/i686-pc-linux-gnu/4.1.0/../../../../i686-pc-linux-gnu/bin/ld: BFD 2.16.1 assertion fail /var/tmp/portage/binutils-2.16.1-r2/work/binutils-2.16.1/bfd/elflink.c:2356/usr/lib/gcc/i686-pc-linux-gnu/4.1.0/../../../../i686-pc-linux-gnu/bin/ld: BFD 2.16.1 assertion fail /var/tmp/portage/binutils-2.16.1-r2/work/binutils-2.16.1/bfd/elflink.c:2357/usr/lib/gcc/i686-pc-linux-gnu/4.1.0/../../../../i686-pc-linux-gnu/bin/ld: BFD 2.16.1 assertion fail /var/tmp/portage/binutils-2.16.1-r2/work/binutils-2.16.1/bfd/elflink.c:2356/usr/lib/gcc/i686-pc-linux-gnu/4.1.0/../../../../i686-pc-linux-gnu/bin/ld: BFD 2.16.1 assertion fail /var/tmp/portage/binutils-2.16.1-r2/work/binutils-2.16.1/bfd/elflink.c:2357/usr/lib/gcc/i686-pc-linux-gnu/4.1.0/../../../../i686-pc-linux-gnu/bin/ld: BFD 2.16.1 assertion fail /var/tmp/portage/binutils-2.16.1-r2/work/binutils-2.16.1/bfd/elflink.c:2356/usr/lib/gcc/i686-pc-linux-gnu/4.1.0/../../../../i686-pc-linux-gnu/bin/ld: BFD 2.16.1 assertion fail /var/tmp/portage/binutils-2.16.1-r2/work/binutils-2.16.1/bfd/elflink.c:2357/usr/lib/gcc/i686-pc-linux-gnu/4.1.0/../../../../i686-pc-linux-gnu/bin/ld: BFD 2.16.1 assertion fail /var/tmp/portage/binutils-2.16.1-r2/work/binutils-2.16.1/bfd/elflink.c:2356/usr/lib/gcc/i686-pc-linux-gnu/4.1.0/../../../../i686-pc-linux-gnu/bin/ld: BFD 2.16.1 assertion fail /var/tmp/portage/binutils-2.16.1-r2/work/binutils-2.16.1/bfd/elflink.c:2357/usr/lib/gcc/i686-pc-linux-gnu/4.1.0/../../../../i686-pc-linux-gnu/bin/ld: BFD 2.16.1 assertion fail /var/tmp/portage/binutils-2.16.1-r2/work/binutils-2.16.1/bfd/elflink.c:2356/usr/lib/gcc/i686-pc-linux-gnu/4.1.0/../../../../i686-pc-linux-gnu/bin/ld: BFD 2.16.1 assertion fail /var/tmp/portage/binutils-2.16.1-r2/work/binutils-2.16.1/bfd/elflink.c:2357/usr/lib/gcc/i686-pc-linux-gnu/4.1.0/../../../../i686-pc-linux-gnu/bin/ld: BFD 2.16.1 assertion fail /var/tmp/portage/binutils-2.16.1-r2/work/binutils-2.16.1/bfd/elflink.c:2356/usr/lib/gcc/i686-pc-linux-gnu/4.1.0/../../../../i686-pc-linux-gnu/bin/ld: BFD 2.16.1 assertion fail /var/tmp/portage/binutils-2.16.1-r2/work/binutils-2.16.1/bfd/elflink.c:2357/usr/lib/gcc/i686-pc-linux-gnu/4.1.0/../../../../i686-pc-linux-gnu/bin/ld: BFD 2.16.1 assertion fail /var/tmp/portage/binutils-2.16.1-r2/work/binutils-2.16.1/bfd/elflink.c:2356/usr/lib/gcc/i686-pc-linux-gnu/4.1.0/../../../../i686-pc-linux-gnu/bin/ld: BFD 2.16.1 assertion fail /var/tmp/portage/binutils-2.16.1-r2/work/binutils-2.16.1/bfd/elflink.c:2357/usr/lib/gcc/i686-pc-linux-gnu/4.1.0/../../../../i686-pc-linux-gnu/bin/ld: BFD 2.16.1 assertion fail /var/tmp/portage/binutils-2.16.1-r2/work/binutils-2.16.1/bfd/elflink.c:2356/usr/lib/gcc/i686-pc-linux-gnu/4.1.0/../../../../i686-pc-linux-gnu/bin/ld: BFD 2.16.1 assertion fail /var/tmp/portage/binutils-2.16.1-r2/work/binutils-2.16.1/bfd/elflink.c:2357/usr/lib/gcc/i686-pc-linux-gnu/4.1.0/../../../../i686-pc-linux-gnu/bin/ld: BFD 2.16.1 assertion fail /var/tmp/portage/binutils-2.16.1-r2/work/binutils-2.16.1/bfd/elflink.c:2356/usr/lib/gcc/i686-pc-linux-gnu/4.1.0/../../../../i686-pc-linux-gnu/bin/ld: BFD 2.16.1 assertion fail /var/tmp/portage/binutils-2.16.1-r2/work/binutils-2.16.1/bfd/elflink.c:2357/usr/lib/gcc/i686-pc-linux-gnu/4.1.0/../../../../i686-pc-linux-gnu/bin/ld: BFD 2.16.1 assertion fail /var/tmp/portage/binutils-2.16.1-r2/work/binutils-2.16.1/bfd/elflink.c:2356/usr/lib/gcc/i686-pc-linux-gnu/4.1.0/../../../../i686-pc-linux-gnu/bin/ld: BFD 2.16.1 assertion fail /var/tmp/portage/binutils-2.16.1-r2/work/binutils-2.16.1/bfd/elflink.c:2357/usr/lib/gcc/i686-pc-linux-gnu/4.1.0/../../../../i686-pc-linux-gnu/bin/ld: BFD 2.16.1 assertion fail /var/tmp/portage/binutils-2.16.1-r2/work/binutils-2.16.1/bfd/elflink.c:2356/usr/lib/gcc/i686-pc-linux-gnu/4.1.0/../../../../i686-pc-linux-gnu/bin/ld: BFD 2.16.1 assertion fail /var/tmp/portage/binutils-2.16.1-r2/work/binutils-2.16.1/bfd/elflink.c:2357/usr/lib/gcc/i686-pc-linux-gnu/4.1.0/../../../../i686-pc-linux-gnu/bin/ld: BFD 2.16.1 assertion fail /var/tmp/portage/binutils-2.16.1-r2/work/binutils-2.16.1/bfd/elflink.c:2356/usr/lib/gcc/i686-pc-linux-gnu/4.1.0/../../../../i686-pc-linux-gnu/bin/ld: BFD 2.16.1 assertion fail /var/tmp/portage/binutils-2.16.1-r2/work/binutils-2.16.1/bfd/elflink.c:2357/usr/lib/gcc/i686-pc-linux-gnu/4.1.0/../../../../i686-pc-linux-gnu/bin/ld: BFD 2.16.1 assertion fail /var/tmp/portage/binutils-2.16.1-r2/work/binutils-2.16.1/bfd/elflink.c:2356/usr/lib/gcc/i686-pc-linux-gnu/4.1.0/../../../../i686-pc-linux-gnu/bin/ld: BFD 2.16.1 assertion fail /var/tmp/portage/binutils-2.16.1-r2/work/binutils-2.16.1/bfd/elflink.c:2357/usr/lib/gcc/i686-pc-linux-gnu/4.1.0/../../../../i686-pc-linux-gnu/bin/ld: BFD 2.16.1 assertion fail /var/tmp/portage/binutils-2.16.1-r2/work/binutils-2.16.1/bfd/elflink.c:2356/usr/lib/gcc/i686-pc-linux-gnu/4.1.0/../../../../i686-pc-linux-gnu/bin/ld: BFD 2.16.1 assertion fail /var/tmp/portage/binutils-2.16.1-r2/work/binutils-2.16.1/bfd/elflink.c:2357/usr/lib/gcc/i686-pc-linux-gnu/4.1.0/../../../../i686-pc-linux-gnu/bin/ld: BFD 2.16.1 assertion fail /var/tmp/portage/binutils-2.16.1-r2/work/binutils-2.16.1/bfd/elflink.c:2356/usr/lib/gcc/i686-pc-linux-gnu/4.1.0/../../../../i686-pc-linux-gnu/bin/ld: BFD 2.16.1 assertion fail /var/tmp/portage/binutils-2.16.1-r2/work/binutils-2.16.1/bfd/elflink.c:2357/usr/lib/gcc/i686-pc-linux-gnu/4.1.0/../../../../i686-pc-linux-gnu/bin/ld: BFD 2.16.1 assertion fail /var/tmp/portage/binutils-2.16.1-r2/work/binutils-2.16.1/bfd/elflink.c:2356/usr/lib/gcc/i686-pc-linux-gnu/4.1.0/../../../../i686-pc-linux-gnu/bin/ld: BFD 2.16.1 assertion fail /var/tmp/portage/binutils-2.16.1-r2/work/binutils-2.16.1/bfd/elflink.c:2357/usr/lib/gcc/i686-pc-linux-gnu/4.1.0/../../../../i686-pc-linux-gnu/bin/ld: BFD 2.16.1 assertion fail /var/tmp/portage/binutils-2.16.1-r2/work/binutils-2.16.1/bfd/elflink.c:2356/usr/lib/gcc/i686-pc-linux-gnu/4.1.0/../../../../i686-pc-linux-gnu/bin/ld: BFD 2.16.1 assertion fail /var/tmp/portage/binutils-2.16.1-r2/work/binutils-2.16.1/bfd/elflink.c:2357/usr/lib/gcc/i686-pc-linux-gnu/4.1.0/../../../../i686-pc-linux-gnu/bin/ld: BFD 2.16.1 assertion fail /var/tmp/portage/binutils-2.16.1-r2/work/binutils-2.16.1/bfd/elflink.c:2356/usr/lib/gcc/i686-pc-linux-gnu/4.1.0/../../../../i686-pc-linux-gnu/bin/ld: BFD 2.16.1 assertion fail /var/tmp/portage/binutils-2.16.1-r2/work/binutils-2.16.1/bfd/elflink.c:2357/usr/lib/gcc/i686-pc-linux-gnu/4.1.0/../../../../i686-pc-linux-gnu/bin/ld: BFD 2.16.1 assertion fail /var/tmp/portage/binutils-2.16.1-r2/work/binutils-2.16.1/bfd/elflink.c:2356/usr/lib/gcc/i686-pc-linux-gnu/4.1.0/../../../../i686-pc-linux-gnu/bin/ld: BFD 2.16.1 assertion fail /var/tmp/portage/binutils-2.16.1-r2/work/binutils-2.16.1/bfd/elflink.c:2357/usr/lib/gcc/i686-pc-linux-gnu/4.1.0/../../../../i686-pc-linux-gnu/bin/ld: BFD 2.16.1 internal error, aborting at /var/tmp/portage/binutils-2.16.1-r2/work/binutils-2.16.1/bfd/elflink.c line 6536 in elf_link_output_extsym/usr/lib/gcc/i686-pc-linux-gnu/4.1.0/../../../../i686-pc-linux-gnu/bin/ld: Please report this bug.collect2: ld returned 1 exit statusconfigure:3760: $? = 1configure: failed program was:| /* confdefs.h.  */| | #define PACKAGE_NAME ""| #define PACKAGE_TARNAME ""| #define PACKAGE_VERSION ""| #define PACKAGE_STRING ""| #define PACKAGE_BUGREPORT ""| #ifdef __cplusplus| extern "C" void std::exit (int) throw (); using std::exit;| #endif| #define _GNU_SOURCE 1| /* end confdefs.h.  */| /* Define socket to an innocuous variant, in case <limits.h> declares socket.|    For example, HP-UX 11i <limits.h> declares gettimeofday.  */| #define socket innocuous_socket| | /* System header to define __stub macros and hopefully few prototypes,|     which can conflict with char socket (); below.|     Prefer <limits.h> to <assert.h> if __STDC__ is defined, since|     <limits.h> exists even on freestanding compilers.  */| | #ifdef __STDC__| # include <limits.h>| #else| # include <assert.h>| #endif| | #undef socket| | /* Override any gcc2 internal prototype to avoid an error.  */| #ifdef __cplusplus| extern "C"| {| #endif| /* We use char because int might match the return type of a gcc2|    builtin and then its argument prototype would still apply.  */| char socket ();| /* The GNU C library defines this for functions which it implements|     to always fail with ENOSYS.  Some functions are actually named|     something starting with __ and the normal name is an alias.  */| #if defined (__stub_socket) || defined (__stub___socket)| choke me| #else| char (*f) () = socket;| #endif| #ifdef __cplusplus| }| #endif| | int| main ()| {| return f != socket;|   ;|   return 0;| }configure:3784: result: noconfigure:3789: checking for socket in -lsocketconfigure:3819: i686-pc-linux-gnu-g++ -o conftest -march=pentium2 -O2 -fomit-frame-pointer -pipe  -Wl,--as-needed conftest.cc -lsocket   -lsupc++ >&5/usr/lib/gcc/i686-pc-linux-gnu/4.1.0/../../../../i686-pc-linux-gnu/bin/ld: cannot find -lsocketcollect2: ld returned 1 exit statusconfigure:3825: $? = 1configure: failed program was:| /* confdefs.h.  */| | #define PACKAGE_NAME ""| #define PACKAGE_TARNAME ""| #define PACKAGE_VERSION ""| #define PACKAGE_STRING ""| #define PACKAGE_BUGREPORT ""| #ifdef __cplusplus| extern "C" void std::exit (int) throw (); using std::exit;| #endif| #define _GNU_SOURCE 1| /* end confdefs.h.  */| | /* Override any gcc2 internal prototype to avoid an error.  */| #ifdef __cplusplus| extern "C"| #endif| /* We use char because int might match the return type of a gcc2|    builtin and then its argument prototype would still apply.  */| char socket ();| int| main ()| {| socket ();|   ;|   return 0;| }configure:3850: result: noconfigure:4302: checking for mvconfigure:4320: found /bin/mvconfigure:4333: result: /bin/mvconfigure:4342: checking for cpconfigure:4360: found /bin/cpconfigure:4373: result: /bin/cpconfigure:4382: checking for lnconfigure:4400: found /bin/lnconfigure:4413: result: /bin/lnconfigure:4422: checking for sedconfigure:4440: found /bin/sedconfigure:4453: result: /bin/sedconfigure:4462: checking for echoconfigure:4480: found /bin/echoconfigure:4493: result: /bin/echoconfigure:4502: checking for cmpconfigure:4520: found /usr/bin/cmpconfigure:4533: result: /usr/bin/cmpconfigure:4542: checking for ticconfigure:4560: found /usr/bin/ticconfigure:4572: result: /usr/bin/ticconfigure:4587: checking how to run the C++ preprocessorconfigure:4618: i686-pc-linux-gnu-g++ -E  conftest.ccconfigure:4624: $? = 0configure:4656: i686-pc-linux-gnu-g++ -E  conftest.ccconftest.cc:17:28: error: ac_nonexistent.h: No such file or directoryconfigure:4662: $? = 1configure: failed program was:| /* confdefs.h.  */| | #define PACKAGE_NAME ""| #define PACKAGE_TARNAME ""| #define PACKAGE_VERSION ""| #define PACKAGE_STRING ""| #define PACKAGE_BUGREPORT ""| #ifdef __cplusplus| extern "C" void std::exit (int) throw (); using std::exit;| #endif| #define _GNU_SOURCE 1| #define RESFALLBACK "Rxvt"| #define RESNAME "urxvt"| #define RESCLASS "URxvt"| #define RXVTNAME "urxvt"| /* end confdefs.h.  */| #include <ac_nonexistent.h>configure:4701: result: i686-pc-linux-gnu-g++ -Econfigure:4725: i686-pc-linux-gnu-g++ -E  conftest.ccconfigure:4731: $? = 0configure:4763: i686-pc-linux-gnu-g++ -E  conftest.ccconftest.cc:17:28: error: ac_nonexistent.h: No such file or directoryconfigure:4769: $? = 1configure: failed program was:| /* confdefs.h.  */| | #define PACKAGE_NAME ""| #define PACKAGE_TARNAME ""| #define PACKAGE_VERSION ""| #define PACKAGE_STRING ""| #define PACKAGE_BUGREPORT ""| #ifdef __cplusplus| extern "C" void std::exit (int) throw (); using std::exit;| #endif| #define _GNU_SOURCE 1| #define RESFALLBACK "Rxvt"| #define RESNAME "urxvt"| #define RESCLASS "URxvt"| #define RXVTNAME "urxvt"| /* end confdefs.h.  */| #include <ac_nonexistent.h>configure:4815: checking for Xconfigure:4921: i686-pc-linux-gnu-g++ -E  conftest.ccconfigure:4927: $? = 0configure:4977: i686-pc-linux-gnu-g++ -o conftest -march=pentium2 -O2 -fomit-frame-pointer -pipe  -Wl,--as-needed conftest.cc -lX11  -lsupc++ >&5/usr/lib/gcc/i686-pc-linux-gnu/4.1.0/../../../../i686-pc-linux-gnu/bin/ld: BFD 2.16.1 assertion fail /var/tmp/portage/binutils-2.16.1-r2/work/binutils-2.16.1/bfd/elflink.c:2356/usr/lib/gcc/i686-pc-linux-gnu/4.1.0/../../../../i686-pc-linux-gnu/bin/ld: BFD 2.16.1 assertion fail /var/tmp/portage/binutils-2.16.1-r2/work/binutils-2.16.1/bfd/elflink.c:2357/usr/lib/gcc/i686-pc-linux-gnu/4.1.0/../../../../i686-pc-linux-gnu/bin/ld: BFD 2.16.1 assertion fail /var/tmp/portage/binutils-2.16.1-r2/work/binutils-2.16.1/bfd/elflink.c:2356/usr/lib/gcc/i686-pc-linux-gnu/4.1.0/../../../../i686-pc-linux-gnu/bin/ld: BFD 2.16.1 assertion fail /var/tmp/portage/binutils-2.16.1-r2/work/binutils-2.16.1/bfd/elflink.c:2357/usr/lib/gcc/i686-pc-linux-gnu/4.1.0/../../../../i686-pc-linux-gnu/bin/ld: BFD 2.16.1 assertion fail /var/tmp/portage/binutils-2.16.1-r2/work/binutils-2.16.1/bfd/elflink.c:2356/usr/lib/gcc/i686-pc-linux-gnu/4.1.0/../../../../i686-pc-linux-gnu/bin/ld: BFD 2.16.1 assertion fail /var/tmp/portage/binutils-2.16.1-r2/work/binutils-2.16.1/bfd/elflink.c:2357/usr/lib/gcc/i686-pc-linux-gnu/4.1.0/../../../../i686-pc-linux-gnu/bin/ld: BFD 2.16.1 assertion fail /var/tmp/portage/binutils-2.16.1-r2/work/binutils-2.16.1/bfd/elflink.c:2356/usr/lib/gcc/i686-pc-linux-gnu/4.1.0/../../../../i686-pc-linux-gnu/bin/ld: BFD 2.16.1 assertion fail /var/tmp/portage/binutils-2.16.1-r2/work/binutils-2.16.1/bfd/elflink.c:2357/usr/lib/gcc/i686-pc-linux-gnu/4.1.0/../../../../i686-pc-linux-gnu/bin/ld: BFD 2.16.1 assertion fail /var/tmp/portage/binutils-2.16.1-r2/work/binutils-2.16.1/bfd/elflink.c:2356/usr/lib/gcc/i686-pc-linux-gnu/4.1.0/../../../../i686-pc-linux-gnu/bin/ld: BFD 2.16.1 assertion fail /var/tmp/portage/binutils-2.16.1-r2/work/binutils-2.16.1/bfd/elflink.c:2357/usr/lib/gcc/i686-pc-linux-gnu/4.1.0/../../../../i686-pc-linux-gnu/bin/ld: BFD 2.16.1 assertion fail /var/tmp/portage/binutils-2.16.1-r2/work/binutils-2.16.1/bfd/elflink.c:2356/usr/lib/gcc/i686-pc-linux-gnu/4.1.0/../../../../i686-pc-linux-gnu/bin/ld: BFD 2.16.1 assertion fail /var/tmp/portage/binutils-2.16.1-r2/work/binutils-2.16.1/bfd/elflink.c:2357/usr/lib/gcc/i686-pc-linux-gnu/4.1.0/../../../../i686-pc-linux-gnu/bin/ld: BFD 2.16.1 assertion fail /var/tmp/portage/binutils-2.16.1-r2/work/binutils-2.16.1/bfd/elflink.c:2356/usr/lib/gcc/i686-pc-linux-gnu/4.1.0/../../../../i686-pc-linux-gnu/bin/ld: BFD 2.16.1 assertion fail /var/tmp/portage/binutils-2.16.1-r2/work/binutils-2.16.1/bfd/elflink.c:2357/usr/lib/gcc/i686-pc-linux-gnu/4.1.0/../../../../i686-pc-linux-gnu/bin/ld: BFD 2.16.1 assertion fail /var/tmp/portage/binutils-2.16.1-r2/work/binutils-2.16.1/bfd/elflink.c:2356/usr/lib/gcc/i686-pc-linux-gnu/4.1.0/../../../../i686-pc-linux-gnu/bin/ld: BFD 2.16.1 assertion fail /var/tmp/portage/binutils-2.16.1-r2/work/binutils-2.16.1/bfd/elflink.c:2357/usr/lib/gcc/i686-pc-linux-gnu/4.1.0/../../../../i686-pc-linux-gnu/bin/ld: BFD 2.16.1 assertion fail /var/tmp/portage/binutils-2.16.1-r2/work/binutils-2.16.1/bfd/elflink.c:2356/usr/lib/gcc/i686-pc-linux-gnu/4.1.0/../../../../i686-pc-linux-gnu/bin/ld: BFD 2.16.1 assertion fail /var/tmp/portage/binutils-2.16.1-r2/work/binutils-2.16.1/bfd/elflink.c:2357/usr/lib/gcc/i686-pc-linux-gnu/4.1.0/../../../../i686-pc-linux-gnu/bin/ld: BFD 2.16.1 assertion fail /var/tmp/portage/binutils-2.16.1-r2/work/binutils-2.16.1/bfd/elflink.c:2356/usr/lib/gcc/i686-pc-linux-gnu/4.1.0/../../../../i686-pc-linux-gnu/bin/ld: BFD 2.16.1 assertion fail /var/tmp/portage/binutils-2.16.1-r2/work/binutils-2.16.1/bfd/elflink.c:2357/usr/lib/gcc/i686-pc-linux-gnu/4.1.0/../../../../i686-pc-linux-gnu/bin/ld: BFD 2.16.1 assertion fail /var/tmp/portage/binutils-2.16.1-r2/work/binutils-2.16.1/bfd/elflink.c:2356/usr/lib/gcc/i686-pc-linux-gnu/4.1.0/../../../../i686-pc-linux-gnu/bin/ld: BFD 2.16.1 assertion fail /var/tmp/portage/binutils-2.16.1-r2/work/binutils-2.16.1/bfd/elflink.c:2357/usr/lib/gcc/i686-pc-linux-gnu/4.1.0/../../../../i686-pc-linux-gnu/bin/ld: BFD 2.16.1 assertion fail /var/tmp/portage/binutils-2.16.1-r2/work/binutils-2.16.1/bfd/elflink.c:2356/usr/lib/gcc/i686-pc-linux-gnu/4.1.0/../../../../i686-pc-linux-gnu/bin/ld: BFD 2.16.1 assertion fail /var/tmp/portage/binutils-2.16.1-r2/work/binutils-2.16.1/bfd/elflink.c:2357/usr/lib/gcc/i686-pc-linux-gnu/4.1.0/../../../../i686-pc-linux-gnu/bin/ld: BFD 2.16.1 assertion fail /var/tmp/portage/binutils-2.16.1-r2/work/binutils-2.16.1/bfd/elflink.c:2356/usr/lib/gcc/i686-pc-linux-gnu/4.1.0/../../../../i686-pc-linux-gnu/bin/ld: BFD 2.16.1 assertion fail /var/tmp/portage/binutils-2.16.1-r2/work/binutils-2.16.1/bfd/elflink.c:2357/usr/lib/gcc/i686-pc-linux-gnu/4.1.0/../../../../i686-pc-linux-gnu/bin/ld: BFD 2.16.1 assertion fail /var/tmp/portage/binutils-2.16.1-r2/work/binutils-2.16.1/bfd/elflink.c:2356/usr/lib/gcc/i686-pc-linux-gnu/4.1.0/../../../../i686-pc-linux-gnu/bin/ld: BFD 2.16.1 assertion fail /var/tmp/portage/binutils-2.16.1-r2/work/binutils-2.16.1/bfd/elflink.c:2357/usr/lib/gcc/i686-pc-linux-gnu/4.1.0/../../../../i686-pc-linux-gnu/bin/ld: BFD 2.16.1 assertion fail /var/tmp/portage/binutils-2.16.1-r2/work/binutils-2.16.1/bfd/elflink.c:2356/usr/lib/gcc/i686-pc-linux-gnu/4.1.0/../../../../i686-pc-linux-gnu/bin/ld: BFD 2.16.1 assertion fail /var/tmp/portage/binutils-2.16.1-r2/work/binutils-2.16.1/bfd/elflink.c:2357/usr/lib/gcc/i686-pc-linux-gnu/4.1.0/../../../../i686-pc-linux-gnu/bin/ld: BFD 2.16.1 assertion fail /var/tmp/portage/binutils-2.16.1-r2/work/binutils-2.16.1/bfd/elflink.c:2356/usr/lib/gcc/i686-pc-linux-gnu/4.1.0/../../../../i686-pc-linux-gnu/bin/ld: BFD 2.16.1 assertion fail /var/tmp/portage/binutils-2.16.1-r2/work/binutils-2.16.1/bfd/elflink.c:2357/usr/lib/gcc/i686-pc-linux-gnu/4.1.0/../../../../i686-pc-linux-gnu/bin/ld: BFD 2.16.1 assertion fail /var/tmp/portage/binutils-2.16.1-r2/work/binutils-2.16.1/bfd/elflink.c:2356/usr/lib/gcc/i686-pc-linux-gnu/4.1.0/../../../../i686-pc-linux-gnu/bin/ld: BFD 2.16.1 assertion fail /var/tmp/portage/binutils-2.16.1-r2/work/binutils-2.16.1/bfd/elflink.c:2357/usr/lib/gcc/i686-pc-linux-gnu/4.1.0/../../../../i686-pc-linux-gnu/bin/ld: BFD 2.16.1 assertion fail /var/tmp/portage/binutils-2.16.1-r2/work/binutils-2.16.1/bfd/elflink.c:2356/usr/lib/gcc/i686-pc-linux-gnu/4.1.0/../../../../i686-pc-linux-gnu/bin/ld: BFD 2.16.1 assertion fail /var/tmp/portage/binutils-2.16.1-r2/work/binutils-2.16.1/bfd/elflink.c:2357/usr/lib/gcc/i686-pc-linux-gnu/4.1.0/../../../../i686-pc-linux-gnu/bin/ld: BFD 2.16.1 assertion fail /var/tmp/portage/binutils-2.16.1-r2/work/binutils-2.16.1/bfd/elflink.c:2356/usr/lib/gcc/i686-pc-linux-gnu/4.1.0/../../../../i686-pc-linux-gnu/bin/ld: BFD 2.16.1 assertion fail /var/tmp/portage/binutils-2.16.1-r2/work/binutils-2.16.1/bfd/elflink.c:2357/usr/lib/gcc/i686-pc-linux-gnu/4.1.0/../../../../i686-pc-linux-gnu/bin/ld: BFD 2.16.1 assertion fail /var/tmp/portage/binutils-2.16.1-r2/work/binutils-2.16.1/bfd/elflink.c:2356/usr/lib/gcc/i686-pc-linux-gnu/4.1.0/../../../../i686-pc-linux-gnu/bin/ld: BFD 2.16.1 assertion fail /var/tmp/portage/binutils-2.16.1-r2/work/binutils-2.16.1/bfd/elflink.c:2357/usr/lib/gcc/i686-pc-linux-gnu/4.1.0/../../../../i686-pc-linux-gnu/bin/ld: BFD 2.16.1 assertion fail /var/tmp/portage/binutils-2.16.1-r2/work/binutils-2.16.1/bfd/elflink.c:2356/usr/lib/gcc/i686-pc-linux-gnu/4.1.0/../../../../i686-pc-linux-gnu/bin/ld: BFD 2.16.1 assertion fail /var/tmp/portage/binutils-2.16.1-r2/work/binutils-2.16.1/bfd/elflink.c:2357/usr/lib/gcc/i686-pc-linux-gnu/4.1.0/../../../../i686-pc-linux-gnu/bin/ld: BFD 2.16.1 assertion fail /var/tmp/portage/binutils-2.16.1-r2/work/binutils-2.16.1/bfd/elflink.c:2356/usr/lib/gcc/i686-pc-linux-gnu/4.1.0/../../../../i686-pc-linux-gnu/bin/ld: BFD 2.16.1 assertion fail /var/tmp/portage/binutils-2.16.1-r2/work/binutils-2.16.1/bfd/elflink.c:2357/usr/lib/gcc/i686-pc-linux-gnu/4.1.0/../../../../i686-pc-linux-gnu/bin/ld: BFD 2.16.1 assertion fail /var/tmp/portage/binutils-2.16.1-r2/work/binutils-2.16.1/bfd/elflink.c:2356/usr/lib/gcc/i686-pc-linux-gnu/4.1.0/../../../../i686-pc-linux-gnu/bin/ld: BFD 2.16.1 assertion fail /var/tmp/portage/binutils-2.16.1-r2/work/binutils-2.16.1/bfd/elflink.c:2357/usr/lib/gcc/i686-pc-linux-gnu/4.1.0/../../../../i686-pc-linux-gnu/bin/ld: BFD 2.16.1 assertion fail /var/tmp/portage/binutils-2.16.1-r2/work/binutils-2.16.1/bfd/elflink.c:2356/usr/lib/gcc/i686-pc-linux-gnu/4.1.0/../../../../i686-pc-linux-gnu/bin/ld: BFD 2.16.1 assertion fail /var/tmp/portage/binutils-2.16.1-r2/work/binutils-2.16.1/bfd/elflink.c:2357/usr/lib/gcc/i686-pc-linux-gnu/4.1.0/../../../../i686-pc-linux-gnu/bin/ld: BFD 2.16.1 internal error, aborting at /var/tmp/portage/binutils-2.16.1-r2/work/binutils-2.16.1/bfd/elflink.c line 6536 in elf_link_output_extsym/usr/lib/gcc/i686-pc-linux-gnu/4.1.0/../../../../i686-pc-linux-gnu/bin/ld: Please report this bug.collect2: ld returned 1 exit statusconfigure:4983: $? = 1configure: failed program was:| /* confdefs.h.  */| | #define PACKAGE_NAME ""| #define PACKAGE_TARNAME ""| #define PACKAGE_VERSION ""| #define PACKAGE_STRING ""| #define PACKAGE_BUGREPORT ""| #ifdef __cplusplus| extern "C" void std::exit (int) throw (); using std::exit;| #endif| #define _GNU_SOURCE 1| #define RESFALLBACK "Rxvt"| #define RESNAME "urxvt"| #define RESCLASS "URxvt"| #define RXVTNAME "urxvt"| /* end confdefs.h.  */| #include <X11/Xlib.h>| int| main ()| {| XrmInitialize ()|   ;|   return 0;| }configure:5049: result: libraries /usr/X11R6/lib, headers in standard search pathconfigure:5220: i686-pc-linux-gnu-g++ -o conftest -march=pentium2 -O2 -fomit-frame-pointer -pipe  -Wl,--as-needed conftest.cc  -lsupc++  -L/usr/X11R6/lib -lX11 >&5/usr/lib/gcc/i686-pc-linux-gnu/4.1.0/../../../../i686-pc-linux-gnu/bin/ld: BFD 2.16.1 assertion fail /var/tmp/portage/binutils-2.16.1-r2/work/binutils-2.16.1/bfd/elflink.c:2356/usr/lib/gcc/i686-pc-linux-gnu/4.1.0/../../../../i686-pc-linux-gnu/bin/ld: BFD 2.16.1 assertion fail /var/tmp/portage/binutils-2.16.1-r2/work/binutils-2.16.1/bfd/elflink.c:2357/usr/lib/gcc/i686-pc-linux-gnu/4.1.0/../../../../i686-pc-linux-gnu/bin/ld: BFD 2.16.1 assertion fail /var/tmp/portage/binutils-2.16.1-r2/work/binutils-2.16.1/bfd/elflink.c:2356/usr/lib/gcc/i686-pc-linux-gnu/4.1.0/../../../../i686-pc-linux-gnu/bin/ld: BFD 2.16.1 assertion fail /var/tmp/portage/binutils-2.16.1-r2/work/binutils-2.16.1/bfd/elflink.c:2357/usr/lib/gcc/i686-pc-linux-gnu/4.1.0/../../../../i686-pc-linux-gnu/bin/ld: BFD 2.16.1 assertion fail /var/tmp/portage/binutils-2.16.1-r2/work/binutils-2.16.1/bfd/elflink.c:2356/usr/lib/gcc/i686-pc-linux-gnu/4.1.0/../../../../i686-pc-linux-gnu/bin/ld: BFD 2.16.1 assertion fail /var/tmp/portage/binutils-2.16.1-r2/work/binutils-2.16.1/bfd/elflink.c:2357/usr/lib/gcc/i686-pc-linux-gnu/4.1.0/../../../../i686-pc-linux-gnu/bin/ld: BFD 2.16.1 assertion fail /var/tmp/portage/binutils-2.16.1-r2/work/binutils-2.16.1/bfd/elflink.c:2356/usr/lib/gcc/i686-pc-linux-gnu/4.1.0/../../../../i686-pc-linux-gnu/bin/ld: BFD 2.16.1 assertion fail /var/tmp/portage/binutils-2.16.1-r2/work/binutils-2.16.1/bfd/elflink.c:2357/usr/lib/gcc/i686-pc-linux-gnu/4.1.0/../../../../i686-pc-linux-gnu/bin/ld: BFD 2.16.1 assertion fail /var/tmp/portage/binutils-2.16.1-r2/work/binutils-2.16.1/bfd/elflink.c:2356/usr/lib/gcc/i686-pc-linux-gnu/4.1.0/../../../../i686-pc-linux-gnu/bin/ld: BFD 2.16.1 assertion fail /var/tmp/portage/binutils-2.16.1-r2/work/binutils-2.16.1/bfd/elflink.c:2357/usr/lib/gcc/i686-pc-linux-gnu/4.1.0/../../../../i686-pc-linux-gnu/bin/ld: BFD 2.16.1 assertion fail /var/tmp/portage/binutils-2.16.1-r2/work/binutils-2.16.1/bfd/elflink.c:2356/usr/lib/gcc/i686-pc-linux-gnu/4.1.0/../../../../i686-pc-linux-gnu/bin/ld: BFD 2.16.1 assertion fail /var/tmp/portage/binutils-2.16.1-r2/work/binutils-2.16.1/bfd/elflink.c:2357/usr/lib/gcc/i686-pc-linux-gnu/4.1.0/../../../../i686-pc-linux-gnu/bin/ld: BFD 2.16.1 assertion fail /var/tmp/portage/binutils-2.16.1-r2/work/binutils-2.16.1/bfd/elflink.c:2356/usr/lib/gcc/i686-pc-linux-gnu/4.1.0/../../../../i686-pc-linux-gnu/bin/ld: BFD 2.16.1 assertion fail /var/tmp/portage/binutils-2.16.1-r2/work/binutils-2.16.1/bfd/elflink.c:2357/usr/lib/gcc/i686-pc-linux-gnu/4.1.0/../../../../i686-pc-linux-gnu/bin/ld: BFD 2.16.1 assertion fail /var/tmp/portage/binutils-2.16.1-r2/work/binutils-2.16.1/bfd/elflink.c:2356/usr/lib/gcc/i686-pc-linux-gnu/4.1.0/../../../../i686-pc-linux-gnu/bin/ld: BFD 2.16.1 assertion fail /var/tmp/portage/binutils-2.16.1-r2/work/binutils-2.16.1/bfd/elflink.c:2357/usr/lib/gcc/i686-pc-linux-gnu/4.1.0/../../../../i686-pc-linux-gnu/bin/ld: BFD 2.16.1 assertion fail /var/tmp/portage/binutils-2.16.1-r2/work/binutils-2.16.1/bfd/elflink.c:2356/usr/lib/gcc/i686-pc-linux-gnu/4.1.0/../../../../i686-pc-linux-gnu/bin/ld: BFD 2.16.1 assertion fail /var/tmp/portage/binutils-2.16.1-r2/work/binutils-2.16.1/bfd/elflink.c:2357/usr/lib/gcc/i686-pc-linux-gnu/4.1.0/../../../../i686-pc-linux-gnu/bin/ld: BFD 2.16.1 assertion fail /var/tmp/portage/binutils-2.16.1-r2/work/binutils-2.16.1/bfd/elflink.c:2356/usr/lib/gcc/i686-pc-linux-gnu/4.1.0/../../../../i686-pc-linux-gnu/bin/ld: BFD 2.16.1 assertion fail /var/tmp/portage/binutils-2.16.1-r2/work/binutils-2.16.1/bfd/elflink.c:2357/usr/lib/gcc/i686-pc-linux-gnu/4.1.0/../../../../i686-pc-linux-gnu/bin/ld: BFD 2.16.1 assertion fail /var/tmp/portage/binutils-2.16.1-r2/work/binutils-2.16.1/bfd/elflink.c:2356/usr/lib/gcc/i686-pc-linux-gnu/4.1.0/../../../../i686-pc-linux-gnu/bin/ld: BFD 2.16.1 assertion fail /var/tmp/portage/binutils-2.16.1-r2/work/binutils-2.16.1/bfd/elflink.c:2357/usr/lib/gcc/i686-pc-linux-gnu/4.1.0/../../../../i686-pc-linux-gnu/bin/ld: BFD 2.16.1 assertion fail /var/tmp/portage/binutils-2.16.1-r2/work/binutils-2.16.1/bfd/elflink.c:2356/usr/lib/gcc/i686-pc-linux-gnu/4.1.0/../../../../i686-pc-linux-gnu/bin/ld: BFD 2.16.1 assertion fail /var/tmp/portage/binutils-2.16.1-r2/work/binutils-2.16.1/bfd/elflink.c:2357/usr/lib/gcc/i686-pc-linux-gnu/4.1.0/../../../../i686-pc-linux-gnu/bin/ld: BFD 2.16.1 assertion fail /var/tmp/portage/binutils-2.16.1-r2/work/binutils-2.16.1/bfd/elflink.c:2356/usr/lib/gcc/i686-pc-linux-gnu/4.1.0/../../../../i686-pc-linux-gnu/bin/ld: BFD 2.16.1 assertion fail /var/tmp/portage/binutils-2.16.1-r2/work/binutils-2.16.1/bfd/elflink.c:2357/usr/lib/gcc/i686-pc-linux-gnu/4.1.0/../../../../i686-pc-linux-gnu/bin/ld: BFD 2.16.1 assertion fail /var/tmp/portage/binutils-2.16.1-r2/work/binutils-2.16.1/bfd/elflink.c:2356/usr/lib/gcc/i686-pc-linux-gnu/4.1.0/../../../../i686-pc-linux-gnu/bin/ld: BFD 2.16.1 assertion fail /var/tmp/portage/binutils-2.16.1-r2/work/binutils-2.16.1/bfd/elflink.c:2357/usr/lib/gcc/i686-pc-linux-gnu/4.1.0/../../../../i686-pc-linux-gnu/bin/ld: BFD 2.16.1 assertion fail /var/tmp/portage/binutils-2.16.1-r2/work/binutils-2.16.1/bfd/elflink.c:2356/usr/lib/gcc/i686-pc-linux-gnu/4.1.0/../../../../i686-pc-linux-gnu/bin/ld: BFD 2.16.1 assertion fail /var/tmp/portage/binutils-2.16.1-r2/work/binutils-2.16.1/bfd/elflink.c:2357/usr/lib/gcc/i686-pc-linux-gnu/4.1.0/../../../../i686-pc-linux-gnu/bin/ld: BFD 2.16.1 assertion fail /var/tmp/portage/binutils-2.16.1-r2/work/binutils-2.16.1/bfd/elflink.c:2356/usr/lib/gcc/i686-pc-linux-gnu/4.1.0/../../../../i686-pc-linux-gnu/bin/ld: BFD 2.16.1 assertion fail /var/tmp/portage/binutils-2.16.1-r2/work/binutils-2.16.1/bfd/elflink.c:2357/usr/lib/gcc/i686-pc-linux-gnu/4.1.0/../../../../i686-pc-linux-gnu/bin/ld: BFD 2.16.1 assertion fail /var/tmp/portage/binutils-2.16.1-r2/work/binutils-2.16.1/bfd/elflink.c:2356/usr/lib/gcc/i686-pc-linux-gnu/4.1.0/../../../../i686-pc-linux-gnu/bin/ld: BFD 2.16.1 assertion fail /var/tmp/portage/binutils-2.16.1-r2/work/binutils-2.16.1/bfd/elflink.c:2357/usr/lib/gcc/i686-pc-linux-gnu/4.1.0/../../../../i686-pc-linux-gnu/bin/ld: BFD 2.16.1 assertion fail /var/tmp/portage/binutils-2.16.1-r2/work/binutils-2.16.1/bfd/elflink.c:2356/usr/lib/gcc/i686-pc-linux-gnu/4.1.0/../../../../i686-pc-linux-gnu/bin/ld: BFD 2.16.1 assertion fail /var/tmp/portage/binutils-2.16.1-r2/work/binutils-2.16.1/bfd/elflink.c:2357/usr/lib/gcc/i686-pc-linux-gnu/4.1.0/../../../../i686-pc-linux-gnu/bin/ld: BFD 2.16.1 assertion fail /var/tmp/portage/binutils-2.16.1-r2/work/binutils-2.16.1/bfd/elflink.c:2356/usr/lib/gcc/i686-pc-linux-gnu/4.1.0/../../../../i686-pc-linux-gnu/bin/ld: BFD 2.16.1 assertion fail /var/tmp/portage/binutils-2.16.1-r2/work/binutils-2.16.1/bfd/elflink.c:2357/usr/lib/gcc/i686-pc-linux-gnu/4.1.0/../../../../i686-pc-linux-gnu/bin/ld: BFD 2.16.1 assertion fail /var/tmp/portage/binutils-2.16.1-r2/work/binutils-2.16.1/bfd/elflink.c:2356/usr/lib/gcc/i686-pc-linux-gnu/4.1.0/../../../../i686-pc-linux-gnu/bin/ld: BFD 2.16.1 assertion fail /var/tmp/portage/binutils-2.16.1-r2/work/binutils-2.16.1/bfd/elflink.c:2357/usr/lib/gcc/i686-pc-linux-gnu/4.1.0/../../../../i686-pc-linux-gnu/bin/ld: BFD 2.16.1 assertion fail /var/tmp/portage/binutils-2.16.1-r2/work/binutils-2.16.1/bfd/elflink.c:2356/usr/lib/gcc/i686-pc-linux-gnu/4.1.0/../../../../i686-pc-linux-gnu/bin/ld: BFD 2.16.1 assertion fail /var/tmp/portage/binutils-2.16.1-r2/work/binutils-2.16.1/bfd/elflink.c:2357/usr/lib/gcc/i686-pc-linux-gnu/4.1.0/../../../../i686-pc-linux-gnu/bin/ld: BFD 2.16.1 assertion fail /var/tmp/portage/binutils-2.16.1-r2/work/binutils-2.16.1/bfd/elflink.c:2356/usr/lib/gcc/i686-pc-linux-gnu/4.1.0/../../../../i686-pc-linux-gnu/bin/ld: BFD 2.16.1 assertion fail /var/tmp/portage/binutils-2.16.1-r2/work/binutils-2.16.1/bfd/elflink.c:2357/usr/lib/gcc/i686-pc-linux-gnu/4.1.0/../../../../i686-pc-linux-gnu/bin/ld: BFD 2.16.1 assertion fail /var/tmp/portage/binutils-2.16.1-r2/work/binutils-2.16.1/bfd/elflink.c:2356/usr/lib/gcc/i686-pc-linux-gnu/4.1.0/../../../../i686-pc-linux-gnu/bin/ld: BFD 2.16.1 assertion fail /var/tmp/portage/binutils-2.16.1-r2/work/binutils-2.16.1/bfd/elflink.c:2357/usr/lib/gcc/i686-pc-linux-gnu/4.1.0/../../../../i686-pc-linux-gnu/bin/ld: BFD 2.16.1 assertion fail /var/tmp/portage/binutils-2.16.1-r2/work/binutils-2.16.1/bfd/elflink.c:2356/usr/lib/gcc/i686-pc-linux-gnu/4.1.0/../../../../i686-pc-linux-gnu/bin/ld: BFD 2.16.1 assertion fail /var/tmp/portage/binutils-2.16.1-r2/work/binutils-2.16.1/bfd/elflink.c:2357/usr/lib/gcc/i686-pc-linux-gnu/4.1.0/../../../../i686-pc-linux-gnu/bin/ld: BFD 2.16.1 internal error, aborting at /var/tmp/portage/binutils-2.16.1-r2/work/binutils-2.16.1/bfd/elflink.c line 6536 in elf_link_output_extsym/usr/lib/gcc/i686-pc-linux-gnu/4.1.0/../../../../i686-pc-linux-gnu/bin/ld: Please report this bug.collect2: ld returned 1 exit statusconfigure:5226: $? = 1configure: failed program was:| /* confdefs.h.  */| | #define PACKAGE_NAME ""| #define PACKAGE_TARNAME ""| #define PACKAGE_VERSION ""| #define PACKAGE_STRING ""| #define PACKAGE_BUGREPORT ""| #ifdef __cplusplus| extern "C" void std::exit (int) throw (); using std::exit;| #endif| #define _GNU_SOURCE 1| #define RESFALLBACK "Rxvt"| #define RESNAME "urxvt"| #define RESCLASS "URxvt"| #define RXVTNAME "urxvt"| /* end confdefs.h.  */| | /* Override any gcc2 internal prototype to avoid an error.  */| #ifdef __cplusplus| extern "C"| #endif| /* We use char because int might match the return type of a gcc2|    builtin and then its argument prototype would still apply.  */| char XOpenDisplay ();| int| main ()| {| XOpenDisplay ();|   ;|   return 0;| }configure:5245: checking for dnet_ntoa in -ldnetconfigure:5275: i686-pc-linux-gnu-g++ -o conftest -march=pentium2 -O2 -fomit-frame-pointer -pipe  -Wl,--as-needed conftest.cc -ldnet   -lsupc++  -L/usr/X11R6/lib -lX11 >&5/usr/lib/gcc/i686-pc-linux-gnu/4.1.0/../../../../i686-pc-linux-gnu/bin/ld: cannot find -ldnetcollect2: ld returned 1 exit statusconfigure:5281: $? = 1configure: failed program was:| /* confdefs.h.  */| | #define PACKAGE_NAME ""| #define PACKAGE_TARNAME ""| #define PACKAGE_VERSION ""| #define PACKAGE_STRING ""| #define PACKAGE_BUGREPORT ""| #ifdef __cplusplus| extern "C" void std::exit (int) throw (); using std::exit;| #endif| #define _GNU_SOURCE 1| #define RESFALLBACK "Rxvt"| #define RESNAME "urxvt"| #define RESCLASS "URxvt"| #define RXVTNAME "urxvt"| /* end confdefs.h.  */| | /* Override any gcc2 internal prototype to avoid an error.  */| #ifdef __cplusplus| extern "C"| #endif| /* We use char because int might match the return type of a gcc2|    builtin and then its argument prototype would still apply.  */| char dnet_ntoa ();| int| main ()| {| dnet_ntoa ();|   ;|   return 0;| }configure:5306: result: noconfigure:5313: checking for dnet_ntoa in -ldnet_stubconfigure:5343: i686-pc-linux-gnu-g++ -o conftest -march=pentium2 -O2 -fomit-frame-pointer -pipe  -Wl,--as-needed conftest.cc -ldnet_stub   -lsupc++  -L/usr/X11R6/lib -lX11 >&5/usr/lib/gcc/i686-pc-linux-gnu/4.1.0/../../../../i686-pc-linux-gnu/bin/ld: cannot find -ldnet_stubcollect2: ld returned 1 exit statusconfigure:5349: $? = 1configure: failed program was:| /* confdefs.h.  */| | #define PACKAGE_NAME ""| #define PACKAGE_TARNAME ""| #define PACKAGE_VERSION ""| #define PACKAGE_STRING ""| #define PACKAGE_BUGREPORT ""| #ifdef __cplusplus| extern "C" void std::exit (int) throw (); using std::exit;| #endif| #define _GNU_SOURCE 1| #define RESFALLBACK "Rxvt"| #define RESNAME "urxvt"| #define RESCLASS "URxvt"| #define RXVTNAME "urxvt"| /* end confdefs.h.  */| | /* Override any gcc2 internal prototype to avoid an error.  */| #ifdef __cplusplus| extern "C"| #endif| /* We use char because int might match the return type of a gcc2|    builtin and then its argument prototype would still apply.  */| char dnet_ntoa ();| int| main ()| {| dnet_ntoa ();|   ;|   return 0;| }configure:5374: result: noconfigure:5394: checking for gethostbynameconfigure:5481: result: noconfigure:5485: checking for gethostbyname in -lnslconfigure:5546: result: noconfigure:5553: checking for gethostbyname in -lbsdconfigure:5583: i686-pc-linux-gnu-g++ -o conftest -march=pentium2 -O2 -fomit-frame-pointer -pipe  -Wl,--as-needed conftest.cc -lbsd   -lsupc++ >&5/usr/lib/gcc/i686-pc-linux-gnu/4.1.0/../../../../i686-pc-linux-gnu/bin/ld: BFD 2.16.1 assertion fail /var/tmp/portage/binutils-2.16.1-r2/work/binutils-2.16.1/bfd/elflink.c:2356/usr/lib/gcc/i686-pc-linux-gnu/4.1.0/../../../../i686-pc-linux-gnu/bin/ld: BFD 2.16.1 assertion fail /var/tmp/portage/binutils-2.16.1-r2/work/binutils-2.16.1/bfd/elflink.c:2357/usr/lib/gcc/i686-pc-linux-gnu/4.1.0/../../../../i686-pc-linux-gnu/bin/ld: BFD 2.16.1 assertion fail /var/tmp/portage/binutils-2.16.1-r2/work/binutils-2.16.1/bfd/elflink.c:2356/usr/lib/gcc/i686-pc-linux-gnu/4.1.0/../../../../i686-pc-linux-gnu/bin/ld: BFD 2.16.1 assertion fail /var/tmp/portage/binutils-2.16.1-r2/work/binutils-2.16.1/bfd/elflink.c:2357/usr/lib/gcc/i686-pc-linux-gnu/4.1.0/../../../../i686-pc-linux-gnu/bin/ld: BFD 2.16.1 assertion fail /var/tmp/portage/binutils-2.16.1-r2/work/binutils-2.16.1/bfd/elflink.c:2356/usr/lib/gcc/i686-pc-linux-gnu/4.1.0/../../../../i686-pc-linux-gnu/bin/ld: BFD 2.16.1 assertion fail /var/tmp/portage/binutils-2.16.1-r2/work/binutils-2.16.1/bfd/elflink.c:2357/usr/lib/gcc/i686-pc-linux-gnu/4.1.0/../../../../i686-pc-linux-gnu/bin/ld: BFD 2.16.1 assertion fail /var/tmp/portage/binutils-2.16.1-r2/work/binutils-2.16.1/bfd/elflink.c:2356/usr/lib/gcc/i686-pc-linux-gnu/4.1.0/../../../../i686-pc-linux-gnu/bin/ld: BFD 2.16.1 assertion fail /var/tmp/portage/binutils-2.16.1-r2/work/binutils-2.16.1/bfd/elflink.c:2357/usr/lib/gcc/i686-pc-linux-gnu/4.1.0/../../../../i686-pc-linux-gnu/bin/ld: BFD 2.16.1 assertion fail /var/tmp/portage/binutils-2.16.1-r2/work/binutils-2.16.1/bfd/elflink.c:2356/usr/lib/gcc/i686-pc-linux-gnu/4.1.0/../../../../i686-pc-linux-gnu/bin/ld: BFD 2.16.1 assertion fail /var/tmp/portage/binutils-2.16.1-r2/work/binutils-2.16.1/bfd/elflink.c:2357/usr/lib/gcc/i686-pc-linux-gnu/4.1.0/../../../../i686-pc-linux-gnu/bin/ld: BFD 2.16.1 assertion fail /var/tmp/portage/binutils-2.16.1-r2/work/binutils-2.16.1/bfd/elflink.c:2356/usr/lib/gcc/i686-pc-linux-gnu/4.1.0/../../../../i686-pc-linux-gnu/bin/ld: BFD 2.16.1 assertion fail /var/tmp/portage/binutils-2.16.1-r2/work/binutils-2.16.1/bfd/elflink.c:2357/usr/lib/gcc/i686-pc-linux-gnu/4.1.0/../../../../i686-pc-linux-gnu/bin/ld: BFD 2.16.1 assertion fail /var/tmp/portage/binutils-2.16.1-r2/work/binutils-2.16.1/bfd/elflink.c:2356/usr/lib/gcc/i686-pc-linux-gnu/4.1.0/../../../../i686-pc-linux-gnu/bin/ld: BFD 2.16.1 assertion fail /var/tmp/portage/binutils-2.16.1-r2/work/binutils-2.16.1/bfd/elflink.c:2357/usr/lib/gcc/i686-pc-linux-gnu/4.1.0/../../../../i686-pc-linux-gnu/bin/ld: BFD 2.16.1 assertion fail /var/tmp/portage/binutils-2.16.1-r2/work/binutils-2.16.1/bfd/elflink.c:2356/usr/lib/gcc/i686-pc-linux-gnu/4.1.0/../../../../i686-pc-linux-gnu/bin/ld: BFD 2.16.1 assertion fail /var/tmp/portage/binutils-2.16.1-r2/work/binutils-2.16.1/bfd/elflink.c:2357/usr/lib/gcc/i686-pc-linux-gnu/4.1.0/../../../../i686-pc-linux-gnu/bin/ld: BFD 2.16.1 assertion fail /var/tmp/portage/binutils-2.16.1-r2/work/binutils-2.16.1/bfd/elflink.c:2356/usr/lib/gcc/i686-pc-linux-gnu/4.1.0/../../../../i686-pc-linux-gnu/bin/ld: BFD 2.16.1 assertion fail /var/tmp/portage/binutils-2.16.1-r2/work/binutils-2.16.1/bfd/elflink.c:2357/usr/lib/gcc/i686-pc-linux-gnu/4.1.0/../../../../i686-pc-linux-gnu/bin/ld: BFD 2.16.1 assertion fail /var/tmp/portage/binutils-2.16.1-r2/work/binutils-2.16.1/bfd/elflink.c:2356/usr/lib/gcc/i686-pc-linux-gnu/4.1.0/../../../../i686-pc-linux-gnu/bin/ld: BFD 2.16.1 assertion fail /var/tmp/portage/binutils-2.16.1-r2/work/binutils-2.16.1/bfd/elflink.c:2357/usr/lib/gcc/i686-pc-linux-gnu/4.1.0/../../../../i686-pc-linux-gnu/bin/ld: BFD 2.16.1 assertion fail /var/tmp/portage/binutils-2.16.1-r2/work/binutils-2.16.1/bfd/elflink.c:2356/usr/lib/gcc/i686-pc-linux-gnu/4.1.0/../../../../i686-pc-linux-gnu/bin/ld: BFD 2.16.1 assertion fail /var/tmp/portage/binutils-2.16.1-r2/work/binutils-2.16.1/bfd/elflink.c:2357/usr/lib/gcc/i686-pc-linux-gnu/4.1.0/../../../../i686-pc-linux-gnu/bin/ld: BFD 2.16.1 assertion fail /var/tmp/portage/binutils-2.16.1-r2/work/binutils-2.16.1/bfd/elflink.c:2356/usr/lib/gcc/i686-pc-linux-gnu/4.1.0/../../../../i686-pc-linux-gnu/bin/ld: BFD 2.16.1 assertion fail /var/tmp/portage/binutils-2.16.1-r2/work/binutils-2.16.1/bfd/elflink.c:2357/usr/lib/gcc/i686-pc-linux-gnu/4.1.0/../../../../i686-pc-linux-gnu/bin/ld: BFD 2.16.1 assertion fail /var/tmp/portage/binutils-2.16.1-r2/work/binutils-2.16.1/bfd/elflink.c:2356/usr/lib/gcc/i686-pc-linux-gnu/4.1.0/../../../../i686-pc-linux-gnu/bin/ld: BFD 2.16.1 assertion fail /var/tmp/portage/binutils-2.16.1-r2/work/binutils-2.16.1/bfd/elflink.c:2357/usr/lib/gcc/i686-pc-linux-gnu/4.1.0/../../../../i686-pc-linux-gnu/bin/ld: BFD 2.16.1 assertion fail /var/tmp/portage/binutils-2.16.1-r2/work/binutils-2.16.1/bfd/elflink.c:2356/usr/lib/gcc/i686-pc-linux-gnu/4.1.0/../../../../i686-pc-linux-gnu/bin/ld: BFD 2.16.1 assertion fail /var/tmp/portage/binutils-2.16.1-r2/work/binutils-2.16.1/bfd/elflink.c:2357/usr/lib/gcc/i686-pc-linux-gnu/4.1.0/../../../../i686-pc-linux-gnu/bin/ld: BFD 2.16.1 assertion fail /var/tmp/portage/binutils-2.16.1-r2/work/binutils-2.16.1/bfd/elflink.c:2356/usr/lib/gcc/i686-pc-linux-gnu/4.1.0/../../../../i686-pc-linux-gnu/bin/ld: BFD 2.16.1 assertion fail /var/tmp/portage/binutils-2.16.1-r2/work/binutils-2.16.1/bfd/elflink.c:2357/usr/lib/gcc/i686-pc-linux-gnu/4.1.0/../../../../i686-pc-linux-gnu/bin/ld: BFD 2.16.1 assertion fail /var/tmp/portage/binutils-2.16.1-r2/work/binutils-2.16.1/bfd/elflink.c:2356/usr/lib/gcc/i686-pc-linux-gnu/4.1.0/../../../../i686-pc-linux-gnu/bin/ld: BFD 2.16.1 assertion fail /var/tmp/portage/binutils-2.16.1-r2/work/binutils-2.16.1/bfd/elflink.c:2357/usr/lib/gcc/i686-pc-linux-gnu/4.1.0/../../../../i686-pc-linux-gnu/bin/ld: BFD 2.16.1 assertion fail /var/tmp/portage/binutils-2.16.1-r2/work/binutils-2.16.1/bfd/elflink.c:2356/usr/lib/gcc/i686-pc-linux-gnu/4.1.0/../../../../i686-pc-linux-gnu/bin/ld: BFD 2.16.1 assertion fail /var/tmp/portage/binutils-2.16.1-r2/work/binutils-2.16.1/bfd/elflink.c:2357/usr/lib/gcc/i686-pc-linux-gnu/4.1.0/../../../../i686-pc-linux-gnu/bin/ld: BFD 2.16.1 assertion fail /var/tmp/portage/binutils-2.16.1-r2/work/binutils-2.16.1/bfd/elflink.c:2356/usr/lib/gcc/i686-pc-linux-gnu/4.1.0/../../../../i686-pc-linux-gnu/bin/ld: BFD 2.16.1 assertion fail /var/tmp/portage/binutils-2.16.1-r2/work/binutils-2.16.1/bfd/elflink.c:2357/usr/lib/gcc/i686-pc-linux-gnu/4.1.0/../../../../i686-pc-linux-gnu/bin/ld: BFD 2.16.1 assertion fail /var/tmp/portage/binutils-2.16.1-r2/work/binutils-2.16.1/bfd/elflink.c:2356/usr/lib/gcc/i686-pc-linux-gnu/4.1.0/../../../../i686-pc-linux-gnu/bin/ld: BFD 2.16.1 assertion fail /var/tmp/portage/binutils-2.16.1-r2/work/binutils-2.16.1/bfd/elflink.c:2357/usr/lib/gcc/i686-pc-linux-gnu/4.1.0/../../../../i686-pc-linux-gnu/bin/ld: BFD 2.16.1 assertion fail /var/tmp/portage/binutils-2.16.1-r2/work/binutils-2.16.1/bfd/elflink.c:2356/usr/lib/gcc/i686-pc-linux-gnu/4.1.0/../../../../i686-pc-linux-gnu/bin/ld: BFD 2.16.1 assertion fail /var/tmp/portage/binutils-2.16.1-r2/work/binutils-2.16.1/bfd/elflink.c:2357/usr/lib/gcc/i686-pc-linux-gnu/4.1.0/../../../../i686-pc-linux-gnu/bin/ld: BFD 2.16.1 assertion fail /var/tmp/portage/binutils-2.16.1-r2/work/binutils-2.16.1/bfd/elflink.c:2356/usr/lib/gcc/i686-pc-linux-gnu/4.1.0/../../../../i686-pc-linux-gnu/bin/ld: BFD 2.16.1 assertion fail /var/tmp/portage/binutils-2.16.1-r2/work/binutils-2.16.1/bfd/elflink.c:2357/usr/lib/gcc/i686-pc-linux-gnu/4.1.0/../../../../i686-pc-linux-gnu/bin/ld: BFD 2.16.1 assertion fail /var/tmp/portage/binutils-2.16.1-r2/work/binutils-2.16.1/bfd/elflink.c:2356/usr/lib/gcc/i686-pc-linux-gnu/4.1.0/../../../../i686-pc-linux-gnu/bin/ld: BFD 2.16.1 assertion fail /var/tmp/portage/binutils-2.16.1-r2/work/binutils-2.16.1/bfd/elflink.c:2357/usr/lib/gcc/i686-pc-linux-gnu/4.1.0/../../../../i686-pc-linux-gnu/bin/ld: BFD 2.16.1 assertion fail /var/tmp/portage/binutils-2.16.1-r2/work/binutils-2.16.1/bfd/elflink.c:2356/usr/lib/gcc/i686-pc-linux-gnu/4.1.0/../../../../i686-pc-linux-gnu/bin/ld: BFD 2.16.1 assertion fail /var/tmp/portage/binutils-2.16.1-r2/work/binutils-2.16.1/bfd/elflink.c:2357/usr/lib/gcc/i686-pc-linux-gnu/4.1.0/../../../../i686-pc-linux-gnu/bin/ld: BFD 2.16.1 assertion fail /var/tmp/portage/binutils-2.16.1-r2/work/binutils-2.16.1/bfd/elflink.c:2356/usr/lib/gcc/i686-pc-linux-gnu/4.1.0/../../../../i686-pc-linux-gnu/bin/ld: BFD 2.16.1 assertion fail /var/tmp/portage/binutils-2.16.1-r2/work/binutils-2.16.1/bfd/elflink.c:2357/usr/lib/gcc/i686-pc-linux-gnu/4.1.0/../../../../i686-pc-linux-gnu/bin/ld: BFD 2.16.1 internal error, aborting at /var/tmp/portage/binutils-2.16.1-r2/work/binutils-2.16.1/bfd/elflink.c line 6536 in elf_link_output_extsym/usr/lib/gcc/i686-pc-linux-gnu/4.1.0/../../../../i686-pc-linux-gnu/bin/ld: Please report this bug.collect2: ld returned 1 exit statusconfigure:5589: $? = 1configure: failed program was:| /* confdefs.h.  */| | #define PACKAGE_NAME ""| #define PACKAGE_TARNAME ""| #define PACKAGE_VERSION ""| #define PACKAGE_STRING ""| #define PACKAGE_BUGREPORT ""| #ifdef __cplusplus| extern "C" void std::exit (int) throw (); using std::exit;| #endif| #define _GNU_SOURCE 1| #define RESFALLBACK "Rxvt"| #define RESNAME "urxvt"| #define RESCLASS "URxvt"| #define RXVTNAME "urxvt"| /* end confdefs.h.  */| | /* Override any gcc2 internal prototype to avoid an error.  */| #ifdef __cplusplus| extern "C"| #endif| /* We use char because int might match the return type of a gcc2|    builtin and then its argument prototype would still apply.  */| char gethostbyname ();| int| main ()| {| gethostbyname ();|   ;|   return 0;| }configure:5614: result: noconfigure:5630: checking for connectconfigure:5687: i686-pc-linux-gnu-g++ -o conftest -march=pentium2 -O2 -fomit-frame-pointer -pipe  -Wl,--as-needed conftest.cc  -lsupc++ >&5/usr/lib/gcc/i686-pc-linux-gnu/4.1.0/../../../../i686-pc-linux-gnu/bin/ld: BFD 2.16.1 assertion fail /var/tmp/portage/binutils-2.16.1-r2/work/binutils-2.16.1/bfd/elflink.c:2356/usr/lib/gcc/i686-pc-linux-gnu/4.1.0/../../../../i686-pc-linux-gnu/bin/ld: BFD 2.16.1 assertion fail /var/tmp/portage/binutils-2.16.1-r2/work/binutils-2.16.1/bfd/elflink.c:2357/usr/lib/gcc/i686-pc-linux-gnu/4.1.0/../../../../i686-pc-linux-gnu/bin/ld: BFD 2.16.1 assertion fail /var/tmp/portage/binutils-2.16.1-r2/work/binutils-2.16.1/bfd/elflink.c:2356/usr/lib/gcc/i686-pc-linux-gnu/4.1.0/../../../../i686-pc-linux-gnu/bin/ld: BFD 2.16.1 assertion fail /var/tmp/portage/binutils-2.16.1-r2/work/binutils-2.16.1/bfd/elflink.c:2357/usr/lib/gcc/i686-pc-linux-gnu/4.1.0/../../../../i686-pc-linux-gnu/bin/ld: BFD 2.16.1 assertion fail /var/tmp/portage/binutils-2.16.1-r2/work/binutils-2.16.1/bfd/elflink.c:2356/usr/lib/gcc/i686-pc-linux-gnu/4.1.0/../../../../i686-pc-linux-gnu/bin/ld: BFD 2.16.1 assertion fail /var/tmp/portage/binutils-2.16.1-r2/work/binutils-2.16.1/bfd/elflink.c:2357/usr/lib/gcc/i686-pc-linux-gnu/4.1.0/../../../../i686-pc-linux-gnu/bin/ld: BFD 2.16.1 assertion fail /var/tmp/portage/binutils-2.16.1-r2/work/binutils-2.16.1/bfd/elflink.c:2356/usr/lib/gcc/i686-pc-linux-gnu/4.1.0/../../../../i686-pc-linux-gnu/bin/ld: BFD 2.16.1 assertion fail /var/tmp/portage/binutils-2.16.1-r2/work/binutils-2.16.1/bfd/elflink.c:2357/usr/lib/gcc/i686-pc-linux-gnu/4.1.0/../../../../i686-pc-linux-gnu/bin/ld: BFD 2.16.1 assertion fail /var/tmp/portage/binutils-2.16.1-r2/work/binutils-2.16.1/bfd/elflink.c:2356/usr/lib/gcc/i686-pc-linux-gnu/4.1.0/../../../../i686-pc-linux-gnu/bin/ld: BFD 2.16.1 assertion fail /var/tmp/portage/binutils-2.16.1-r2/work/binutils-2.16.1/bfd/elflink.c:2357/usr/lib/gcc/i686-pc-linux-gnu/4.1.0/../../../../i686-pc-linux-gnu/bin/ld: BFD 2.16.1 assertion fail /var/tmp/portage/binutils-2.16.1-r2/work/binutils-2.16.1/bfd/elflink.c:2356/usr/lib/gcc/i686-pc-linux-gnu/4.1.0/../../../../i686-pc-linux-gnu/bin/ld: BFD 2.16.1 assertion fail /var/tmp/portage/binutils-2.16.1-r2/work/binutils-2.16.1/bfd/elflink.c:2357/usr/lib/gcc/i686-pc-linux-gnu/4.1.0/../../../../i686-pc-linux-gnu/bin/ld: BFD 2.16.1 assertion fail /var/tmp/portage/binutils-2.16.1-r2/work/binutils-2.16.1/bfd/elflink.c:2356/usr/lib/gcc/i686-pc-linux-gnu/4.1.0/../../../../i686-pc-linux-gnu/bin/ld: BFD 2.16.1 assertion fail /var/tmp/portage/binutils-2.16.1-r2/work/binutils-2.16.1/bfd/elflink.c:2357/usr/lib/gcc/i686-pc-linux-gnu/4.1.0/../../../../i686-pc-linux-gnu/bin/ld: BFD 2.16.1 assertion fail /var/tmp/portage/binutils-2.16.1-r2/work/binutils-2.16.1/bfd/elflink.c:2356/usr/lib/gcc/i686-pc-linux-gnu/4.1.0/../../../../i686-pc-linux-gnu/bin/ld: BFD 2.16.1 assertion fail /var/tmp/portage/binutils-2.16.1-r2/work/binutils-2.16.1/bfd/elflink.c:2357/usr/lib/gcc/i686-pc-linux-gnu/4.1.0/../../../../i686-pc-linux-gnu/bin/ld: BFD 2.16.1 assertion fail /var/tmp/portage/binutils-2.16.1-r2/work/binutils-2.16.1/bfd/elflink.c:2356/usr/lib/gcc/i686-pc-linux-gnu/4.1.0/../../../../i686-pc-linux-gnu/bin/ld: BFD 2.16.1 assertion fail /var/tmp/portage/binutils-2.16.1-r2/work/binutils-2.16.1/bfd/elflink.c:2357/usr/lib/gcc/i686-pc-linux-gnu/4.1.0/../../../../i686-pc-linux-gnu/bin/ld: BFD 2.16.1 assertion fail /var/tmp/portage/binutils-2.16.1-r2/work/binutils-2.16.1/bfd/elflink.c:2356/usr/lib/gcc/i686-pc-linux-gnu/4.1.0/../../../../i686-pc-linux-gnu/bin/ld: BFD 2.16.1 assertion fail /var/tmp/portage/binutils-2.16.1-r2/work/binutils-2.16.1/bfd/elflink.c:2357/usr/lib/gcc/i686-pc-linux-gnu/4.1.0/../../../../i686-pc-linux-gnu/bin/ld: BFD 2.16.1 assertion fail /var/tmp/portage/binutils-2.16.1-r2/work/binutils-2.16.1/bfd/elflink.c:2356/usr/lib/gcc/i686-pc-linux-gnu/4.1.0/../../../../i686-pc-linux-gnu/bin/ld: BFD 2.16.1 assertion fail /var/tmp/portage/binutils-2.16.1-r2/work/binutils-2.16.1/bfd/elflink.c:2357/usr/lib/gcc/i686-pc-linux-gnu/4.1.0/../../../../i686-pc-linux-gnu/bin/ld: BFD 2.16.1 assertion fail /var/tmp/portage/binutils-2.16.1-r2/work/binutils-2.16.1/bfd/elflink.c:2356/usr/lib/gcc/i686-pc-linux-gnu/4.1.0/../../../../i686-pc-linux-gnu/bin/ld: BFD 2.16.1 assertion fail /var/tmp/portage/binutils-2.16.1-r2/work/binutils-2.16.1/bfd/elflink.c:2357/usr/lib/gcc/i686-pc-linux-gnu/4.1.0/../../../../i686-pc-linux-gnu/bin/ld: BFD 2.16.1 assertion fail /var/tmp/portage/binutils-2.16.1-r2/work/binutils-2.16.1/bfd/elflink.c:2356/usr/lib/gcc/i686-pc-linux-gnu/4.1.0/../../../../i686-pc-linux-gnu/bin/ld: BFD 2.16.1 assertion fail /var/tmp/portage/binutils-2.16.1-r2/work/binutils-2.16.1/bfd/elflink.c:2357/usr/lib/gcc/i686-pc-linux-gnu/4.1.0/../../../../i686-pc-linux-gnu/bin/ld: BFD 2.16.1 assertion fail /var/tmp/portage/binutils-2.16.1-r2/work/binutils-2.16.1/bfd/elflink.c:2356/usr/lib/gcc/i686-pc-linux-gnu/4.1.0/../../../../i686-pc-linux-gnu/bin/ld: BFD 2.16.1 assertion fail /var/tmp/portage/binutils-2.16.1-r2/work/binutils-2.16.1/bfd/elflink.c:2357/usr/lib/gcc/i686-pc-linux-gnu/4.1.0/../../../../i686-pc-linux-gnu/bin/ld: BFD 2.16.1 assertion fail /var/tmp/portage/binutils-2.16.1-r2/work/binutils-2.16.1/bfd/elflink.c:2356/usr/lib/gcc/i686-pc-linux-gnu/4.1.0/../../../../i686-pc-linux-gnu/bin/ld: BFD 2.16.1 assertion fail /var/tmp/portage/binutils-2.16.1-r2/work/binutils-2.16.1/bfd/elflink.c:2357/usr/lib/gcc/i686-pc-linux-gnu/4.1.0/../../../../i686-pc-linux-gnu/bin/ld: BFD 2.16.1 assertion fail /var/tmp/portage/binutils-2.16.1-r2/work/binutils-2.16.1/bfd/elflink.c:2356/usr/lib/gcc/i686-pc-linux-gnu/4.1.0/../../../../i686-pc-linux-gnu/bin/ld: BFD 2.16.1 assertion fail /var/tmp/portage/binutils-2.16.1-r2/work/binutils-2.16.1/bfd/elflink.c:2357/usr/lib/gcc/i686-pc-linux-gnu/4.1.0/../../../../i686-pc-linux-gnu/bin/ld: BFD 2.16.1 assertion fail /var/tmp/portage/binutils-2.16.1-r2/work/binutils-2.16.1/bfd/elflink.c:2356/usr/lib/gcc/i686-pc-linux-gnu/4.1.0/../../../../i686-pc-linux-gnu/bin/ld: BFD 2.16.1 assertion fail /var/tmp/portage/binutils-2.16.1-r2/work/binutils-2.16.1/bfd/elflink.c:2357/usr/lib/gcc/i686-pc-linux-gnu/4.1.0/../../../../i686-pc-linux-gnu/bin/ld: BFD 2.16.1 assertion fail /var/tmp/portage/binutils-2.16.1-r2/work/binutils-2.16.1/bfd/elflink.c:2356/usr/lib/gcc/i686-pc-linux-gnu/4.1.0/../../../../i686-pc-linux-gnu/bin/ld: BFD 2.16.1 assertion fail /var/tmp/portage/binutils-2.16.1-r2/work/binutils-2.16.1/bfd/elflink.c:2357/usr/lib/gcc/i686-pc-linux-gnu/4.1.0/../../../../i686-pc-linux-gnu/bin/ld: BFD 2.16.1 assertion fail /var/tmp/portage/binutils-2.16.1-r2/work/binutils-2.16.1/bfd/elflink.c:2356/usr/lib/gcc/i686-pc-linux-gnu/4.1.0/../../../../i686-pc-linux-gnu/bin/ld: BFD 2.16.1 assertion fail /var/tmp/portage/binutils-2.16.1-r2/work/binutils-2.16.1/bfd/elflink.c:2357/usr/lib/gcc/i686-pc-linux-gnu/4.1.0/../../../../i686-pc-linux-gnu/bin/ld: BFD 2.16.1 assertion fail /var/tmp/portage/binutils-2.16.1-r2/work/binutils-2.16.1/bfd/elflink.c:2356/usr/lib/gcc/i686-pc-linux-gnu/4.1.0/../../../../i686-pc-linux-gnu/bin/ld: BFD 2.16.1 assertion fail /var/tmp/portage/binutils-2.16.1-r2/work/binutils-2.16.1/bfd/elflink.c:2357/usr/lib/gcc/i686-pc-linux-gnu/4.1.0/../../../../i686-pc-linux-gnu/bin/ld: BFD 2.16.1 assertion fail /var/tmp/portage/binutils-2.16.1-r2/work/binutils-2.16.1/bfd/elflink.c:2356/usr/lib/gcc/i686-pc-linux-gnu/4.1.0/../../../../i686-pc-linux-gnu/bin/ld: BFD 2.16.1 assertion fail /var/tmp/portage/binutils-2.16.1-r2/work/binutils-2.16.1/bfd/elflink.c:2357/usr/lib/gcc/i686-pc-linux-gnu/4.1.0/../../../../i686-pc-linux-gnu/bin/ld: BFD 2.16.1 assertion fail /var/tmp/portage/binutils-2.16.1-r2/work/binutils-2.16.1/bfd/elflink.c:2356/usr/lib/gcc/i686-pc-linux-gnu/4.1.0/../../../../i686-pc-linux-gnu/bin/ld: BFD 2.16.1 assertion fail /var/tmp/portage/binutils-2.16.1-r2/work/binutils-2.16.1/bfd/elflink.c:2357/usr/lib/gcc/i686-pc-linux-gnu/4.1.0/../../../../i686-pc-linux-gnu/bin/ld: BFD 2.16.1 assertion fail /var/tmp/portage/binutils-2.16.1-r2/work/binutils-2.16.1/bfd/elflink.c:2356/usr/lib/gcc/i686-pc-linux-gnu/4.1.0/../../../../i686-pc-linux-gnu/bin/ld: BFD 2.16.1 assertion fail /var/tmp/portage/binutils-2.16.1-r2/work/binutils-2.16.1/bfd/elflink.c:2357/usr/lib/gcc/i686-pc-linux-gnu/4.1.0/../../../../i686-pc-linux-gnu/bin/ld: BFD 2.16.1 assertion fail /var/tmp/portage/binutils-2.16.1-r2/work/binutils-2.16.1/bfd/elflink.c:2356/usr/lib/gcc/i686-pc-linux-gnu/4.1.0/../../../../i686-pc-linux-gnu/bin/ld: BFD 2.16.1 assertion fail /var/tmp/portage/binutils-2.16.1-r2/work/binutils-2.16.1/bfd/elflink.c:2357/usr/lib/gcc/i686-pc-linux-gnu/4.1.0/../../../../i686-pc-linux-gnu/bin/ld: BFD 2.16.1 internal error, aborting at /var/tmp/portage/binutils-2.16.1-r2/work/binutils-2.16.1/bfd/elflink.c line 6536 in elf_link_output_extsym/usr/lib/gcc/i686-pc-linux-gnu/4.1.0/../../../../i686-pc-linux-gnu/bin/ld: Please report this bug.collect2: ld returned 1 exit statusconfigure:5693: $? = 1configure: failed program was:| /* confdefs.h.  */| | #define PACKAGE_NAME ""| #define PACKAGE_TARNAME ""| #define PACKAGE_VERSION ""| #define PACKAGE_STRING ""| #define PACKAGE_BUGREPORT ""| #ifdef __cplusplus| extern "C" void std::exit (int) throw (); using std::exit;| #endif| #define _GNU_SOURCE 1| #define RESFALLBACK "Rxvt"| #define RESNAME "urxvt"| #define RESCLASS "URxvt"| #define RXVTNAME "urxvt"| /* end confdefs.h.  */| /* Define connect to an innocuous variant, in case <limits.h> declares connect.|    For example, HP-UX 11i <limits.h> declares gettimeofday.  */| #define connect innocuous_connect| | /* System header to define __stub macros and hopefully few prototypes,|     which can conflict with char connect (); below.|     Prefer <limits.h> to <assert.h> if __STDC__ is defined, since|     <limits.h> exists even on freestanding compilers.  */| | #ifdef __STDC__| # include <limits.h>| #else| # include <assert.h>| #endif| | #undef connect| | /* Override any gcc2 internal prototype to avoid an error.  */| #ifdef __cplusplus| extern "C"| {| #endif| /* We use char because int might match the return type of a gcc2|    builtin and then its argument prototype would still apply.  */| char connect ();| /* The GNU C library defines this for functions which it implements|     to always fail with ENOSYS.  Some functions are actually named|     something starting with __ and the normal name is an alias.  */| #if defined (__stub_connect) || defined (__stub___connect)| choke me| #else| char (*f) () = connect;| #endif| #ifdef __cplusplus| }| #endif| | int| main ()| {| return f != connect;|   ;|   return 0;| }configure:5717: result: noconfigure:5721: checking for connect in -lsocketconfigure:5751: i686-pc-linux-gnu-g++ -o conftest -march=pentium2 -O2 -fomit-frame-pointer -pipe  -Wl,--as-needed conftest.cc -lsocket   -lsupc++ >&5/usr/lib/gcc/i686-pc-linux-gnu/4.1.0/../../../../i686-pc-linux-gnu/bin/ld: cannot find -lsocketcollect2: ld returned 1 exit statusconfigure:5757: $? = 1configure: failed program was:| /* confdefs.h.  */| | #define PACKAGE_NAME ""| #define PACKAGE_TARNAME ""| #define PACKAGE_VERSION ""| #define PACKAGE_STRING ""| #define PACKAGE_BUGREPORT ""| #ifdef __cplusplus| extern "C" void std::exit (int) throw (); using std::exit;| #endif| #define _GNU_SOURCE 1| #define RESFALLBACK "Rxvt"| #define RESNAME "urxvt"| #define RESCLASS "URxvt"| #define RXVTNAME "urxvt"| /* end confdefs.h.  */| | /* Override any gcc2 internal prototype to avoid an error.  */| #ifdef __cplusplus| extern "C"| #endif| /* We use char because int might match the return type of a gcc2|    builtin and then its argument prototype would still apply.  */| char connect ();| int| main ()| {| connect ();|   ;|   return 0;| }configure:5782: result: noconfigure:5791: checking for removeconfigure:5848: i686-pc-linux-gnu-g++ -o conftest -march=pentium2 -O2 -fomit-frame-pointer -pipe  -Wl,--as-needed conftest.cc  -lsupc++ >&5/usr/lib/gcc/i686-pc-linux-gnu/4.1.0/../../../../i686-pc-linux-gnu/bin/ld: BFD 2.16.1 assertion fail /var/tmp/portage/binutils-2.16.1-r2/work/binutils-2.16.1/bfd/elflink.c:2356/usr/lib/gcc/i686-pc-linux-gnu/4.1.0/../../../../i686-pc-linux-gnu/bin/ld: BFD 2.16.1 assertion fail /var/tmp/portage/binutils-2.16.1-r2/work/binutils-2.16.1/bfd/elflink.c:2357/usr/lib/gcc/i686-pc-linux-gnu/4.1.0/../../../../i686-pc-linux-gnu/bin/ld: BFD 2.16.1 assertion fail /var/tmp/portage/binutils-2.16.1-r2/work/binutils-2.16.1/bfd/elflink.c:2356/usr/lib/gcc/i686-pc-linux-gnu/4.1.0/../../../../i686-pc-linux-gnu/bin/ld: BFD 2.16.1 assertion fail /var/tmp/portage/binutils-2.16.1-r2/work/binutils-2.16.1/bfd/elflink.c:2357/usr/lib/gcc/i686-pc-linux-gnu/4.1.0/../../../../i686-pc-linux-gnu/bin/ld: BFD 2.16.1 assertion fail /var/tmp/portage/binutils-2.16.1-r2/work/binutils-2.16.1/bfd/elflink.c:2356/usr/lib/gcc/i686-pc-linux-gnu/4.1.0/../../../../i686-pc-linux-gnu/bin/ld: BFD 2.16.1 assertion fail /var/tmp/portage/binutils-2.16.1-r2/work/binutils-2.16.1/bfd/elflink.c:2357/usr/lib/gcc/i686-pc-linux-gnu/4.1.0/../../../../i686-pc-linux-gnu/bin/ld: BFD 2.16.1 assertion fail /var/tmp/portage/binutils-2.16.1-r2/work/binutils-2.16.1/bfd/elflink.c:2356/usr/lib/gcc/i686-pc-linux-gnu/4.1.0/../../../../i686-pc-linux-gnu/bin/ld: BFD 2.16.1 assertion fail /var/tmp/portage/binutils-2.16.1-r2/work/binutils-2.16.1/bfd/elflink.c:2357/usr/lib/gcc/i686-pc-linux-gnu/4.1.0/../../../../i686-pc-linux-gnu/bin/ld: BFD 2.16.1 assertion fail /var/tmp/portage/binutils-2.16.1-r2/work/binutils-2.16.1/bfd/elflink.c:2356/usr/lib/gcc/i686-pc-linux-gnu/4.1.0/../../../../i686-pc-linux-gnu/bin/ld: BFD 2.16.1 assertion fail /var/tmp/portage/binutils-2.16.1-r2/work/binutils-2.16.1/bfd/elflink.c:2357/usr/lib/gcc/i686-pc-linux-gnu/4.1.0/../../../../i686-pc-linux-gnu/bin/ld: BFD 2.16.1 assertion fail /var/tmp/portage/binutils-2.16.1-r2/work/binutils-2.16.1/bfd/elflink.c:2356/usr/lib/gcc/i686-pc-linux-gnu/4.1.0/../../../../i686-pc-linux-gnu/bin/ld: BFD 2.16.1 assertion fail /var/tmp/portage/binutils-2.16.1-r2/work/binutils-2.16.1/bfd/elflink.c:2357/usr/lib/gcc/i686-pc-linux-gnu/4.1.0/../../../../i686-pc-linux-gnu/bin/ld: BFD 2.16.1 assertion fail /var/tmp/portage/binutils-2.16.1-r2/work/binutils-2.16.1/bfd/elflink.c:2356/usr/lib/gcc/i686-pc-linux-gnu/4.1.0/../../../../i686-pc-linux-gnu/bin/ld: BFD 2.16.1 assertion fail /var/tmp/portage/binutils-2.16.1-r2/work/binutils-2.16.1/bfd/elflink.c:2357/usr/lib/gcc/i686-pc-linux-gnu/4.1.0/../../../../i686-pc-linux-gnu/bin/ld: BFD 2.16.1 assertion fail /var/tmp/portage/binutils-2.16.1-r2/work/binutils-2.16.1/bfd/elflink.c:2356/usr/lib/gcc/i686-pc-linux-gnu/4.1.0/../../../../i686-pc-linux-gnu/bin/ld: BFD 2.16.1 assertion fail /var/tmp/portage/binutils-2.16.1-r2/work/binutils-2.16.1/bfd/elflink.c:2357/usr/lib/gcc/i686-pc-linux-gnu/4.1.0/../../../../i686-pc-linux-gnu/bin/ld: BFD 2.16.1 assertion fail /var/tmp/portage/binutils-2.16.1-r2/work/binutils-2.16.1/bfd/elflink.c:2356/usr/lib/gcc/i686-pc-linux-gnu/4.1.0/../../../../i686-pc-linux-gnu/bin/ld: BFD 2.16.1 assertion fail /var/tmp/portage/binutils-2.16.1-r2/work/binutils-2.16.1/bfd/elflink.c:2357/usr/lib/gcc/i686-pc-linux-gnu/4.1.0/../../../../i686-pc-linux-gnu/bin/ld: BFD 2.16.1 assertion fail /var/tmp/portage/binutils-2.16.1-r2/work/binutils-2.16.1/bfd/elflink.c:2356/usr/lib/gcc/i686-pc-linux-gnu/4.1.0/../../../../i686-pc-linux-gnu/bin/ld: BFD 2.16.1 assertion fail /var/tmp/portage/binutils-2.16.1-r2/work/binutils-2.16.1/bfd/elflink.c:2357/usr/lib/gcc/i686-pc-linux-gnu/4.1.0/../../../../i686-pc-linux-gnu/bin/ld: BFD 2.16.1 assertion fail /var/tmp/portage/binutils-2.16.1-r2/work/binutils-2.16.1/bfd/elflink.c:2356/usr/lib/gcc/i686-pc-linux-gnu/4.1.0/../../../../i686-pc-linux-gnu/bin/ld: BFD 2.16.1 assertion fail /var/tmp/portage/binutils-2.16.1-r2/work/binutils-2.16.1/bfd/elflink.c:2357/usr/lib/gcc/i686-pc-linux-gnu/4.1.0/../../../../i686-pc-linux-gnu/bin/ld: BFD 2.16.1 assertion fail /var/tmp/portage/binutils-2.16.1-r2/work/binutils-2.16.1/bfd/elflink.c:2356/usr/lib/gcc/i686-pc-linux-gnu/4.1.0/../../../../i686-pc-linux-gnu/bin/ld: BFD 2.16.1 assertion fail /var/tmp/portage/binutils-2.16.1-r2/work/binutils-2.16.1/bfd/elflink.c:2357/usr/lib/gcc/i686-pc-linux-gnu/4.1.0/../../../../i686-pc-linux-gnu/bin/ld: BFD 2.16.1 assertion fail /var/tmp/portage/binutils-2.16.1-r2/work/binutils-2.16.1/bfd/elflink.c:2356/usr/lib/gcc/i686-pc-linux-gnu/4.1.0/../../../../i686-pc-linux-gnu/bin/ld: BFD 2.16.1 assertion fail /var/tmp/portage/binutils-2.16.1-r2/work/binutils-2.16.1/bfd/elflink.c:2357/usr/lib/gcc/i686-pc-linux-gnu/4.1.0/../../../../i686-pc-linux-gnu/bin/ld: BFD 2.16.1 assertion fail /var/tmp/portage/binutils-2.16.1-r2/work/binutils-2.16.1/bfd/elflink.c:2356/usr/lib/gcc/i686-pc-linux-gnu/4.1.0/../../../../i686-pc-linux-gnu/bin/ld: BFD 2.16.1 assertion fail /var/tmp/portage/binutils-2.16.1-r2/work/binutils-2.16.1/bfd/elflink.c:2357/usr/lib/gcc/i686-pc-linux-gnu/4.1.0/../../../../i686-pc-linux-gnu/bin/ld: BFD 2.16.1 assertion fail /var/tmp/portage/binutils-2.16.1-r2/work/binutils-2.16.1/bfd/elflink.c:2356/usr/lib/gcc/i686-pc-linux-gnu/4.1.0/../../../../i686-pc-linux-gnu/bin/ld: BFD 2.16.1 assertion fail /var/tmp/portage/binutils-2.16.1-r2/work/binutils-2.16.1/bfd/elflink.c:2357/usr/lib/gcc/i686-pc-linux-gnu/4.1.0/../../../../i686-pc-linux-gnu/bin/ld: BFD 2.16.1 assertion fail /var/tmp/portage/binutils-2.16.1-r2/work/binutils-2.16.1/bfd/elflink.c:2356/usr/lib/gcc/i686-pc-linux-gnu/4.1.0/../../../../i686-pc-linux-gnu/bin/ld: BFD 2.16.1 assertion fail /var/tmp/portage/binutils-2.16.1-r2/work/binutils-2.16.1/bfd/elflink.c:2357/usr/lib/gcc/i686-pc-linux-gnu/4.1.0/../../../../i686-pc-linux-gnu/bin/ld: BFD 2.16.1 assertion fail /var/tmp/portage/binutils-2.16.1-r2/work/binutils-2.16.1/bfd/elflink.c:2356/usr/lib/gcc/i686-pc-linux-gnu/4.1.0/../../../../i686-pc-linux-gnu/bin/ld: BFD 2.16.1 assertion fail /var/tmp/portage/binutils-2.16.1-r2/work/binutils-2.16.1/bfd/elflink.c:2357/usr/lib/gcc/i686-pc-linux-gnu/4.1.0/../../../../i686-pc-linux-gnu/bin/ld: BFD 2.16.1 assertion fail /var/tmp/portage/binutils-2.16.1-r2/work/binutils-2.16.1/bfd/elflink.c:2356/usr/lib/gcc/i686-pc-linux-gnu/4.1.0/../../../../i686-pc-linux-gnu/bin/ld: BFD 2.16.1 assertion fail /var/tmp/portage/binutils-2.16.1-r2/work/binutils-2.16.1/bfd/elflink.c:2357/usr/lib/gcc/i686-pc-linux-gnu/4.1.0/../../../../i686-pc-linux-gnu/bin/ld: BFD 2.16.1 assertion fail /var/tmp/portage/binutils-2.16.1-r2/work/binutils-2.16.1/bfd/elflink.c:2356/usr/lib/gcc/i686-pc-linux-gnu/4.1.0/../../../../i686-pc-linux-gnu/bin/ld: BFD 2.16.1 assertion fail /var/tmp/portage/binutils-2.16.1-r2/work/binutils-2.16.1/bfd/elflink.c:2357/usr/lib/gcc/i686-pc-linux-gnu/4.1.0/../../../../i686-pc-linux-gnu/bin/ld: BFD 2.16.1 assertion fail /var/tmp/portage/binutils-2.16.1-r2/work/binutils-2.16.1/bfd/elflink.c:2356/usr/lib/gcc/i686-pc-linux-gnu/4.1.0/../../../../i686-pc-linux-gnu/bin/ld: BFD 2.16.1 assertion fail /var/tmp/portage/binutils-2.16.1-r2/work/binutils-2.16.1/bfd/elflink.c:2357/usr/lib/gcc/i686-pc-linux-gnu/4.1.0/../../../../i686-pc-linux-gnu/bin/ld: BFD 2.16.1 assertion fail /var/tmp/portage/binutils-2.16.1-r2/work/binutils-2.16.1/bfd/elflink.c:2356/usr/lib/gcc/i686-pc-linux-gnu/4.1.0/../../../../i686-pc-linux-gnu/bin/ld: BFD 2.16.1 assertion fail /var/tmp/portage/binutils-2.16.1-r2/work/binutils-2.16.1/bfd/elflink.c:2357/usr/lib/gcc/i686-pc-linux-gnu/4.1.0/../../../../i686-pc-linux-gnu/bin/ld: BFD 2.16.1 assertion fail /var/tmp/portage/binutils-2.16.1-r2/work/binutils-2.16.1/bfd/elflink.c:2356/usr/lib/gcc/i686-pc-linux-gnu/4.1.0/../../../../i686-pc-linux-gnu/bin/ld: BFD 2.16.1 assertion fail /var/tmp/portage/binutils-2.16.1-r2/work/binutils-2.16.1/bfd/elflink.c:2357/usr/lib/gcc/i686-pc-linux-gnu/4.1.0/../../../../i686-pc-linux-gnu/bin/ld: BFD 2.16.1 assertion fail /var/tmp/portage/binutils-2.16.1-r2/work/binutils-2.16.1/bfd/elflink.c:2356/usr/lib/gcc/i686-pc-linux-gnu/4.1.0/../../../../i686-pc-linux-gnu/bin/ld: BFD 2.16.1 assertion fail /var/tmp/portage/binutils-2.16.1-r2/work/binutils-2.16.1/bfd/elflink.c:2357/usr/lib/gcc/i686-pc-linux-gnu/4.1.0/../../../../i686-pc-linux-gnu/bin/ld: BFD 2.16.1 assertion fail /var/tmp/portage/binutils-2.16.1-r2/work/binutils-2.16.1/bfd/elflink.c:2356/usr/lib/gcc/i686-pc-linux-gnu/4.1.0/../../../../i686-pc-linux-gnu/bin/ld: BFD 2.16.1 assertion fail /var/tmp/portage/binutils-2.16.1-r2/work/binutils-2.16.1/bfd/elflink.c:2357/usr/lib/gcc/i686-pc-linux-gnu/4.1.0/../../../../i686-pc-linux-gnu/bin/ld: BFD 2.16.1 internal error, aborting at /var/tmp/portage/binutils-2.16.1-r2/work/binutils-2.16.1/bfd/elflink.c line 6536 in elf_link_output_extsym/usr/lib/gcc/i686-pc-linux-gnu/4.1.0/../../../../i686-pc-linux-gnu/bin/ld: Please report this bug.collect2: ld returned 1 exit statusconfigure:5854: $? = 1configure: failed program was:| /* confdefs.h.  */| | #define PACKAGE_NAME ""| #define PACKAGE_TARNAME ""| #define PACKAGE_VERSION ""| #define PACKAGE_STRING ""| #define PACKAGE_BUGREPORT ""| #ifdef __cplusplus| extern "C" void std::exit (int) throw (); using std::exit;| #endif| #define _GNU_SOURCE 1| #define RESFALLBACK "Rxvt"| #define RESNAME "urxvt"| #define RESCLASS "URxvt"| #define RXVTNAME "urxvt"| /* end confdefs.h.  */| /* Define remove to an innocuous variant, in case <limits.h> declares remove.|    For example, HP-UX 11i <limits.h> declares gettimeofday.  */| #define remove innocuous_remove| | /* System header to define __stub macros and hopefully few prototypes,|     which can conflict with char remove (); below.|     Prefer <limits.h> to <assert.h> if __STDC__ is defined, since|     <limits.h> exists even on freestanding compilers.  */| | #ifdef __STDC__| # include <limits.h>| #else| # include <assert.h>| #endif| | #undef remove| | /* Override any gcc2 internal prototype to avoid an error.  */| #ifdef __cplusplus| extern "C"| {| #endif| /* We use char because int might match the return type of a gcc2|    builtin and then its argument prototype would still apply.  */| char remove ();| /* The GNU C library defines this for functions which it implements|     to always fail with ENOSYS.  Some functions are actually named|     something starting with __ and the normal name is an alias.  */| #if defined (__stub_remove) || defined (__stub___remove)| choke me| #else| char (*f) () = remove;| #endif| #ifdef __cplusplus| }| #endif| | int| main ()| {| return f != remove;|   ;|   return 0;| }configure:5878: result: noconfigure:5882: checking for remove in -lposixconfigure:5912: i686-pc-linux-gnu-g++ -o conftest -march=pentium2 -O2 -fomit-frame-pointer -pipe  -Wl,--as-needed conftest.cc -lposix   -lsupc++ >&5/usr/lib/gcc/i686-pc-linux-gnu/4.1.0/../../../../i686-pc-linux-gnu/bin/ld: cannot find -lposixcollect2: ld returned 1 exit statusconfigure:5918: $? = 1configure: failed program was:| /* confdefs.h.  */| | #define PACKAGE_NAME ""| #define PACKAGE_TARNAME ""| #define PACKAGE_VERSION ""| #define PACKAGE_STRING ""| #define PACKAGE_BUGREPORT ""| #ifdef __cplusplus| extern "C" void std::exit (int) throw (); using std::exit;| #endif| #define _GNU_SOURCE 1| #define RESFALLBACK "Rxvt"| #define RESNAME "urxvt"| #define RESCLASS "URxvt"| #define RXVTNAME "urxvt"| /* end confdefs.h.  */| | /* Override any gcc2 internal prototype to avoid an error.  */| #ifdef __cplusplus| extern "C"| #endif| /* We use char because int might match the return type of a gcc2|    builtin and then its argument prototype would still apply.  */| char remove ();| int| main ()| {| remove ();|   ;|   return 0;| }configure:5943: result: noconfigure:5952: checking for shmatconfigure:6009: i686-pc-linux-gnu-g++ -o conftest -march=pentium2 -O2 -fomit-frame-pointer -pipe  -Wl,--as-needed conftest.cc  -lsupc++ >&5/usr/lib/gcc/i686-pc-linux-gnu/4.1.0/../../../../i686-pc-linux-gnu/bin/ld: BFD 2.16.1 assertion fail /var/tmp/portage/binutils-2.16.1-r2/work/binutils-2.16.1/bfd/elflink.c:2356/usr/lib/gcc/i686-pc-linux-gnu/4.1.0/../../../../i686-pc-linux-gnu/bin/ld: BFD 2.16.1 assertion fail /var/tmp/portage/binutils-2.16.1-r2/work/binutils-2.16.1/bfd/elflink.c:2357/usr/lib/gcc/i686-pc-linux-gnu/4.1.0/../../../../i686-pc-linux-gnu/bin/ld: BFD 2.16.1 assertion fail /var/tmp/portage/binutils-2.16.1-r2/work/binutils-2.16.1/bfd/elflink.c:2356/usr/lib/gcc/i686-pc-linux-gnu/4.1.0/../../../../i686-pc-linux-gnu/bin/ld: BFD 2.16.1 assertion fail /var/tmp/portage/binutils-2.16.1-r2/work/binutils-2.16.1/bfd/elflink.c:2357/usr/lib/gcc/i686-pc-linux-gnu/4.1.0/../../../../i686-pc-linux-gnu/bin/ld: BFD 2.16.1 assertion fail /var/tmp/portage/binutils-2.16.1-r2/work/binutils-2.16.1/bfd/elflink.c:2356/usr/lib/gcc/i686-pc-linux-gnu/4.1.0/../../../../i686-pc-linux-gnu/bin/ld: BFD 2.16.1 assertion fail /var/tmp/portage/binutils-2.16.1-r2/work/binutils-2.16.1/bfd/elflink.c:2357/usr/lib/gcc/i686-pc-linux-gnu/4.1.0/../../../../i686-pc-linux-gnu/bin/ld: BFD 2.16.1 assertion fail /var/tmp/portage/binutils-2.16.1-r2/work/binutils-2.16.1/bfd/elflink.c:2356/usr/lib/gcc/i686-pc-linux-gnu/4.1.0/../../../../i686-pc-linux-gnu/bin/ld: BFD 2.16.1 assertion fail /var/tmp/portage/binutils-2.16.1-r2/work/binutils-2.16.1/bfd/elflink.c:2357/usr/lib/gcc/i686-pc-linux-gnu/4.1.0/../../../../i686-pc-linux-gnu/bin/ld: BFD 2.16.1 assertion fail /var/tmp/portage/binutils-2.16.1-r2/work/binutils-2.16.1/bfd/elflink.c:2356/usr/lib/gcc/i686-pc-linux-gnu/4.1.0/../../../../i686-pc-linux-gnu/bin/ld: BFD 2.16.1 assertion fail /var/tmp/portage/binutils-2.16.1-r2/work/binutils-2.16.1/bfd/elflink.c:2357/usr/lib/gcc/i686-pc-linux-gnu/4.1.0/../../../../i686-pc-linux-gnu/bin/ld: BFD 2.16.1 assertion fail /var/tmp/portage/binutils-2.16.1-r2/work/binutils-2.16.1/bfd/elflink.c:2356/usr/lib/gcc/i686-pc-linux-gnu/4.1.0/../../../../i686-pc-linux-gnu/bin/ld: BFD 2.16.1 assertion fail /var/tmp/portage/binutils-2.16.1-r2/work/binutils-2.16.1/bfd/elflink.c:2357/usr/lib/gcc/i686-pc-linux-gnu/4.1.0/../../../../i686-pc-linux-gnu/bin/ld: BFD 2.16.1 assertion fail /var/tmp/portage/binutils-2.16.1-r2/work/binutils-2.16.1/bfd/elflink.c:2356/usr/lib/gcc/i686-pc-linux-gnu/4.1.0/../../../../i686-pc-linux-gnu/bin/ld: BFD 2.16.1 assertion fail /var/tmp/portage/binutils-2.16.1-r2/work/binutils-2.16.1/bfd/elflink.c:2357/usr/lib/gcc/i686-pc-linux-gnu/4.1.0/../../../../i686-pc-linux-gnu/bin/ld: BFD 2.16.1 assertion fail /var/tmp/portage/binutils-2.16.1-r2/work/binutils-2.16.1/bfd/elflink.c:2356/usr/lib/gcc/i686-pc-linux-gnu/4.1.0/../../../../i686-pc-linux-gnu/bin/ld: BFD 2.16.1 assertion fail /var/tmp/portage/binutils-2.16.1-r2/work/binutils-2.16.1/bfd/elflink.c:2357/usr/lib/gcc/i686-pc-linux-gnu/4.1.0/../../../../i686-pc-linux-gnu/bin/ld: BFD 2.16.1 assertion fail /var/tmp/portage/binutils-2.16.1-r2/work/binutils-2.16.1/bfd/elflink.c:2356/usr/lib/gcc/i686-pc-linux-gnu/4.1.0/../../../../i686-pc-linux-gnu/bin/ld: BFD 2.16.1 assertion fail /var/tmp/portage/binutils-2.16.1-r2/work/binutils-2.16.1/bfd/elflink.c:2357/usr/lib/gcc/i686-pc-linux-gnu/4.1.0/../../../../i686-pc-linux-gnu/bin/ld: BFD 2.16.1 assertion fail /var/tmp/portage/binutils-2.16.1-r2/work/binutils-2.16.1/bfd/elflink.c:2356/usr/lib/gcc/i686-pc-linux-gnu/4.1.0/../../../../i686-pc-linux-gnu/bin/ld: BFD 2.16.1 assertion fail /var/tmp/portage/binutils-2.16.1-r2/work/binutils-2.16.1/bfd/elflink.c:2357/usr/lib/gcc/i686-pc-linux-gnu/4.1.0/../../../../i686-pc-linux-gnu/bin/ld: BFD 2.16.1 assertion fail /var/tmp/portage/binutils-2.16.1-r2/work/binutils-2.16.1/bfd/elflink.c:2356/usr/lib/gcc/i686-pc-linux-gnu/4.1.0/../../../../i686-pc-linux-gnu/bin/ld: BFD 2.16.1 assertion fail /var/tmp/portage/binutils-2.16.1-r2/work/binutils-2.16.1/bfd/elflink.c:2357/usr/lib/gcc/i686-pc-linux-gnu/4.1.0/../../../../i686-pc-linux-gnu/bin/ld: BFD 2.16.1 assertion fail /var/tmp/portage/binutils-2.16.1-r2/work/binutils-2.16.1/bfd/elflink.c:2356/usr/lib/gcc/i686-pc-linux-gnu/4.1.0/../../../../i686-pc-linux-gnu/bin/ld: BFD 2.16.1 assertion fail /var/tmp/portage/binutils-2.16.1-r2/work/binutils-2.16.1/bfd/elflink.c:2357/usr/lib/gcc/i686-pc-linux-gnu/4.1.0/../../../../i686-pc-linux-gnu/bin/ld: BFD 2.16.1 assertion fail /var/tmp/portage/binutils-2.16.1-r2/work/binutils-2.16.1/bfd/elflink.c:2356/usr/lib/gcc/i686-pc-linux-gnu/4.1.0/../../../../i686-pc-linux-gnu/bin/ld: BFD 2.16.1 assertion fail /var/tmp/portage/binutils-2.16.1-r2/work/binutils-2.16.1/bfd/elflink.c:2357/usr/lib/gcc/i686-pc-linux-gnu/4.1.0/../../../../i686-pc-linux-gnu/bin/ld: BFD 2.16.1 assertion fail /var/tmp/portage/binutils-2.16.1-r2/work/binutils-2.16.1/bfd/elflink.c:2356/usr/lib/gcc/i686-pc-linux-gnu/4.1.0/../../../../i686-pc-linux-gnu/bin/ld: BFD 2.16.1 assertion fail /var/tmp/portage/binutils-2.16.1-r2/work/binutils-2.16.1/bfd/elflink.c:2357/usr/lib/gcc/i686-pc-linux-gnu/4.1.0/../../../../i686-pc-linux-gnu/bin/ld: BFD 2.16.1 assertion fail /var/tmp/portage/binutils-2.16.1-r2/work/binutils-2.16.1/bfd/elflink.c:2356/usr/lib/gcc/i686-pc-linux-gnu/4.1.0/../../../../i686-pc-linux-gnu/bin/ld: BFD 2.16.1 assertion fail /var/tmp/portage/binutils-2.16.1-r2/work/binutils-2.16.1/bfd/elflink.c:2357/usr/lib/gcc/i686-pc-linux-gnu/4.1.0/../../../../i686-pc-linux-gnu/bin/ld: BFD 2.16.1 assertion fail /var/tmp/portage/binutils-2.16.1-r2/work/binutils-2.16.1/bfd/elflink.c:2356/usr/lib/gcc/i686-pc-linux-gnu/4.1.0/../../../../i686-pc-linux-gnu/bin/ld: BFD 2.16.1 assertion fail /var/tmp/portage/binutils-2.16.1-r2/work/binutils-2.16.1/bfd/elflink.c:2357/usr/lib/gcc/i686-pc-linux-gnu/4.1.0/../../../../i686-pc-linux-gnu/bin/ld: BFD 2.16.1 assertion fail /var/tmp/portage/binutils-2.16.1-r2/work/binutils-2.16.1/bfd/elflink.c:2356/usr/lib/gcc/i686-pc-linux-gnu/4.1.0/../../../../i686-pc-linux-gnu/bin/ld: BFD 2.16.1 assertion fail /var/tmp/portage/binutils-2.16.1-r2/work/binutils-2.16.1/bfd/elflink.c:2357/usr/lib/gcc/i686-pc-linux-gnu/4.1.0/../../../../i686-pc-linux-gnu/bin/ld: BFD 2.16.1 assertion fail /var/tmp/portage/binutils-2.16.1-r2/work/binutils-2.16.1/bfd/elflink.c:2356/usr/lib/gcc/i686-pc-linux-gnu/4.1.0/../../../../i686-pc-linux-gnu/bin/ld: BFD 2.16.1 assertion fail /var/tmp/portage/binutils-2.16.1-r2/work/binutils-2.16.1/bfd/elflink.c:2357/usr/lib/gcc/i686-pc-linux-gnu/4.1.0/../../../../i686-pc-linux-gnu/bin/ld: BFD 2.16.1 assertion fail /var/tmp/portage/binutils-2.16.1-r2/work/binutils-2.16.1/bfd/elflink.c:2356/usr/lib/gcc/i686-pc-linux-gnu/4.1.0/../../../../i686-pc-linux-gnu/bin/ld: BFD 2.16.1 assertion fail /var/tmp/portage/binutils-2.16.1-r2/work/binutils-2.16.1/bfd/elflink.c:2357/usr/lib/gcc/i686-pc-linux-gnu/4.1.0/../../../../i686-pc-linux-gnu/bin/ld: BFD 2.16.1 assertion fail /var/tmp/portage/binutils-2.16.1-r2/work/binutils-2.16.1/bfd/elflink.c:2356/usr/lib/gcc/i686-pc-linux-gnu/4.1.0/../../../../i686-pc-linux-gnu/bin/ld: BFD 2.16.1 assertion fail /var/tmp/portage/binutils-2.16.1-r2/work/binutils-2.16.1/bfd/elflink.c:2357/usr/lib/gcc/i686-pc-linux-gnu/4.1.0/../../../../i686-pc-linux-gnu/bin/ld: BFD 2.16.1 assertion fail /var/tmp/portage/binutils-2.16.1-r2/work/binutils-2.16.1/bfd/elflink.c:2356/usr/lib/gcc/i686-pc-linux-gnu/4.1.0/../../../../i686-pc-linux-gnu/bin/ld: BFD 2.16.1 assertion fail /var/tmp/portage/binutils-2.16.1-r2/work/binutils-2.16.1/bfd/elflink.c:2357/usr/lib/gcc/i686-pc-linux-gnu/4.1.0/../../../../i686-pc-linux-gnu/bin/ld: BFD 2.16.1 assertion fail /var/tmp/portage/binutils-2.16.1-r2/work/binutils-2.16.1/bfd/elflink.c:2356/usr/lib/gcc/i686-pc-linux-gnu/4.1.0/../../../../i686-pc-linux-gnu/bin/ld: BFD 2.16.1 assertion fail /var/tmp/portage/binutils-2.16.1-r2/work/binutils-2.16.1/bfd/elflink.c:2357/usr/lib/gcc/i686-pc-linux-gnu/4.1.0/../../../../i686-pc-linux-gnu/bin/ld: BFD 2.16.1 assertion fail /var/tmp/portage/binutils-2.16.1-r2/work/binutils-2.16.1/bfd/elflink.c:2356/usr/lib/gcc/i686-pc-linux-gnu/4.1.0/../../../../i686-pc-linux-gnu/bin/ld: BFD 2.16.1 assertion fail /var/tmp/portage/binutils-2.16.1-r2/work/binutils-2.16.1/bfd/elflink.c:2357/usr/lib/gcc/i686-pc-linux-gnu/4.1.0/../../../../i686-pc-linux-gnu/bin/ld: BFD 2.16.1 assertion fail /var/tmp/portage/binutils-2.16.1-r2/work/binutils-2.16.1/bfd/elflink.c:2356/usr/lib/gcc/i686-pc-linux-gnu/4.1.0/../../../../i686-pc-linux-gnu/bin/ld: BFD 2.16.1 assertion fail /var/tmp/portage/binutils-2.16.1-r2/work/binutils-2.16.1/bfd/elflink.c:2357/usr/lib/gcc/i686-pc-linux-gnu/4.1.0/../../../../i686-pc-linux-gnu/bin/ld: BFD 2.16.1 internal error, aborting at /var/tmp/portage/binutils-2.16.1-r2/work/binutils-2.16.1/bfd/elflink.c line 6536 in elf_link_output_extsym/usr/lib/gcc/i686-pc-linux-gnu/4.1.0/../../../../i686-pc-linux-gnu/bin/ld: Please report this bug.collect2: ld returned 1 exit statusconfigure:6015: $? = 1configure: failed program was:| /* confdefs.h.  */| | #define PACKAGE_NAME ""| #define PACKAGE_TARNAME ""| #define PACKAGE_VERSION ""| #define PACKAGE_STRING ""| #define PACKAGE_BUGREPORT ""| #ifdef __cplusplus| extern "C" void std::exit (int) throw (); using std::exit;| #endif| #define _GNU_SOURCE 1| #define RESFALLBACK "Rxvt"| #define RESNAME "urxvt"| #define RESCLASS "URxvt"| #define RXVTNAME "urxvt"| /* end confdefs.h.  */| /* Define shmat to an innocuous variant, in case <limits.h> declares shmat.|    For example, HP-UX 11i <limits.h> declares gettimeofday.  */| #define shmat innocuous_shmat| | /* System header to define __stub macros and hopefully few prototypes,|     which can conflict with char shmat (); below.|     Prefer <limits.h> to <assert.h> if __STDC__ is defined, since|     <limits.h> exists even on freestanding compilers.  */| | #ifdef __STDC__| # include <limits.h>| #else| # include <assert.h>| #endif| | #undef shmat| | /* Override any gcc2 internal prototype to avoid an error.  */| #ifdef __cplusplus| extern "C"| {| #endif| /* We use char because int might match the return type of a gcc2|    builtin and then its argument prototype would still apply.  */| char shmat ();| /* The GNU C library defines this for functions which it implements|     to always fail with ENOSYS.  Some functions are actually named|     something starting with __ and the normal name is an alias.  */| #if defined (__stub_shmat) || defined (__stub___shmat)| choke me| #else| char (*f) () = shmat;| #endif| #ifdef __cplusplus| }| #endif| | int| main ()| {| return f != shmat;|   ;|   return 0;| }configure:6039: result: noconfigure:6043: checking for shmat in -lipcconfigure:6073: i686-pc-linux-gnu-g++ -o conftest -march=pentium2 -O2 -fomit-frame-pointer -pipe  -Wl,--as-needed conftest.cc -lipc   -lsupc++ >&5/usr/lib/gcc/i686-pc-linux-gnu/4.1.0/../../../../i686-pc-linux-gnu/bin/ld: cannot find -lipccollect2: ld returned 1 exit statusconfigure:6079: $? = 1configure: failed program was:| /* confdefs.h.  */| | #define PACKAGE_NAME ""| #define PACKAGE_TARNAME ""| #define PACKAGE_VERSION ""| #define PACKAGE_STRING ""| #define PACKAGE_BUGREPORT ""| #ifdef __cplusplus| extern "C" void std::exit (int) throw (); using std::exit;| #endif| #define _GNU_SOURCE 1| #define RESFALLBACK "Rxvt"| #define RESNAME "urxvt"| #define RESCLASS "URxvt"| #define RXVTNAME "urxvt"| /* end confdefs.h.  */| | /* Override any gcc2 internal prototype to avoid an error.  */| #ifdef __cplusplus| extern "C"| #endif| /* We use char because int might match the return type of a gcc2|    builtin and then its argument prototype would still apply.  */| char shmat ();| int| main ()| {| shmat ();|   ;|   return 0;| }configure:6104: result: noconfigure:6122: checking for IceConnectionNumber in -lICEconfigure:6152: i686-pc-linux-gnu-g++ -o conftest -march=pentium2 -O2 -fomit-frame-pointer -pipe  -Wl,--as-needed -L/usr/X11R6/lib conftest.cc -lICE   -lsupc++ >&5/usr/lib/gcc/i686-pc-linux-gnu/4.1.0/../../../../i686-pc-linux-gnu/bin/ld: BFD 2.16.1 assertion fail /var/tmp/portage/binutils-2.16.1-r2/work/binutils-2.16.1/bfd/elflink.c:2356/usr/lib/gcc/i686-pc-linux-gnu/4.1.0/../../../../i686-pc-linux-gnu/bin/ld: BFD 2.16.1 assertion fail /var/tmp/portage/binutils-2.16.1-r2/work/binutils-2.16.1/bfd/elflink.c:2357/usr/lib/gcc/i686-pc-linux-gnu/4.1.0/../../../../i686-pc-linux-gnu/bin/ld: BFD 2.16.1 assertion fail /var/tmp/portage/binutils-2.16.1-r2/work/binutils-2.16.1/bfd/elflink.c:2356/usr/lib/gcc/i686-pc-linux-gnu/4.1.0/../../../../i686-pc-linux-gnu/bin/ld: BFD 2.16.1 assertion fail /var/tmp/portage/binutils-2.16.1-r2/work/binutils-2.16.1/bfd/elflink.c:2357/usr/lib/gcc/i686-pc-linux-gnu/4.1.0/../../../../i686-pc-linux-gnu/bin/ld: BFD 2.16.1 assertion fail /var/tmp/portage/binutils-2.16.1-r2/work/binutils-2.16.1/bfd/elflink.c:2356/usr/lib/gcc/i686-pc-linux-gnu/4.1.0/../../../../i686-pc-linux-gnu/bin/ld: BFD 2.16.1 assertion fail /var/tmp/portage/binutils-2.16.1-r2/work/binutils-2.16.1/bfd/elflink.c:2357/usr/lib/gcc/i686-pc-linux-gnu/4.1.0/../../../../i686-pc-linux-gnu/bin/ld: BFD 2.16.1 assertion fail /var/tmp/portage/binutils-2.16.1-r2/work/binutils-2.16.1/bfd/elflink.c:2356/usr/lib/gcc/i686-pc-linux-gnu/4.1.0/../../../../i686-pc-linux-gnu/bin/ld: BFD 2.16.1 assertion fail /var/tmp/portage/binutils-2.16.1-r2/work/binutils-2.16.1/bfd/elflink.c:2357/usr/lib/gcc/i686-pc-linux-gnu/4.1.0/../../../../i686-pc-linux-gnu/bin/ld: BFD 2.16.1 assertion fail /var/tmp/portage/binutils-2.16.1-r2/work/binutils-2.16.1/bfd/elflink.c:2356/usr/lib/gcc/i686-pc-linux-gnu/4.1.0/../../../../i686-pc-linux-gnu/bin/ld: BFD 2.16.1 assertion fail /var/tmp/portage/binutils-2.16.1-r2/work/binutils-2.16.1/bfd/elflink.c:2357/usr/lib/gcc/i686-pc-linux-gnu/4.1.0/../../../../i686-pc-linux-gnu/bin/ld: BFD 2.16.1 assertion fail /var/tmp/portage/binutils-2.16.1-r2/work/binutils-2.16.1/bfd/elflink.c:2356/usr/lib/gcc/i686-pc-linux-gnu/4.1.0/../../../../i686-pc-linux-gnu/bin/ld: BFD 2.16.1 assertion fail /var/tmp/portage/binutils-2.16.1-r2/work/binutils-2.16.1/bfd/elflink.c:2357/usr/lib/gcc/i686-pc-linux-gnu/4.1.0/../../../../i686-pc-linux-gnu/bin/ld: BFD 2.16.1 assertion fail /var/tmp/portage/binutils-2.16.1-r2/work/binutils-2.16.1/bfd/elflink.c:2356/usr/lib/gcc/i686-pc-linux-gnu/4.1.0/../../../../i686-pc-linux-gnu/bin/ld: BFD 2.16.1 assertion fail /var/tmp/portage/binutils-2.16.1-r2/work/binutils-2.16.1/bfd/elflink.c:2357/usr/lib/gcc/i686-pc-linux-gnu/4.1.0/../../../../i686-pc-linux-gnu/bin/ld: BFD 2.16.1 assertion fail /var/tmp/portage/binutils-2.16.1-r2/work/binutils-2.16.1/bfd/elflink.c:2356/usr/lib/gcc/i686-pc-linux-gnu/4.1.0/../../../../i686-pc-linux-gnu/bin/ld: BFD 2.16.1 assertion fail /var/tmp/portage/binutils-2.16.1-r2/work/binutils-2.16.1/bfd/elflink.c:2357/usr/lib/gcc/i686-pc-linux-gnu/4.1.0/../../../../i686-pc-linux-gnu/bin/ld: BFD 2.16.1 assertion fail /var/tmp/portage/binutils-2.16.1-r2/work/binutils-2.16.1/bfd/elflink.c:2356/usr/lib/gcc/i686-pc-linux-gnu/4.1.0/../../../../i686-pc-linux-gnu/bin/ld: BFD 2.16.1 assertion fail /var/tmp/portage/binutils-2.16.1-r2/work/binutils-2.16.1/bfd/elflink.c:2357/usr/lib/gcc/i686-pc-linux-gnu/4.1.0/../../../../i686-pc-linux-gnu/bin/ld: BFD 2.16.1 assertion fail /var/tmp/portage/binutils-2.16.1-r2/work/binutils-2.16.1/bfd/elflink.c:2356/usr/lib/gcc/i686-pc-linux-gnu/4.1.0/../../../../i686-pc-linux-gnu/bin/ld: BFD 2.16.1 assertion fail /var/tmp/portage/binutils-2.16.1-r2/work/binutils-2.16.1/bfd/elflink.c:2357/usr/lib/gcc/i686-pc-linux-gnu/4.1.0/../../../../i686-pc-linux-gnu/bin/ld: BFD 2.16.1 assertion fail /var/tmp/portage/binutils-2.16.1-r2/work/binutils-2.16.1/bfd/elflink.c:2356/usr/lib/gcc/i686-pc-linux-gnu/4.1.0/../../../../i686-pc-linux-gnu/bin/ld: BFD 2.16.1 assertion fail /var/tmp/portage/binutils-2.16.1-r2/work/binutils-2.16.1/bfd/elflink.c:2357/usr/lib/gcc/i686-pc-linux-gnu/4.1.0/../../../../i686-pc-linux-gnu/bin/ld: BFD 2.16.1 assertion fail /var/tmp/portage/binutils-2.16.1-r2/work/binutils-2.16.1/bfd/elflink.c:2356/usr/lib/gcc/i686-pc-linux-gnu/4.1.0/../../../../i686-pc-linux-gnu/bin/ld: BFD 2.16.1 assertion fail /var/tmp/portage/binutils-2.16.1-r2/work/binutils-2.16.1/bfd/elflink.c:2357/usr/lib/gcc/i686-pc-linux-gnu/4.1.0/../../../../i686-pc-linux-gnu/bin/ld: BFD 2.16.1 assertion fail /var/tmp/portage/binutils-2.16.1-r2/work/binutils-2.16.1/bfd/elflink.c:2356/usr/lib/gcc/i686-pc-linux-gnu/4.1.0/../../../../i686-pc-linux-gnu/bin/ld: BFD 2.16.1 assertion fail /var/tmp/portage/binutils-2.16.1-r2/work/binutils-2.16.1/bfd/elflink.c:2357/usr/lib/gcc/i686-pc-linux-gnu/4.1.0/../../../../i686-pc-linux-gnu/bin/ld: BFD 2.16.1 assertion fail /var/tmp/portage/binutils-2.16.1-r2/work/binutils-2.16.1/bfd/elflink.c:2356/usr/lib/gcc/i686-pc-linux-gnu/4.1.0/../../../../i686-pc-linux-gnu/bin/ld: BFD 2.16.1 assertion fail /var/tmp/portage/binutils-2.16.1-r2/work/binutils-2.16.1/bfd/elflink.c:2357/usr/lib/gcc/i686-pc-linux-gnu/4.1.0/../../../../i686-pc-linux-gnu/bin/ld: BFD 2.16.1 assertion fail /var/tmp/portage/binutils-2.16.1-r2/work/binutils-2.16.1/bfd/elflink.c:2356/usr/lib/gcc/i686-pc-linux-gnu/4.1.0/../../../../i686-pc-linux-gnu/bin/ld: BFD 2.16.1 assertion fail /var/tmp/portage/binutils-2.16.1-r2/work/binutils-2.16.1/bfd/elflink.c:2357/usr/lib/gcc/i686-pc-linux-gnu/4.1.0/../../../../i686-pc-linux-gnu/bin/ld: BFD 2.16.1 assertion fail /var/tmp/portage/binutils-2.16.1-r2/work/binutils-2.16.1/bfd/elflink.c:2356/usr/lib/gcc/i686-pc-linux-gnu/4.1.0/../../../../i686-pc-linux-gnu/bin/ld: BFD 2.16.1 assertion fail /var/tmp/portage/binutils-2.16.1-r2/work/binutils-2.16.1/bfd/elflink.c:2357/usr/lib/gcc/i686-pc-linux-gnu/4.1.0/../../../../i686-pc-linux-gnu/bin/ld: BFD 2.16.1 assertion fail /var/tmp/portage/binutils-2.16.1-r2/work/binutils-2.16.1/bfd/elflink.c:2356/usr/lib/gcc/i686-pc-linux-gnu/4.1.0/../../../../i686-pc-linux-gnu/bin/ld: BFD 2.16.1 assertion fail /var/tmp/portage/binutils-2.16.1-r2/work/binutils-2.16.1/bfd/elflink.c:2357/usr/lib/gcc/i686-pc-linux-gnu/4.1.0/../../../../i686-pc-linux-gnu/bin/ld: BFD 2.16.1 assertion fail /var/tmp/portage/binutils-2.16.1-r2/work/binutils-2.16.1/bfd/elflink.c:2356/usr/lib/gcc/i686-pc-linux-gnu/4.1.0/../../../../i686-pc-linux-gnu/bin/ld: BFD 2.16.1 assertion fail /var/tmp/portage/binutils-2.16.1-r2/work/binutils-2.16.1/bfd/elflink.c:2357/usr/lib/gcc/i686-pc-linux-gnu/4.1.0/../../../../i686-pc-linux-gnu/bin/ld: BFD 2.16.1 assertion fail /var/tmp/portage/binutils-2.16.1-r2/work/binutils-2.16.1/bfd/elflink.c:2356/usr/lib/gcc/i686-pc-linux-gnu/4.1.0/../../../../i686-pc-linux-gnu/bin/ld: BFD 2.16.1 assertion fail /var/tmp/portage/binutils-2.16.1-r2/work/binutils-2.16.1/bfd/elflink.c:2357/usr/lib/gcc/i686-pc-linux-gnu/4.1.0/../../../../i686-pc-linux-gnu/bin/ld: BFD 2.16.1 assertion fail /var/tmp/portage/binutils-2.16.1-r2/work/binutils-2.16.1/bfd/elflink.c:2356/usr/lib/gcc/i686-pc-linux-gnu/4.1.0/../../../../i686-pc-linux-gnu/bin/ld: BFD 2.16.1 assertion fail /var/tmp/portage/binutils-2.16.1-r2/work/binutils-2.16.1/bfd/elflink.c:2357/usr/lib/gcc/i686-pc-linux-gnu/4.1.0/../../../../i686-pc-linux-gnu/bin/ld: BFD 2.16.1 assertion fail /var/tmp/portage/binutils-2.16.1-r2/work/binutils-2.16.1/bfd/elflink.c:2356/usr/lib/gcc/i686-pc-linux-gnu/4.1.0/../../../../i686-pc-linux-gnu/bin/ld: BFD 2.16.1 assertion fail /var/tmp/portage/binutils-2.16.1-r2/work/binutils-2.16.1/bfd/elflink.c:2357/usr/lib/gcc/i686-pc-linux-gnu/4.1.0/../../../../i686-pc-linux-gnu/bin/ld: BFD 2.16.1 assertion fail /var/tmp/portage/binutils-2.16.1-r2/work/binutils-2.16.1/bfd/elflink.c:2356/usr/lib/gcc/i686-pc-linux-gnu/4.1.0/../../../../i686-pc-linux-gnu/bin/ld: BFD 2.16.1 assertion fail /var/tmp/portage/binutils-2.16.1-r2/work/binutils-2.16.1/bfd/elflink.c:2357/usr/lib/gcc/i686-pc-linux-gnu/4.1.0/../../../../i686-pc-linux-gnu/bin/ld: BFD 2.16.1 assertion fail /var/tmp/portage/binutils-2.16.1-r2/work/binutils-2.16.1/bfd/elflink.c:2356/usr/lib/gcc/i686-pc-linux-gnu/4.1.0/../../../../i686-pc-linux-gnu/bin/ld: BFD 2.16.1 assertion fail /var/tmp/portage/binutils-2.16.1-r2/work/binutils-2.16.1/bfd/elflink.c:2357/usr/lib/gcc/i686-pc-linux-gnu/4.1.0/../../../../i686-pc-linux-gnu/bin/ld: BFD 2.16.1 assertion fail /var/tmp/portage/binutils-2.16.1-r2/work/binutils-2.16.1/bfd/elflink.c:2356/usr/lib/gcc/i686-pc-linux-gnu/4.1.0/../../../../i686-pc-linux-gnu/bin/ld: BFD 2.16.1 assertion fail /var/tmp/portage/binutils-2.16.1-r2/work/binutils-2.16.1/bfd/elflink.c:2357/usr/lib/gcc/i686-pc-linux-gnu/4.1.0/../../../../i686-pc-linux-gnu/bin/ld: BFD 2.16.1 internal error, aborting at /var/tmp/portage/binutils-2.16.1-r2/work/binutils-2.16.1/bfd/elflink.c line 6536 in elf_link_output_extsym/usr/lib/gcc/i686-pc-linux-gnu/4.1.0/../../../../i686-pc-linux-gnu/bin/ld: Please report this bug.collect2: ld returned 1 exit statusconfigure:6158: $? = 1configure: failed program was:| /* confdefs.h.  */| | #define PACKAGE_NAME ""| #define PACKAGE_TARNAME ""| #define PACKAGE_VERSION ""| #define PACKAGE_STRING ""| #define PACKAGE_BUGREPORT ""| #ifdef __cplusplus| extern "C" void std::exit (int) throw (); using std::exit;| #endif| #define _GNU_SOURCE 1| #define RESFALLBACK "Rxvt"| #define RESNAME "urxvt"| #define RESCLASS "URxvt"| #define RXVTNAME "urxvt"| /* end confdefs.h.  */| | /* Override any gcc2 internal prototype to avoid an error.  */| #ifdef __cplusplus| extern "C"| #endif| /* We use char because int might match the return type of a gcc2|    builtin and then its argument prototype would still apply.  */| char IceConnectionNumber ();| int| main ()| {| IceConnectionNumber ();|   ;|   return 0;| }configure:6183: result: noconfigure:6206: checking for libXpmconfigure:6267: i686-pc-linux-gnu-g++ -E   conftest.ccconfigure:6273: $? = 0configure:6368: i686-pc-linux-gnu-g++ -o conftest -march=pentium2 -O2 -fomit-frame-pointer -pipe   -Wl,--as-needed conftest.cc  -lsupc++  -L/usr/X11R6/lib -lXpm -lX11 >&5conftest.cc: In function 'int main()':conftest.cc:21: error: 'XpmReadFileToPixmap' was not declared in this scopeconfigure:6374: $? = 1configure: failed program was:| /* confdefs.h.  */| | #define PACKAGE_NAME ""| #define PACKAGE_TARNAME ""| #define PACKAGE_VERSION ""| #define PACKAGE_STRING ""| #define PACKAGE_BUGREPORT ""| #ifdef __cplusplus| extern "C" void std::exit (int) throw (); using std::exit;| #endif| #define _GNU_SOURCE 1| #define RESFALLBACK "Rxvt"| #define RESNAME "urxvt"| #define RESCLASS "URxvt"| #define RXVTNAME "urxvt"| /* end confdefs.h.  */| | int| main ()| {| XpmReadFileToPixmap()|   ;|   return 0;| }configure:6521: result: -I, -L/usr/X11R6/libconfigure:6551: checking for sys/wait.h that is POSIX.1 compatibleconfigure:6582: i686-pc-linux-gnu-g++ -c -march=pentium2 -O2 -fomit-frame-pointer -pipe   conftest.cc >&5configure:6588: $? = 0configure:6591: test -z 			 || test ! -s conftest.errconfigure:6594: $? = 0configure:6597: test -s conftest.oconfigure:6600: $? = 0configure:6611: result: yesconfigure:6621: checking for ANSI C header filesconfigure:6646: i686-pc-linux-gnu-g++ -c -march=pentium2 -O2 -fomit-frame-pointer -pipe   conftest.cc >&5configure:6652: $? = 0configure:6655: test -z 			 || test ! -s conftest.errconfigure:6658: $? = 0configure:6661: test -s conftest.oconfigure:6664: $? = 0configure:6753: i686-pc-linux-gnu-g++ -o conftest -march=pentium2 -O2 -fomit-frame-pointer -pipe   -Wl,--as-needed conftest.cc  -lsupc++ >&5/usr/lib/gcc/i686-pc-linux-gnu/4.1.0/../../../../i686-pc-linux-gnu/bin/ld: BFD 2.16.1 assertion fail /var/tmp/portage/binutils-2.16.1-r2/work/binutils-2.16.1/bfd/elflink.c:2356/usr/lib/gcc/i686-pc-linux-gnu/4.1.0/../../../../i686-pc-linux-gnu/bin/ld: BFD 2.16.1 assertion fail /var/tmp/portage/binutils-2.16.1-r2/work/binutils-2.16.1/bfd/elflink.c:2357/usr/lib/gcc/i686-pc-linux-gnu/4.1.0/../../../../i686-pc-linux-gnu/bin/ld: BFD 2.16.1 assertion fail /var/tmp/portage/binutils-2.16.1-r2/work/binutils-2.16.1/bfd/elflink.c:2356/usr/lib/gcc/i686-pc-linux-gnu/4.1.0/../../../../i686-pc-linux-gnu/bin/ld: BFD 2.16.1 assertion fail /var/tmp/portage/binutils-2.16.1-r2/work/binutils-2.16.1/bfd/elflink.c:2357/usr/lib/gcc/i686-pc-linux-gnu/4.1.0/../../../../i686-pc-linux-gnu/bin/ld: BFD 2.16.1 assertion fail /var/tmp/portage/binutils-2.16.1-r2/work/binutils-2.16.1/bfd/elflink.c:2356/usr/lib/gcc/i686-pc-linux-gnu/4.1.0/../../../../i686-pc-linux-gnu/bin/ld: BFD 2.16.1 assertion fail /var/tmp/portage/binutils-2.16.1-r2/work/binutils-2.16.1/bfd/elflink.c:2357/usr/lib/gcc/i686-pc-linux-gnu/4.1.0/../../../../i686-pc-linux-gnu/bin/ld: BFD 2.16.1 assertion fail /var/tmp/portage/binutils-2.16.1-r2/work/binutils-2.16.1/bfd/elflink.c:2356/usr/lib/gcc/i686-pc-linux-gnu/4.1.0/../../../../i686-pc-linux-gnu/bin/ld: BFD 2.16.1 assertion fail /var/tmp/portage/binutils-2.16.1-r2/work/binutils-2.16.1/bfd/elflink.c:2357/usr/lib/gcc/i686-pc-linux-gnu/4.1.0/../../../../i686-pc-linux-gnu/bin/ld: BFD 2.16.1 assertion fail /var/tmp/portage/binutils-2.16.1-r2/work/binutils-2.16.1/bfd/elflink.c:2356/usr/lib/gcc/i686-pc-linux-gnu/4.1.0/../../../../i686-pc-linux-gnu/bin/ld: BFD 2.16.1 assertion fail /var/tmp/portage/binutils-2.16.1-r2/work/binutils-2.16.1/bfd/elflink.c:2357/usr/lib/gcc/i686-pc-linux-gnu/4.1.0/../../../../i686-pc-linux-gnu/bin/ld: BFD 2.16.1 assertion fail /var/tmp/portage/binutils-2.16.1-r2/work/binutils-2.16.1/bfd/elflink.c:2356/usr/lib/gcc/i686-pc-linux-gnu/4.1.0/../../../../i686-pc-linux-gnu/bin/ld: BFD 2.16.1 assertion fail /var/tmp/portage/binutils-2.16.1-r2/work/binutils-2.16.1/bfd/elflink.c:2357/usr/lib/gcc/i686-pc-linux-gnu/4.1.0/../../../../i686-pc-linux-gnu/bin/ld: BFD 2.16.1 assertion fail /var/tmp/portage/binutils-2.16.1-r2/work/binutils-2.16.1/bfd/elflink.c:2356/usr/lib/gcc/i686-pc-linux-gnu/4.1.0/../../../../i686-pc-linux-gnu/bin/ld: BFD 2.16.1 assertion fail /var/tmp/portage/binutils-2.16.1-r2/work/binutils-2.16.1/bfd/elflink.c:2357/usr/lib/gcc/i686-pc-linux-gnu/4.1.0/../../../../i686-pc-linux-gnu/bin/ld: BFD 2.16.1 assertion fail /var/tmp/portage/binutils-2.16.1-r2/work/binutils-2.16.1/bfd/elflink.c:2356/usr/lib/gcc/i686-pc-linux-gnu/4.1.0/../../../../i686-pc-linux-gnu/bin/ld: BFD 2.16.1 assertion fail /var/tmp/portage/binutils-2.16.1-r2/work/binutils-2.16.1/bfd/elflink.c:2357/usr/lib/gcc/i686-pc-linux-gnu/4.1.0/../../../../i686-pc-linux-gnu/bin/ld: BFD 2.16.1 assertion fail /var/tmp/portage/binutils-2.16.1-r2/work/binutils-2.16.1/bfd/elflink.c:2356/usr/lib/gcc/i686-pc-linux-gnu/4.1.0/../../../../i686-pc-linux-gnu/bin/ld: BFD 2.16.1 assertion fail /var/tmp/portage/binutils-2.16.1-r2/work/binutils-2.16.1/bfd/elflink.c:2357/usr/lib/gcc/i686-pc-linux-gnu/4.1.0/../../../../i686-pc-linux-gnu/bin/ld: BFD 2.16.1 assertion fail /var/tmp/portage/binutils-2.16.1-r2/work/binutils-2.16.1/bfd/elflink.c:2356/usr/lib/gcc/i686-pc-linux-gnu/4.1.0/../../../../i686-pc-linux-gnu/bin/ld: BFD 2.16.1 assertion fail /var/tmp/portage/binutils-2.16.1-r2/work/binutils-2.16.1/bfd/elflink.c:2357/usr/lib/gcc/i686-pc-linux-gnu/4.1.0/../../../../i686-pc-linux-gnu/bin/ld: BFD 2.16.1 assertion fail /var/tmp/portage/binutils-2.16.1-r2/work/binutils-2.16.1/bfd/elflink.c:2356/usr/lib/gcc/i686-pc-linux-gnu/4.1.0/../../../../i686-pc-linux-gnu/bin/ld: BFD 2.16.1 assertion fail /var/tmp/portage/binutils-2.16.1-r2/work/binutils-2.16.1/bfd/elflink.c:2357/usr/lib/gcc/i686-pc-linux-gnu/4.1.0/../../../../i686-pc-linux-gnu/bin/ld: BFD 2.16.1 assertion fail /var/tmp/portage/binutils-2.16.1-r2/work/binutils-2.16.1/bfd/elflink.c:2356/usr/lib/gcc/i686-pc-linux-gnu/4.1.0/../../../../i686-pc-linux-gnu/bin/ld: BFD 2.16.1 assertion fail /var/tmp/portage/binutils-2.16.1-r2/work/binutils-2.16.1/bfd/elflink.c:2357/usr/lib/gcc/i686-pc-linux-gnu/4.1.0/../../../../i686-pc-linux-gnu/bin/ld: BFD 2.16.1 assertion fail /var/tmp/portage/binutils-2.16.1-r2/work/binutils-2.16.1/bfd/elflink.c:2356/usr/lib/gcc/i686-pc-linux-gnu/4.1.0/../../../../i686-pc-linux-gnu/bin/ld: BFD 2.16.1 assertion fail /var/tmp/portage/binutils-2.16.1-r2/work/binutils-2.16.1/bfd/elflink.c:2357/usr/lib/gcc/i686-pc-linux-gnu/4.1.0/../../../../i686-pc-linux-gnu/bin/ld: BFD 2.16.1 assertion fail /var/tmp/portage/binutils-2.16.1-r2/work/binutils-2.16.1/bfd/elflink.c:2356/usr/lib/gcc/i686-pc-linux-gnu/4.1.0/../../../../i686-pc-linux-gnu/bin/ld: BFD 2.16.1 assertion fail /var/tmp/portage/binutils-2.16.1-r2/work/binutils-2.16.1/bfd/elflink.c:2357/usr/lib/gcc/i686-pc-linux-gnu/4.1.0/../../../../i686-pc-linux-gnu/bin/ld: BFD 2.16.1 assertion fail /var/tmp/portage/binutils-2.16.1-r2/work/binutils-2.16.1/bfd/elflink.c:2356/usr/lib/gcc/i686-pc-linux-gnu/4.1.0/../../../../i686-pc-linux-gnu/bin/ld: BFD 2.16.1 assertion fail /var/tmp/portage/binutils-2.16.1-r2/work/binutils-2.16.1/bfd/elflink.c:2357/usr/lib/gcc/i686-pc-linux-gnu/4.1.0/../../../../i686-pc-linux-gnu/bin/ld: BFD 2.16.1 assertion fail /var/tmp/portage/binutils-2.16.1-r2/work/binutils-2.16.1/bfd/elflink.c:2356/usr/lib/gcc/i686-pc-linux-gnu/4.1.0/../../../../i686-pc-linux-gnu/bin/ld: BFD 2.16.1 assertion fail /var/tmp/portage/binutils-2.16.1-r2/work/binutils-2.16.1/bfd/elflink.c:2357/usr/lib/gcc/i686-pc-linux-gnu/4.1.0/../../../../i686-pc-linux-gnu/bin/ld: BFD 2.16.1 assertion fail /var/tmp/portage/binutils-2.16.1-r2/work/binutils-2.16.1/bfd/elflink.c:2356/usr/lib/gcc/i686-pc-linux-gnu/4.1.0/../../../../i686-pc-linux-gnu/bin/ld: BFD 2.16.1 assertion fail /var/tmp/portage/binutils-2.16.1-r2/work/binutils-2.16.1/bfd/elflink.c:2357/usr/lib/gcc/i686-pc-linux-gnu/4.1.0/../../../../i686-pc-linux-gnu/bin/ld: BFD 2.16.1 assertion fail /var/tmp/portage/binutils-2.16.1-r2/work/binutils-2.16.1/bfd/elflink.c:2356/usr/lib/gcc/i686-pc-linux-gnu/4.1.0/../../../../i686-pc-linux-gnu/bin/ld: BFD 2.16.1 assertion fail /var/tmp/portage/binutils-2.16.1-r2/work/binutils-2.16.1/bfd/elflink.c:2357/usr/lib/gcc/i686-pc-linux-gnu/4.1.0/../../../../i686-pc-linux-gnu/bin/ld: BFD 2.16.1 assertion fail /var/tmp/portage/binutils-2.16.1-r2/work/binutils-2.16.1/bfd/elflink.c:2356/usr/lib/gcc/i686-pc-linux-gnu/4.1.0/../../../../i686-pc-linux-gnu/bin/ld: BFD 2.16.1 assertion fail /var/tmp/portage/binutils-2.16.1-r2/work/binutils-2.16.1/bfd/elflink.c:2357/usr/lib/gcc/i686-pc-linux-gnu/4.1.0/../../../../i686-pc-linux-gnu/bin/ld: BFD 2.16.1 assertion fail /var/tmp/portage/binutils-2.16.1-r2/work/binutils-2.16.1/bfd/elflink.c:2356/usr/lib/gcc/i686-pc-linux-gnu/4.1.0/../../../../i686-pc-linux-gnu/bin/ld: BFD 2.16.1 assertion fail /var/tmp/portage/binutils-2.16.1-r2/work/binutils-2.16.1/bfd/elflink.c:2357/usr/lib/gcc/i686-pc-linux-gnu/4.1.0/../../../../i686-pc-linux-gnu/bin/ld: BFD 2.16.1 assertion fail /var/tmp/portage/binutils-2.16.1-r2/work/binutils-2.16.1/bfd/elflink.c:2356/usr/lib/gcc/i686-pc-linux-gnu/4.1.0/../../../../i686-pc-linux-gnu/bin/ld: BFD 2.16.1 assertion fail /var/tmp/portage/binutils-2.16.1-r2/work/binutils-2.16.1/bfd/elflink.c:2357/usr/lib/gcc/i686-pc-linux-gnu/4.1.0/../../../../i686-pc-linux-gnu/bin/ld: BFD 2.16.1 assertion fail /var/tmp/portage/binutils-2.16.1-r2/work/binutils-2.16.1/bfd/elflink.c:2356/usr/lib/gcc/i686-pc-linux-gnu/4.1.0/../../../../i686-pc-linux-gnu/bin/ld: BFD 2.16.1 assertion fail /var/tmp/portage/binutils-2.16.1-r2/work/binutils-2.16.1/bfd/elflink.c:2357/usr/lib/gcc/i686-pc-linux-gnu/4.1.0/../../../../i686-pc-linux-gnu/bin/ld: BFD 2.16.1 assertion fail /var/tmp/portage/binutils-2.16.1-r2/work/binutils-2.16.1/bfd/elflink.c:2356/usr/lib/gcc/i686-pc-linux-gnu/4.1.0/../../../../i686-pc-linux-gnu/bin/ld: BFD 2.16.1 assertion fail /var/tmp/portage/binutils-2.16.1-r2/work/binutils-2.16.1/bfd/elflink.c:2357/usr/lib/gcc/i686-pc-linux-gnu/4.1.0/../../../../i686-pc-linux-gnu/bin/ld: BFD 2.16.1 assertion fail /var/tmp/portage/binutils-2.16.1-r2/work/binutils-2.16.1/bfd/elflink.c:2356/usr/lib/gcc/i686-pc-linux-gnu/4.1.0/../../../../i686-pc-linux-gnu/bin/ld: BFD 2.16.1 assertion fail /var/tmp/portage/binutils-2.16.1-r2/work/binutils-2.16.1/bfd/elflink.c:2357/usr/lib/gcc/i686-pc-linux-gnu/4.1.0/../../../../i686-pc-linux-gnu/bin/ld: BFD 2.16.1 internal error, aborting at /var/tmp/portage/binutils-2.16.1-r2/work/binutils-2.16.1/bfd/elflink.c line 6536 in elf_link_output_extsym/usr/lib/gcc/i686-pc-linux-gnu/4.1.0/../../../../i686-pc-linux-gnu/bin/ld: Please report this bug.collect2: ld returned 1 exit statusconfigure:6756: $? = 1configure: program exited with status 1configure: failed program was:| /* confdefs.h.  */| | #define PACKAGE_NAME ""| #define PACKAGE_TARNAME ""| #define PACKAGE_VERSION ""| #define PACKAGE_STRING ""| #define PACKAGE_BUGREPORT ""| #ifdef __cplusplus| extern "C" void std::exit (int) throw (); using std::exit;| #endif| #define _GNU_SOURCE 1| #define RESFALLBACK "Rxvt"| #define RESNAME "urxvt"| #define RESCLASS "URxvt"| #define RXVTNAME "urxvt"| #define XPM_INC_X11 1| #define HAVE_SYS_WAIT_H 1| /* end confdefs.h.  */| #include <ctype.h>| #if ((' ' & 0x0FF) == 0x020)| # define ISLOWER(c) ('a' <= (c) && (c) <= 'z')| # define TOUPPER(c) (ISLOWER(c) ? 'A' + ((c) - 'a') : (c))| #else| # define ISLOWER(c) 		   (('a' <= (c) && (c) <= 'i') 		     || ('j' <= (c) && (c) <= 'r') 		     || ('s' <= (c) && (c) <= 'z'))| # define TOUPPER(c) (ISLOWER(c) ? ((c) | 0x40) : (c))| #endif| | #define XOR(e, f) (((e) && !(f)) || (!(e) && (f)))| int| main ()| {|   int i;|   for (i = 0; i < 256; i++)|     if (XOR (islower (i), ISLOWER (i))| 	|| toupper (i) != TOUPPER (i))|       exit(2);|   exit (0);| }configure:6776: result: noconfigure:6800: checking for sys/types.hconfigure:6816: i686-pc-linux-gnu-g++ -c -march=pentium2 -O2 -fomit-frame-pointer -pipe   conftest.cc >&5configure:6822: $? = 0configure:6825: test -z 			 || test ! -s conftest.errconfigure:6828: $? = 0configure:6831: test -s conftest.oconfigure:6834: $? = 0configure:6845: result: yesconfigure:6800: checking for sys/stat.hconfigure:6816: i686-pc-linux-gnu-g++ -c -march=pentium2 -O2 -fomit-frame-pointer -pipe   conftest.cc >&5configure:6822: $? = 0configure:6825: test -z 			 || test ! -s conftest.errconfigure:6828: $? = 0configure:6831: test -s conftest.oconfigure:6834: $? = 0configure:6845: result: yesconfigure:6800: checking for stdlib.hconfigure:6816: i686-pc-linux-gnu-g++ -c -march=pentium2 -O2 -fomit-frame-pointer -pipe   conftest.cc >&5configure:6822: $? = 0configure:6825: test -z 			 || test ! -s conftest.errconfigure:6828: $? = 0configure:6831: test -s conftest.oconfigure:6834: $? = 0configure:6845: result: yesconfigure:6800: checking for string.hconfigure:6816: i686-pc-linux-gnu-g++ -c -march=pentium2 -O2 -fomit-frame-pointer -pipe   conftest.cc >&5configure:6822: $? = 0configure:6825: test -z 			 || test ! -s conftest.errconfigure:6828: $? = 0configure:6831: test -s conftest.oconfigure:6834: $? = 0configure:6845: result: yesconfigure:6800: checking for memory.hconfigure:6816: i686-pc-linux-gnu-g++ -c -march=pentium2 -O2 -fomit-frame-pointer -pipe   conftest.cc >&5configure:6822: $? = 0configure:6825: test -z 			 || test ! -s conftest.errconfigure:6828: $? = 0configure:6831: test -s conftest.oconfigure:6834: $? = 0configure:6845: result: yesconfigure:6800: checking for strings.hconfigure:6816: i686-pc-linux-gnu-g++ -c -march=pentium2 -O2 -fomit-frame-pointer -pipe   conftest.cc >&5configure:6822: $? = 0configure:6825: test -z 			 || test ! -s conftest.errconfigure:6828: $? = 0configure:6831: test -s conftest.oconfigure:6834: $? = 0configure:6845: result: yesconfigure:6800: checking for inttypes.hconfigure:6816: i686-pc-linux-gnu-g++ -c -march=pentium2 -O2 -fomit-frame-pointer -pipe   conftest.cc >&5configure:6822: $? = 0configure:6825: test -z 			 || test ! -s conftest.errconfigure:6828: $? = 0configure:6831: test -s conftest.oconfigure:6834: $? = 0configure:6845: result: yesconfigure:6800: checking for stdint.hconfigure:6816: i686-pc-linux-gnu-g++ -c -march=pentium2 -O2 -fomit-frame-pointer -pipe   conftest.cc >&5configure:6822: $? = 0configure:6825: test -z 			 || test ! -s conftest.errconfigure:6828: $? = 0configure:6831: test -s conftest.oconfigure:6834: $? = 0configure:6845: result: yesconfigure:6800: checking for unistd.hconfigure:6816: i686-pc-linux-gnu-g++ -c -march=pentium2 -O2 -fomit-frame-pointer -pipe   conftest.cc >&5configure:6822: $? = 0configure:6825: test -z 			 || test ! -s conftest.errconfigure:6828: $? = 0configure:6831: test -s conftest.oconfigure:6834: $? = 0configure:6845: result: yesconfigure:6905: checking assert.h usabilityconfigure:6917: i686-pc-linux-gnu-g++ -c -march=pentium2 -O2 -fomit-frame-pointer -pipe   conftest.cc >&5configure:6923: $? = 0configure:6926: test -z 			 || test ! -s conftest.errconfigure:6929: $? = 0configure:6932: test -s conftest.oconfigure:6935: $? = 0configure:6945: result: yesconfigure:6949: checking assert.h presenceconfigure:6959: i686-pc-linux-gnu-g++ -E   conftest.ccconfigure:6965: $? = 0configure:6985: result: yesconfigure:7020: checking for assert.hconfigure:7027: result: yesconfigure:6905: checking fcntl.h usabilityconfigure:6917: i686-pc-linux-gnu-g++ -c -march=pentium2 -O2 -fomit-frame-pointer -pipe   conftest.cc >&5configure:6923: $? = 0configure:6926: test -z 			 || test ! -s conftest.errconfigure:6929: $? = 0configure:6932: test -s conftest.oconfigure:6935: $? = 0configure:6945: result: yesconfigure:6949: checking fcntl.h presenceconfigure:6959: i686-pc-linux-gnu-g++ -E   conftest.ccconfigure:6965: $? = 0configure:6985: result: yesconfigure:7020: checking for fcntl.hconfigure:7027: result: yesconfigure:6905: checking stdarg.h usabilityconfigure:6917: i686-pc-linux-gnu-g++ -c -march=pentium2 -O2 -fomit-frame-pointer -pipe   conftest.cc >&5configure:6923: $? = 0configure:6926: test -z 			 || test ! -s conftest.errconfigure:6929: $? = 0configure:6932: test -s conftest.oconfigure:6935: $? = 0configure:6945: result: yesconfigure:6949: checking stdarg.h presenceconfigure:6959: i686-pc-linux-gnu-g++ -E   conftest.ccconfigure:6965: $? = 0configure:6985: result: yesconfigure:7020: checking for stdarg.hconfigure:7027: result: yesconfigure:6896: checking for stdlib.hconfigure:6901: result: yesconfigure:6896: checking for string.hconfigure:6901: result: yesconfigure:6905: checking termios.h usabilityconfigure:6917: i686-pc-linux-gnu-g++ -c -march=pentium2 -O2 -fomit-frame-pointer -pipe   conftest.cc >&5configure:6923: $? = 0configure:6926: test -z 			 || test ! -s conftest.errconfigure:6929: $? = 0configure:6932: test -s conftest.oconfigure:6935: $? = 0configure:6945: result: yesconfigure:6949: checking termios.h presenceconfigure:6959: i686-pc-linux-gnu-g++ -E   conftest.ccconfigure:6965: $? = 0configure:6985: result: yesconfigure:7020: checking for termios.hconfigure:7027: result: yesconfigure:6896: checking for unistd.hconfigure:6901: result: yesconfigure:6905: checking sys/byteorder.h usabilityconfigure:6917: i686-pc-linux-gnu-g++ -c -march=pentium2 -O2 -fomit-frame-pointer -pipe   conftest.cc >&5conftest.cc:69:27: error: sys/byteorder.h: No such file or directoryconfigure:6923: $? = 1configure: failed program was:| /* confdefs.h.  */| | #define PACKAGE_NAME ""| #define PACKAGE_TARNAME ""| #define PACKAGE_VERSION ""| #define PACKAGE_STRING ""| #define PACKAGE_BUGREPORT ""| #ifdef __cplusplus| extern "C" void std::exit (int) throw (); using std::exit;| #endif| #define _GNU_SOURCE 1| #define RESFALLBACK "Rxvt"| #define RESNAME "urxvt"| #define RESCLASS "URxvt"| #define RXVTNAME "urxvt"| #define XPM_INC_X11 1| #define HAVE_SYS_WAIT_H 1| #define HAVE_SYS_TYPES_H 1| #define HAVE_SYS_STAT_H 1| #define HAVE_STDLIB_H 1| #define HAVE_STRING_H 1| #define HAVE_MEMORY_H 1| #define HAVE_STRINGS_H 1| #define HAVE_INTTYPES_H 1| #define HAVE_STDINT_H 1| #define HAVE_UNISTD_H 1| #define HAVE_ASSERT_H 1| #define HAVE_FCNTL_H 1| #define HAVE_STDARG_H 1| #define HAVE_STDLIB_H 1| #define HAVE_STRING_H 1| #define HAVE_TERMIOS_H 1| #define HAVE_UNISTD_H 1| /* end confdefs.h.  */| #include <stdio.h>| #if HAVE_SYS_TYPES_H| # include <sys/types.h>| #endif| #if HAVE_SYS_STAT_H| # include <sys/stat.h>| #endif| #if STDC_HEADERS| # include <stdlib.h>| # include <stddef.h>| #else| # if HAVE_STDLIB_H| #  include <stdlib.h>| # endif| #endif| #if HAVE_STRING_H| # if !STDC_HEADERS && HAVE_MEMORY_H| #  include <memory.h>| # endif| # include <string.h>| #endif| #if HAVE_STRINGS_H| # include <strings.h>| #endif| #if HAVE_INTTYPES_H| # include <inttypes.h>| #else| # if HAVE_STDINT_H| #  include <stdint.h>| # endif| #endif| #if HAVE_UNISTD_H| # include <unistd.h>| #endif| #include <sys/byteorder.h>configure:6945: result: noconfigure:6949: checking sys/byteorder.h presenceconfigure:6959: i686-pc-linux-gnu-g++ -E   conftest.ccconftest.cc:35:27: error: sys/byteorder.h: No such file or directoryconfigure:6965: $? = 1configure: failed program was:| /* confdefs.h.  */| | #define PACKAGE_NAME ""| #define PACKAGE_TARNAME ""| #define PACKAGE_VERSION ""| #define PACKAGE_STRING ""| #define PACKAGE_BUGREPORT ""| #ifdef __cplusplus| extern "C" void std::exit (int) throw (); using std::exit;| #endif| #define _GNU_SOURCE 1| #define RESFALLBACK "Rxvt"| #define RESNAME "urxvt"| #define RESCLASS "URxvt"| #define RXVTNAME "urxvt"| #define XPM_INC_X11 1| #define HAVE_SYS_WAIT_H 1| #define HAVE_SYS_TYPES_H 1| #define HAVE_SYS_STAT_H 1| #define HAVE_STDLIB_H 1| #define HAVE_STRING_H 1| #define HAVE_MEMORY_H 1| #define HAVE_STRINGS_H 1| #define HAVE_INTTYPES_H 1| #define HAVE_STDINT_H 1| #define HAVE_UNISTD_H 1| #define HAVE_ASSERT_H 1| #define HAVE_FCNTL_H 1| #define HAVE_STDARG_H 1| #define HAVE_STDLIB_H 1| #define HAVE_STRING_H 1| #define HAVE_TERMIOS_H 1| #define HAVE_UNISTD_H 1| /* end confdefs.h.  */| #include <sys/byteorder.h>configure:6985: result: noconfigure:7020: checking for sys/byteorder.hconfigure:7027: result: noconfigure:6905: checking sys/ioctl.h usabilityconfigure:6917: i686-pc-linux-gnu-g++ -c -march=pentium2 -O2 -fomit-frame-pointer -pipe   conftest.cc >&5configure:6923: $? = 0configure:6926: test -z 			 || test ! -s conftest.errconfigure:6929: $? = 0configure:6932: test -s conftest.oconfigure:6935: $? = 0configure:6945: result: yesconfigure:6949: checking sys/ioctl.h presenceconfigure:6959: i686-pc-linux-gnu-g++ -E   conftest.ccconfigure:6965: $? = 0configure:6985: result: yesconfigure:7020: checking for sys/ioctl.hconfigure:7027: result: yesconfigure:6905: checking sys/select.h usabilityconfigure:6917: i686-pc-linux-gnu-g++ -c -march=pentium2 -O2 -fomit-frame-pointer -pipe   conftest.cc >&5configure:6923: $? = 0configure:6926: test -z 			 || test ! -s conftest.errconfigure:6929: $? = 0configure:6932: test -s conftest.oconfigure:6935: $? = 0configure:6945: result: yesconfigure:6949: checking sys/select.h presenceconfigure:6959: i686-pc-linux-gnu-g++ -E   conftest.ccconfigure:6965: $? = 0configure:6985: result: yesconfigure:7020: checking for sys/select.hconfigure:7027: result: yesconfigure:6905: checking sys/sockio.h usabilityconfigure:6917: i686-pc-linux-gnu-g++ -c -march=pentium2 -O2 -fomit-frame-pointer -pipe   conftest.cc >&5conftest.cc:71:24: error: sys/sockio.h: No such file or directoryconfigure:6923: $? = 1configure: failed program was:| /* confdefs.h.  */| | #define PACKAGE_NAME ""| #define PACKAGE_TARNAME ""| #define PACKAGE_VERSION ""| #define PACKAGE_STRING ""| #define PACKAGE_BUGREPORT ""| #ifdef __cplusplus| extern "C" void std::exit (int) throw (); using std::exit;| #endif| #define _GNU_SOURCE 1| #define RESFALLBACK "Rxvt"| #define RESNAME "urxvt"| #define RESCLASS "URxvt"| #define RXVTNAME "urxvt"| #define XPM_INC_X11 1| #define HAVE_SYS_WAIT_H 1| #define HAVE_SYS_TYPES_H 1| #define HAVE_SYS_STAT_H 1| #define HAVE_STDLIB_H 1| #define HAVE_STRING_H 1| #define HAVE_MEMORY_H 1| #define HAVE_STRINGS_H 1| #define HAVE_INTTYPES_H 1| #define HAVE_STDINT_H 1| #define HAVE_UNISTD_H 1| #define HAVE_ASSERT_H 1| #define HAVE_FCNTL_H 1| #define HAVE_STDARG_H 1| #define HAVE_STDLIB_H 1| #define HAVE_STRING_H 1| #define HAVE_TERMIOS_H 1| #define HAVE_UNISTD_H 1| #define HAVE_SYS_IOCTL_H 1| #define HAVE_SYS_SELECT_H 1| /* end confdefs.h.  */| #include <stdio.h>| #if HAVE_SYS_TYPES_H| # include <sys/types.h>| #endif| #if HAVE_SYS_STAT_H| # include <sys/stat.h>| #endif| #if STDC_HEADERS| # include <stdlib.h>| # include <stddef.h>| #else| # if HAVE_STDLIB_H| #  include <stdlib.h>| # endif| #endif| #if HAVE_STRING_H| # if !STDC_HEADERS && HAVE_MEMORY_H| #  include <memory.h>| # endif| # include <string.h>| #endif| #if HAVE_STRINGS_H| # include <strings.h>| #endif| #if HAVE_INTTYPES_H| # include <inttypes.h>| #else| # if HAVE_STDINT_H| #  include <stdint.h>| # endif| #endif| #if HAVE_UNISTD_H| # include <unistd.h>| #endif| #include <sys/sockio.h>configure:6945: result: noconfigure:6949: checking sys/sockio.h presenceconfigure:6959: i686-pc-linux-gnu-g++ -E   conftest.ccconftest.cc:37:24: error: sys/sockio.h: No such file or directoryconfigure:6965: $? = 1configure: failed program was:| /* confdefs.h.  */| | #define PACKAGE_NAME ""| #define PACKAGE_TARNAME ""| #define PACKAGE_VERSION ""| #define PACKAGE_STRING ""| #define PACKAGE_BUGREPORT ""| #ifdef __cplusplus| extern "C" void std::exit (int) throw (); using std::exit;| #endif| #define _GNU_SOURCE 1| #define RESFALLBACK "Rxvt"| #define RESNAME "urxvt"| #define RESCLASS "URxvt"| #define RXVTNAME "urxvt"| #define XPM_INC_X11 1| #define HAVE_SYS_WAIT_H 1| #define HAVE_SYS_TYPES_H 1| #define HAVE_SYS_STAT_H 1| #define HAVE_STDLIB_H 1| #define HAVE_STRING_H 1| #define HAVE_MEMORY_H 1| #define HAVE_STRINGS_H 1| #define HAVE_INTTYPES_H 1| #define HAVE_STDINT_H 1| #define HAVE_UNISTD_H 1| #define HAVE_ASSERT_H 1| #define HAVE_FCNTL_H 1| #define HAVE_STDARG_H 1| #define HAVE_STDLIB_H 1| #define HAVE_STRING_H 1| #define HAVE_TERMIOS_H 1| #define HAVE_UNISTD_H 1| #define HAVE_SYS_IOCTL_H 1| #define HAVE_SYS_SELECT_H 1| /* end confdefs.h.  */| #include <sys/sockio.h>configure:6985: result: noconfigure:7020: checking for sys/sockio.hconfigure:7027: result: noconfigure:6905: checking sys/strredir.h usabilityconfigure:6917: i686-pc-linux-gnu-g++ -c -march=pentium2 -O2 -fomit-frame-pointer -pipe   conftest.cc >&5conftest.cc:71:26: error: sys/strredir.h: No such file or directoryconfigure:6923: $? = 1configure: failed program was:| /* confdefs.h.  */| | #define PACKAGE_NAME ""| #define PACKAGE_TARNAME ""| #define PACKAGE_VERSION ""| #define PACKAGE_STRING ""| #define PACKAGE_BUGREPORT ""| #ifdef __cplusplus| extern "C" void std::exit (int) throw (); using std::exit;| #endif| #define _GNU_SOURCE 1| #define RESFALLBACK "Rxvt"| #define RESNAME "urxvt"| #define RESCLASS "URxvt"| #define RXVTNAME "urxvt"| #define XPM_INC_X11 1| #define HAVE_SYS_WAIT_H 1| #define HAVE_SYS_TYPES_H 1| #define HAVE_SYS_STAT_H 1| #define HAVE_STDLIB_H 1| #define HAVE_STRING_H 1| #define HAVE_MEMORY_H 1| #define HAVE_STRINGS_H 1| #define HAVE_INTTYPES_H 1| #define HAVE_STDINT_H 1| #define HAVE_UNISTD_H 1| #define HAVE_ASSERT_H 1| #define HAVE_FCNTL_H 1| #define HAVE_STDARG_H 1| #define HAVE_STDLIB_H 1| #define HAVE_STRING_H 1| #define HAVE_TERMIOS_H 1| #define HAVE_UNISTD_H 1| #define HAVE_SYS_IOCTL_H 1| #define HAVE_SYS_SELECT_H 1| /* end confdefs.h.  */| #include <stdio.h>| #if HAVE_SYS_TYPES_H| # include <sys/types.h>| #endif| #if HAVE_SYS_STAT_H| # include <sys/stat.h>| #endif| #if STDC_HEADERS| # include <stdlib.h>| # include <stddef.h>| #else| # if HAVE_STDLIB_H| #  include <stdlib.h>| # endif| #endif| #if HAVE_STRING_H| # if !STDC_HEADERS && HAVE_MEMORY_H| #  include <memory.h>| # endif| # include <string.h>| #endif| #if HAVE_STRINGS_H| # include <strings.h>| #endif| #if HAVE_INTTYPES_H| # include <inttypes.h>| #else| # if HAVE_STDINT_H| #  include <stdint.h>| # endif| #endif| #if HAVE_UNISTD_H| # include <unistd.h>| #endif| #include <sys/strredir.h>configure:6945: result: noconfigure:6949: checking sys/strredir.h presenceconfigure:6959: i686-pc-linux-gnu-g++ -E   conftest.ccconftest.cc:37:26: error: sys/strredir.h: No such file or directoryconfigure:6965: $? = 1configure: failed program was:| /* confdefs.h.  */| | #define PACKAGE_NAME ""| #define PACKAGE_TARNAME ""| #define PACKAGE_VERSION ""| #define PACKAGE_STRING ""| #define PACKAGE_BUGREPORT ""| #ifdef __cplusplus| extern "C" void std::exit (int) throw (); using std::exit;| #endif| #define _GNU_SOURCE 1| #define RESFALLBACK "Rxvt"| #define RESNAME "urxvt"| #define RESCLASS "URxvt"| #define RXVTNAME "urxvt"| #define XPM_INC_X11 1| #define HAVE_SYS_WAIT_H 1| #define HAVE_SYS_TYPES_H 1| #define HAVE_SYS_STAT_H 1| #define HAVE_STDLIB_H 1| #define HAVE_STRING_H 1| #define HAVE_MEMORY_H 1| #define HAVE_STRINGS_H 1| #define HAVE_INTTYPES_H 1| #define HAVE_STDINT_H 1| #define HAVE_UNISTD_H 1| #define HAVE_ASSERT_H 1| #define HAVE_FCNTL_H 1| #define HAVE_STDARG_H 1| #define HAVE_STDLIB_H 1| #define HAVE_STRING_H 1| #define HAVE_TERMIOS_H 1| #define HAVE_UNISTD_H 1| #define HAVE_SYS_IOCTL_H 1| #define HAVE_SYS_SELECT_H 1| /* end confdefs.h.  */| #include <sys/strredir.h>configure:6985: result: noconfigure:7020: checking for sys/strredir.hconfigure:7027: result: noconfigure:6905: checking sys/time.h usabilityconfigure:6917: i686-pc-linux-gnu-g++ -c -march=pentium2 -O2 -fomit-frame-pointer -pipe   conftest.cc >&5configure:6923: $? = 0configure:6926: test -z 			 || test ! -s conftest.errconfigure:6929: $? = 0configure:6932: test -s conftest.oconfigure:6935: $? = 0configure:6945: result: yesconfigure:6949: checking sys/time.h presenceconfigure:6959: i686-pc-linux-gnu-g++ -E   conftest.ccconfigure:6965: $? = 0configure:6985: result: yesconfigure:7020: checking for sys/time.hconfigure:7027: result: yesconfigure:6896: checking for stdint.hconfigure:6901: result: yesconfigure:6905: checking wchar.h usabilityconfigure:6917: i686-pc-linux-gnu-g++ -c -march=pentium2 -O2 -fomit-frame-pointer -pipe   conftest.cc >&5configure:6923: $? = 0configure:6926: test -z 			 || test ! -s conftest.errconfigure:6929: $? = 0configure:6932: test -s conftest.oconfigure:6935: $? = 0configure:6945: result: yesconfigure:6949: checking wchar.h presenceconfigure:6959: i686-pc-linux-gnu-g++ -E   conftest.ccconfigure:6965: $? = 0configure:6985: result: yesconfigure:7020: checking for wchar.hconfigure:7027: result: yesconfigure:6905: checking cwchar usabilityconfigure:6917: i686-pc-linux-gnu-g++ -c -march=pentium2 -O2 -fomit-frame-pointer -pipe   conftest.cc >&5configure:6923: $? = 0configure:6926: test -z 			 || test ! -s conftest.errconfigure:6929: $? = 0configure:6932: test -s conftest.oconfigure:6935: $? = 0configure:6945: result: yesconfigure:6949: checking cwchar presenceconfigure:6959: i686-pc-linux-gnu-g++ -E   conftest.ccconfigure:6965: $? = 0configure:6985: result: yesconfigure:7020: checking for cwcharconfigure:7027: result: yesconfigure:6905: checking clocale usabilityconfigure:6917: i686-pc-linux-gnu-g++ -c -march=pentium2 -O2 -fomit-frame-pointer -pipe   conftest.cc >&5configure:6923: $? = 0configure:6926: test -z 			 || test ! -s conftest.errconfigure:6929: $? = 0configure:6932: test -s conftest.oconfigure:6935: $? = 0configure:6945: result: yesconfigure:6949: checking clocale presenceconfigure:6959: i686-pc-linux-gnu-g++ -E   conftest.ccconfigure:6965: $? = 0configure:6985: result: yesconfigure:7020: checking for clocaleconfigure:7027: result: yesconfigure:7041: checking whether time.h and sys/time.h may both be includedconfigure:7066: i686-pc-linux-gnu-g++ -c -march=pentium2 -O2 -fomit-frame-pointer -pipe   conftest.cc >&5configure:7072: $? = 0configure:7075: test -z 			 || test ! -s conftest.errconfigure:7078: $? = 0configure:7081: test -s conftest.oconfigure:7084: $? = 0configure:7095: result: yesconfigure:7106: checking whether termios.h and sys/ioctl.h may both be includedconfigure:7131: i686-pc-linux-gnu-g++ -c -march=pentium2 -O2 -fomit-frame-pointer -pipe   conftest.cc >&5configure:7137: $? = 0configure:7140: test -z 			 || test ! -s conftest.errconfigure:7143: $? = 0configure:7146: test -s conftest.oconfigure:7149: $? = 0configure:7160: result: yesconfigure:7174: checking for -rpath dynamic library path recordingconfigure:7197: i686-pc-linux-gnu-g++ -o conftest -march=pentium2 -O2 -fomit-frame-pointer -pipe   -Wl,--as-needed conftest.cc  -lsupc++  -L/usr/X11R6/lib -Wl,-rpath -Wl,/usr/X11R6/lib  -lX11 >&5conftest.cc: In function 'int main()':conftest.cc:47: error: 'XOpenDisplay' was not declared in this scopeconfigure:7200: $? = 1configure: program exited with status 1configure: failed program was:| /* confdefs.h.  */| | #define PACKAGE_NAME ""| #define PACKAGE_TARNAME ""| #define PACKAGE_VERSION ""| #define PACKAGE_STRING ""| #define PACKAGE_BUGREPORT ""| #ifdef __cplusplus| extern "C" void std::exit (int) throw (); using std::exit;| #endif| #define _GNU_SOURCE 1| #define RESFALLBACK "Rxvt"| #define RESNAME "urxvt"| #define RESCLASS "URxvt"| #define RXVTNAME "urxvt"| #define XPM_INC_X11 1| #define HAVE_SYS_WAIT_H 1| #define HAVE_SYS_TYPES_H 1| #define HAVE_SYS_STAT_H 1| #define HAVE_STDLIB_H 1| #define HAVE_STRING_H 1| #define HAVE_MEMORY_H 1| #define HAVE_STRINGS_H 1| #define HAVE_INTTYPES_H 1| #define HAVE_STDINT_H 1| #define HAVE_UNISTD_H 1| #define HAVE_ASSERT_H 1| #define HAVE_FCNTL_H 1| #define HAVE_STDARG_H 1| #define HAVE_STDLIB_H 1| #define HAVE_STRING_H 1| #define HAVE_TERMIOS_H 1| #define HAVE_UNISTD_H 1| #define HAVE_SYS_IOCTL_H 1| #define HAVE_SYS_SELECT_H 1| #define HAVE_SYS_TIME_H 1| #define HAVE_STDINT_H 1| #define HAVE_WCHAR_H 1| #define HAVE_CWCHAR 1| #define HAVE_CLOCALE 1| #define TIME_WITH_SYS_TIME 1| /* end confdefs.h.  */| | main()| {|     exit(0);|     (void) XOpenDisplay("foobar");| }configure:7219: result: noconfigure:7224: checking for -R dynamic library path recordingconfigure:7246: i686-pc-linux-gnu-g++ -o conftest -march=pentium2 -O2 -fomit-frame-pointer -pipe   -Wl,--as-needed conftest.cc  -lsupc++  -L/usr/X11R6/lib -Wl,-R/usr/X11R6/lib  -lX11 >&5conftest.cc: In function 'int main()':conftest.cc:47: error: 'XOpenDisplay' was not declared in this scopeconfigure:7249: $? = 1configure: program exited with status 1configure: failed program was:| /* confdefs.h.  */| | #define PACKAGE_NAME ""| #define PACKAGE_TARNAME ""| #define PACKAGE_VERSION ""| #define PACKAGE_STRING ""| #define PACKAGE_BUGREPORT ""| #ifdef __cplusplus| extern "C" void std::exit (int) throw (); using std::exit;| #endif| #define _GNU_SOURCE 1| #define RESFALLBACK "Rxvt"| #define RESNAME "urxvt"| #define RESCLASS "URxvt"| #define RXVTNAME "urxvt"| #define XPM_INC_X11 1| #define HAVE_SYS_WAIT_H 1| #define HAVE_SYS_TYPES_H 1| #define HAVE_SYS_STAT_H 1| #define HAVE_STDLIB_H 1| #define HAVE_STRING_H 1| #define HAVE_MEMORY_H 1| #define HAVE_STRINGS_H 1| #define HAVE_INTTYPES_H 1| #define HAVE_STDINT_H 1| #define HAVE_UNISTD_H 1| #define HAVE_ASSERT_H 1| #define HAVE_FCNTL_H 1| #define HAVE_STDARG_H 1| #define HAVE_STDLIB_H 1| #define HAVE_STRING_H 1| #define HAVE_TERMIOS_H 1| #define HAVE_UNISTD_H 1| #define HAVE_SYS_IOCTL_H 1| #define HAVE_SYS_SELECT_H 1| #define HAVE_SYS_TIME_H 1| #define HAVE_STDINT_H 1| #define HAVE_WCHAR_H 1| #define HAVE_CWCHAR 1| #define HAVE_CLOCALE 1| #define TIME_WITH_SYS_TIME 1| /* end confdefs.h.  */| | main()| {|     exit(0);|     (void) XOpenDisplay("foobar");| }configure:7268: result: noconfigure:7275: checking for XPointerconfigure:7296: i686-pc-linux-gnu-g++ -c -march=pentium2 -O2 -fomit-frame-pointer -pipe   conftest.cc >&5configure:7302: $? = 0configure:7305: test -z 			 || test ! -s conftest.errconfigure:7308: $? = 0configure:7311: test -s conftest.oconfigure:7314: $? = 0configure:7325: result: yesconfigure:7337: checking for XLIB_ILLEGAL_ACCESSconfigure:7364: i686-pc-linux-gnu-g++ -c -march=pentium2 -O2 -fomit-frame-pointer -pipe   conftest.cc >&5configure:7370: $? = 0configure:7373: test -z 			 || test ! -s conftest.errconfigure:7376: $? = 0configure:7379: test -s conftest.oconfigure:7382: $? = 0configure:7394: result: yesconfigure:7404: checking for an ANSI C-conforming constconfigure:7471: i686-pc-linux-gnu-g++ -c -march=pentium2 -O2 -fomit-frame-pointer -pipe   conftest.cc >&5configure:7477: $? = 0configure:7480: test -z 			 || test ! -s conftest.errconfigure:7483: $? = 0configure:7486: test -s conftest.oconfigure:7489: $? = 0configure:7500: result: yesconfigure:7510: checking for inlineconfigure:7531: i686-pc-linux-gnu-g++ -c -march=pentium2 -O2 -fomit-frame-pointer -pipe   conftest.cc >&5configure:7537: $? = 0configure:7540: test -z 			 || test ! -s conftest.errconfigure:7543: $? = 0configure:7546: test -s conftest.oconfigure:7549: $? = 0configure:7561: result: inlineconfigure:7582: checking for mode_tconfigure:7606: i686-pc-linux-gnu-g++ -c -march=pentium2 -O2 -fomit-frame-pointer -pipe   conftest.cc >&5configure:7612: $? = 0configure:7615: test -z 			 || test ! -s conftest.errconfigure:7618: $? = 0configure:7621: test -s conftest.oconfigure:7624: $? = 0configure:7635: result: yesconfigure:7647: checking for pid_tconfigure:7671: i686-pc-linux-gnu-g++ -c -march=pentium2 -O2 -fomit-frame-pointer -pipe   conftest.cc >&5configure:7677: $? = 0configure:7680: test -z 			 || test ! -s conftest.errconfigure:7683: $? = 0configure:7686: test -s conftest.oconfigure:7689: $? = 0configure:7700: result: yesconfigure:7712: checking for uid_t in sys/types.hconfigure:7735: result: yesconfigure:7751: checking for shortconfigure:7775: i686-pc-linux-gnu-g++ -c -march=pentium2 -O2 -fomit-frame-pointer -pipe   conftest.cc >&5configure:7781: $? = 0configure:7784: test -z 			 || test ! -s conftest.errconfigure:7787: $? = 0configure:7790: test -s conftest.oconfigure:7793: $? = 0configure:7804: result: yesconfigure:7807: checking size of shortconfigure:8119: i686-pc-linux-gnu-g++ -o conftest -march=pentium2 -O2 -fomit-frame-pointer -pipe   -Wl,--as-needed conftest.cc  -lsupc++ >&5/usr/lib/gcc/i686-pc-linux-gnu/4.1.0/../../../../i686-pc-linux-gnu/bin/ld: BFD 2.16.1 assertion fail /var/tmp/portage/binutils-2.16.1-r2/work/binutils-2.16.1/bfd/elflink.c:2356/usr/lib/gcc/i686-pc-linux-gnu/4.1.0/../../../../i686-pc-linux-gnu/bin/ld: BFD 2.16.1 assertion fail /var/tmp/portage/binutils-2.16.1-r2/work/binutils-2.16.1/bfd/elflink.c:2357/usr/lib/gcc/i686-pc-linux-gnu/4.1.0/../../../../i686-pc-linux-gnu/bin/ld: BFD 2.16.1 assertion fail /var/tmp/portage/binutils-2.16.1-r2/work/binutils-2.16.1/bfd/elflink.c:2356/usr/lib/gcc/i686-pc-linux-gnu/4.1.0/../../../../i686-pc-linux-gnu/bin/ld: BFD 2.16.1 assertion fail /var/tmp/portage/binutils-2.16.1-r2/work/binutils-2.16.1/bfd/elflink.c:2357/usr/lib/gcc/i686-pc-linux-gnu/4.1.0/../../../../i686-pc-linux-gnu/bin/ld: BFD 2.16.1 assertion fail /var/tmp/portage/binutils-2.16.1-r2/work/binutils-2.16.1/bfd/elflink.c:2356/usr/lib/gcc/i686-pc-linux-gnu/4.1.0/../../../../i686-pc-linux-gnu/bin/ld: BFD 2.16.1 assertion fail /var/tmp/portage/binutils-2.16.1-r2/work/binutils-2.16.1/bfd/elflink.c:2357/usr/lib/gcc/i686-pc-linux-gnu/4.1.0/../../../../i686-pc-linux-gnu/bin/ld: BFD 2.16.1 assertion fail /var/tmp/portage/binutils-2.16.1-r2/work/binutils-2.16.1/bfd/elflink.c:2356/usr/lib/gcc/i686-pc-linux-gnu/4.1.0/../../../../i686-pc-linux-gnu/bin/ld: BFD 2.16.1 assertion fail /var/tmp/portage/binutils-2.16.1-r2/work/binutils-2.16.1/bfd/elflink.c:2357/usr/lib/gcc/i686-pc-linux-gnu/4.1.0/../../../../i686-pc-linux-gnu/bin/ld: BFD 2.16.1 assertion fail /var/tmp/portage/binutils-2.16.1-r2/work/binutils-2.16.1/bfd/elflink.c:2356/usr/lib/gcc/i686-pc-linux-gnu/4.1.0/../../../../i686-pc-linux-gnu/bin/ld: BFD 2.16.1 assertion fail /var/tmp/portage/binutils-2.16.1-r2/work/binutils-2.16.1/bfd/elflink.c:2357/usr/lib/gcc/i686-pc-linux-gnu/4.1.0/../../../../i686-pc-linux-gnu/bin/ld: BFD 2.16.1 assertion fail /var/tmp/portage/binutils-2.16.1-r2/work/binutils-2.16.1/bfd/elflink.c:2356/usr/lib/gcc/i686-pc-linux-gnu/4.1.0/../../../../i686-pc-linux-gnu/bin/ld: BFD 2.16.1 assertion fail /var/tmp/portage/binutils-2.16.1-r2/work/binutils-2.16.1/bfd/elflink.c:2357/usr/lib/gcc/i686-pc-linux-gnu/4.1.0/../../../../i686-pc-linux-gnu/bin/ld: BFD 2.16.1 assertion fail /var/tmp/portage/binutils-2.16.1-r2/work/binutils-2.16.1/bfd/elflink.c:2356/usr/lib/gcc/i686-pc-linux-gnu/4.1.0/../../../../i686-pc-linux-gnu/bin/ld: BFD 2.16.1 assertion fail /var/tmp/portage/binutils-2.16.1-r2/work/binutils-2.16.1/bfd/elflink.c:2357/usr/lib/gcc/i686-pc-linux-gnu/4.1.0/../../../../i686-pc-linux-gnu/bin/ld: BFD 2.16.1 assertion fail /var/tmp/portage/binutils-2.16.1-r2/work/binutils-2.16.1/bfd/elflink.c:2356/usr/lib/gcc/i686-pc-linux-gnu/4.1.0/../../../../i686-pc-linux-gnu/bin/ld: BFD 2.16.1 assertion fail /var/tmp/portage/binutils-2.16.1-r2/work/binutils-2.16.1/bfd/elflink.c:2357/usr/lib/gcc/i686-pc-linux-gnu/4.1.0/../../../../i686-pc-linux-gnu/bin/ld: BFD 2.16.1 assertion fail /var/tmp/portage/binutils-2.16.1-r2/work/binutils-2.16.1/bfd/elflink.c:2356/usr/lib/gcc/i686-pc-linux-gnu/4.1.0/../../../../i686-pc-linux-gnu/bin/ld: BFD 2.16.1 assertion fail /var/tmp/portage/binutils-2.16.1-r2/work/binutils-2.16.1/bfd/elflink.c:2357/usr/lib/gcc/i686-pc-linux-gnu/4.1.0/../../../../i686-pc-linux-gnu/bin/ld: BFD 2.16.1 assertion fail /var/tmp/portage/binutils-2.16.1-r2/work/binutils-2.16.1/bfd/elflink.c:2356/usr/lib/gcc/i686-pc-linux-gnu/4.1.0/../../../../i686-pc-linux-gnu/bin/ld: BFD 2.16.1 assertion fail /var/tmp/portage/binutils-2.16.1-r2/work/binutils-2.16.1/bfd/elflink.c:2357/usr/lib/gcc/i686-pc-linux-gnu/4.1.0/../../../../i686-pc-linux-gnu/bin/ld: BFD 2.16.1 assertion fail /var/tmp/portage/binutils-2.16.1-r2/work/binutils-2.16.1/bfd/elflink.c:2356/usr/lib/gcc/i686-pc-linux-gnu/4.1.0/../../../../i686-pc-linux-gnu/bin/ld: BFD 2.16.1 assertion fail /var/tmp/portage/binutils-2.16.1-r2/work/binutils-2.16.1/bfd/elflink.c:2357/usr/lib/gcc/i686-pc-linux-gnu/4.1.0/../../../../i686-pc-linux-gnu/bin/ld: BFD 2.16.1 assertion fail /var/tmp/portage/binutils-2.16.1-r2/work/binutils-2.16.1/bfd/elflink.c:2356/usr/lib/gcc/i686-pc-linux-gnu/4.1.0/../../../../i686-pc-linux-gnu/bin/ld: BFD 2.16.1 assertion fail /var/tmp/portage/binutils-2.16.1-r2/work/binutils-2.16.1/bfd/elflink.c:2357/usr/lib/gcc/i686-pc-linux-gnu/4.1.0/../../../../i686-pc-linux-gnu/bin/ld: BFD 2.16.1 assertion fail /var/tmp/portage/binutils-2.16.1-r2/work/binutils-2.16.1/bfd/elflink.c:2356/usr/lib/gcc/i686-pc-linux-gnu/4.1.0/../../../../i686-pc-linux-gnu/bin/ld: BFD 2.16.1 assertion fail /var/tmp/portage/binutils-2.16.1-r2/work/binutils-2.16.1/bfd/elflink.c:2357/usr/lib/gcc/i686-pc-linux-gnu/4.1.0/../../../../i686-pc-linux-gnu/bin/ld: BFD 2.16.1 assertion fail /var/tmp/portage/binutils-2.16.1-r2/work/binutils-2.16.1/bfd/elflink.c:2356/usr/lib/gcc/i686-pc-linux-gnu/4.1.0/../../../../i686-pc-linux-gnu/bin/ld: BFD 2.16.1 assertion fail /var/tmp/portage/binutils-2.16.1-r2/work/binutils-2.16.1/bfd/elflink.c:2357/usr/lib/gcc/i686-pc-linux-gnu/4.1.0/../../../../i686-pc-linux-gnu/bin/ld: BFD 2.16.1 assertion fail /var/tmp/portage/binutils-2.16.1-r2/work/binutils-2.16.1/bfd/elflink.c:2356/usr/lib/gcc/i686-pc-linux-gnu/4.1.0/../../../../i686-pc-linux-gnu/bin/ld: BFD 2.16.1 assertion fail /var/tmp/portage/binutils-2.16.1-r2/work/binutils-2.16.1/bfd/elflink.c:2357/usr/lib/gcc/i686-pc-linux-gnu/4.1.0/../../../../i686-pc-linux-gnu/bin/ld: BFD 2.16.1 assertion fail /var/tmp/portage/binutils-2.16.1-r2/work/binutils-2.16.1/bfd/elflink.c:2356/usr/lib/gcc/i686-pc-linux-gnu/4.1.0/../../../../i686-pc-linux-gnu/bin/ld: BFD 2.16.1 assertion fail /var/tmp/portage/binutils-2.16.1-r2/work/binutils-2.16.1/bfd/elflink.c:2357/usr/lib/gcc/i686-pc-linux-gnu/4.1.0/../../../../i686-pc-linux-gnu/bin/ld: BFD 2.16.1 assertion fail /var/tmp/portage/binutils-2.16.1-r2/work/binutils-2.16.1/bfd/elflink.c:2356/usr/lib/gcc/i686-pc-linux-gnu/4.1.0/../../../../i686-pc-linux-gnu/bin/ld: BFD 2.16.1 assertion fail /var/tmp/portage/binutils-2.16.1-r2/work/binutils-2.16.1/bfd/elflink.c:2357/usr/lib/gcc/i686-pc-linux-gnu/4.1.0/../../../../i686-pc-linux-gnu/bin/ld: BFD 2.16.1 assertion fail /var/tmp/portage/binutils-2.16.1-r2/work/binutils-2.16.1/bfd/elflink.c:2356/usr/lib/gcc/i686-pc-linux-gnu/4.1.0/../../../../i686-pc-linux-gnu/bin/ld: BFD 2.16.1 assertion fail /var/tmp/portage/binutils-2.16.1-r2/work/binutils-2.16.1/bfd/elflink.c:2357/usr/lib/gcc/i686-pc-linux-gnu/4.1.0/../../../../i686-pc-linux-gnu/bin/ld: BFD 2.16.1 assertion fail /var/tmp/portage/binutils-2.16.1-r2/work/binutils-2.16.1/bfd/elflink.c:2356/usr/lib/gcc/i686-pc-linux-gnu/4.1.0/../../../../i686-pc-linux-gnu/bin/ld: BFD 2.16.1 assertion fail /var/tmp/portage/binutils-2.16.1-r2/work/binutils-2.16.1/bfd/elflink.c:2357/usr/lib/gcc/i686-pc-linux-gnu/4.1.0/../../../../i686-pc-linux-gnu/bin/ld: BFD 2.16.1 assertion fail /var/tmp/portage/binutils-2.16.1-r2/work/binutils-2.16.1/bfd/elflink.c:2356/usr/lib/gcc/i686-pc-linux-gnu/4.1.0/../../../../i686-pc-linux-gnu/bin/ld: BFD 2.16.1 assertion fail /var/tmp/portage/binutils-2.16.1-r2/work/binutils-2.16.1/bfd/elflink.c:2357/usr/lib/gcc/i686-pc-linux-gnu/4.1.0/../../../../i686-pc-linux-gnu/bin/ld: BFD 2.16.1 assertion fail /var/tmp/portage/binutils-2.16.1-r2/work/binutils-2.16.1/bfd/elflink.c:2356/usr/lib/gcc/i686-pc-linux-gnu/4.1.0/../../../../i686-pc-linux-gnu/bin/ld: BFD 2.16.1 assertion fail /var/tmp/portage/binutils-2.16.1-r2/work/binutils-2.16.1/bfd/elflink.c:2357/usr/lib/gcc/i686-pc-linux-gnu/4.1.0/../../../../i686-pc-linux-gnu/bin/ld: BFD 2.16.1 assertion fail /var/tmp/portage/binutils-2.16.1-r2/work/binutils-2.16.1/bfd/elflink.c:2356/usr/lib/gcc/i686-pc-linux-gnu/4.1.0/../../../../i686-pc-linux-gnu/bin/ld: BFD 2.16.1 assertion fail /var/tmp/portage/binutils-2.16.1-r2/work/binutils-2.16.1/bfd/elflink.c:2357/usr/lib/gcc/i686-pc-linux-gnu/4.1.0/../../../../i686-pc-linux-gnu/bin/ld: BFD 2.16.1 assertion fail /var/tmp/portage/binutils-2.16.1-r2/work/binutils-2.16.1/bfd/elflink.c:2356/usr/lib/gcc/i686-pc-linux-gnu/4.1.0/../../../../i686-pc-linux-gnu/bin/ld: BFD 2.16.1 assertion fail /var/tmp/portage/binutils-2.16.1-r2/work/binutils-2.16.1/bfd/elflink.c:2357/usr/lib/gcc/i686-pc-linux-gnu/4.1.0/../../../../i686-pc-linux-gnu/bin/ld: BFD 2.16.1 assertion fail /var/tmp/portage/binutils-2.16.1-r2/work/binutils-2.16.1/bfd/elflink.c:2356/usr/lib/gcc/i686-pc-linux-gnu/4.1.0/../../../../i686-pc-linux-gnu/bin/ld: BFD 2.16.1 assertion fail /var/tmp/portage/binutils-2.16.1-r2/work/binutils-2.16.1/bfd/elflink.c:2357/usr/lib/gcc/i686-pc-linux-gnu/4.1.0/../../../../i686-pc-linux-gnu/bin/ld: BFD 2.16.1 internal error, aborting at /var/tmp/portage/binutils-2.16.1-r2/work/binutils-2.16.1/bfd/elflink.c line 6536 in elf_link_output_extsym/usr/lib/gcc/i686-pc-linux-gnu/4.1.0/../../../../i686-pc-linux-gnu/bin/ld: Please report this bug.collect2: ld returned 1 exit statusconfigure:8122: $? = 1configure: program exited with status 1configure: failed program was:| /* confdefs.h.  */| | #define PACKAGE_NAME ""| #define PACKAGE_TARNAME ""| #define PACKAGE_VERSION ""| #define PACKAGE_STRING ""| #define PACKAGE_BUGREPORT ""| #ifdef __cplusplus| extern "C" void std::exit (int) throw (); using std::exit;| #endif| #define _GNU_SOURCE 1| #define RESFALLBACK "Rxvt"| #define RESNAME "urxvt"| #define RESCLASS "URxvt"| #define RXVTNAME "urxvt"| #define XPM_INC_X11 1| #define HAVE_SYS_WAIT_H 1| #define HAVE_SYS_TYPES_H 1| #define HAVE_SYS_STAT_H 1| #define HAVE_STDLIB_H 1| #define HAVE_STRING_H 1| #define HAVE_MEMORY_H 1| #define HAVE_STRINGS_H 1| #define HAVE_INTTYPES_H 1| #define HAVE_STDINT_H 1| #define HAVE_UNISTD_H 1| #define HAVE_ASSERT_H 1| #define HAVE_FCNTL_H 1| #define HAVE_STDARG_H 1| #define HAVE_STDLIB_H 1| #define HAVE_STRING_H 1| #define HAVE_TERMIOS_H 1| #define HAVE_UNISTD_H 1| #define HAVE_SYS_IOCTL_H 1| #define HAVE_SYS_SELECT_H 1| #define HAVE_SYS_TIME_H 1| #define HAVE_STDINT_H 1| #define HAVE_WCHAR_H 1| #define HAVE_CWCHAR 1| #define HAVE_CLOCALE 1| #define TIME_WITH_SYS_TIME 1| #define HAVE_XPOINTER 1| #define XLIB_ILLEGAL_ACCESS 1| /* end confdefs.h.  */| #include <stdio.h>| #if HAVE_SYS_TYPES_H| # include <sys/types.h>| #endif| #if HAVE_SYS_STAT_H| # include <sys/stat.h>| #endif| #if STDC_HEADERS| # include <stdlib.h>| # include <stddef.h>| #else| # if HAVE_STDLIB_H| #  include <stdlib.h>| # endif| #endif| #if HAVE_STRING_H| # if !STDC_HEADERS && HAVE_MEMORY_H| #  include <memory.h>| # endif| # include <string.h>| #endif| #if HAVE_STRINGS_H| # include <strings.h>| #endif| #if HAVE_INTTYPES_H| # include <inttypes.h>| #else| # if HAVE_STDINT_H| #  include <stdint.h>| # endif| #endif| #if HAVE_UNISTD_H| # include <unistd.h>| #endif| long longval () { return (long) (sizeof (short)); }| unsigned long ulongval () { return (long) (sizeof (short)); }| #include <stdio.h>| #include <stdlib.h>| int| main ()| {| |   FILE *f = fopen ("conftest.val", "w");|   if (! f)|     exit (1);|   if (((long) (sizeof (short))) < 0)|     {|       long i = longval ();|       if (i != ((long) (sizeof (short))))| 	exit (1);|       fprintf (f, "%ld\n", i);|     }|   else|     {|       unsigned long i = ulongval ();|       if (i != ((long) (sizeof (short))))| 	exit (1);|       fprintf (f, "%lu\n", i);|     }|   exit (ferror (f) || fclose (f) != 0);| |   ;|   return 0;| }configure:8137: error: cannot compute sizeof (short), 77See `config.log' for more details.## ---------------- #### Cache variables. #### ---------------- ##ac_cv_build=i686-pc-linux-gnuac_cv_build_alias=i686-pc-linux-gnuac_cv_c_compiler_gnu=yesac_cv_c_const=yesac_cv_c_inline=inlineac_cv_cxx_compiler_gnu=yesac_cv_env_CC_set=ac_cv_env_CC_value=ac_cv_env_CFLAGS_set=setac_cv_env_CFLAGS_value='-march=pentium2 -O2 -fomit-frame-pointer -pipe'ac_cv_env_CPPFLAGS_set=ac_cv_env_CPPFLAGS_value=ac_cv_env_CPP_set=ac_cv_env_CPP_value=ac_cv_env_CXXCPP_set=ac_cv_env_CXXCPP_value=ac_cv_env_CXXFLAGS_set=setac_cv_env_CXXFLAGS_value='-march=pentium2 -O2 -fomit-frame-pointer -pipe'ac_cv_env_CXX_set=ac_cv_env_CXX_value=ac_cv_env_LDFLAGS_set=setac_cv_env_LDFLAGS_value=-Wl,--as-neededac_cv_env_build_alias_set=setac_cv_env_build_alias_value=i686-pc-linux-gnuac_cv_env_host_alias_set=setac_cv_env_host_alias_value=i686-pc-linux-gnuac_cv_env_target_alias_set=ac_cv_env_target_alias_value=ac_cv_exeext=ac_cv_func_connect=noac_cv_func_gethostbyname=noac_cv_func_remove=noac_cv_func_setlocale=noac_cv_func_shmat=noac_cv_func_socket=noac_cv_have_x='have_x=yes 		ac_x_includes= ac_x_libraries=/usr/X11R6/lib'ac_cv_have_xpm='have_xpm=yes 	vt_xpm_includes= vt_xpm_libraries=/usr/X11R6/lib 	vt_xpm_include_X11=yes'ac_cv_header_assert_h=yesac_cv_header_clocale=yesac_cv_header_cwchar=yesac_cv_header_fcntl_h=yesac_cv_header_inttypes_h=yesac_cv_header_memory_h=yesac_cv_header_stdarg_h=yesac_cv_header_stdc=noac_cv_header_stdint_h=yesac_cv_header_stdlib_h=yesac_cv_header_string_h=yesac_cv_header_strings_h=yesac_cv_header_sys_byteorder_h=noac_cv_header_sys_ioctl_h=yesac_cv_header_sys_select_h=yesac_cv_header_sys_sockio_h=noac_cv_header_sys_stat_h=yesac_cv_header_sys_strredir_h=noac_cv_header_sys_time_h=yesac_cv_header_sys_types_h=yesac_cv_header_sys_wait_h=yesac_cv_header_termios_h=yesac_cv_header_time=yesac_cv_header_unistd_h=yesac_cv_header_wchar_h=yesac_cv_host=i686-pc-linux-gnuac_cv_host_alias=i686-pc-linux-gnuac_cv_lib_ICE_IceConnectionNumber=noac_cv_lib_bsd_gethostbyname=noac_cv_lib_dnet_dnet_ntoa=noac_cv_lib_dnet_stub_dnet_ntoa=noac_cv_lib_ipc_shmat=noac_cv_lib_nsl_gethostbyname=noac_cv_lib_posix_remove=noac_cv_lib_socket_connect=noac_cv_lib_socket_socket=noac_cv_lib_xpg4_setlocale=noac_cv_objext=oac_cv_path_CMP=/usr/bin/cmpac_cv_path_CP=/bin/cpac_cv_path_ECHO=/bin/echoac_cv_path_LN=/bin/lnac_cv_path_MV=/bin/mvac_cv_path_SED=/bin/sedac_cv_path_TIC=/usr/bin/ticac_cv_path_install='/bin/install -c'ac_cv_prog_CC=i686-pc-linux-gnu-gccac_cv_prog_CPP='i686-pc-linux-gnu-gcc -E'ac_cv_prog_CXX=i686-pc-linux-gnu-g++ac_cv_prog_CXXCPP='i686-pc-linux-gnu-g++ -E'ac_cv_prog_cc_g=yesac_cv_prog_cc_stdc=ac_cv_prog_cxx_g=yesac_cv_prog_egrep='grep -E'ac_cv_search_strerror='none required'ac_cv_type_mode_t=yesac_cv_type_pid_t=yesac_cv_type_short=yesac_cv_type_uid_t=yesrxvt_cv_R=norxvt_cv_header_sysioctl=yesrxvt_cv_rpath=norxvt_cv_xpointer=yes## ----------------- #### Output variables. #### ----------------- ##CC='i686-pc-linux-gnu-gcc'CFLAGS='-march=pentium2 -O2 -fomit-frame-pointer -pipe'CMP='/usr/bin/cmp'CP='/bin/cp'CPP='i686-pc-linux-gnu-gcc -E'CPPFLAGS=' 'CXX='i686-pc-linux-gnu-g++'CXXCPP='i686-pc-linux-gnu-g++ -E'CXXFLAGS='-march=pentium2 -O2 -fomit-frame-pointer -pipe'DATE='2006-02-21'DEBUG=''DEFS=''DINCLUDE=''DLIB=''ECHO='/bin/echo'ECHO_C=''ECHO_N='-n'ECHO_T=''EGREP='grep -E'EXEEXT=''IF_PERL=''INSTALL_DATA='${INSTALL} -m 644'INSTALL_LIBRXVT=''INSTALL_PROGRAM='${INSTALL}'INSTALL_SCRIPT='${INSTALL}'LDFLAGS='-Wl,--as-needed'LIBOBJS=''LIBS=' -lsupc++'LIBVERSION=''LINKER='i686-pc-linux-gnu-gcc'LN='/bin/ln'LSMDATE=''LTLIBOBJS=''MV='/bin/mv'OBJEXT='o'PACKAGE_BUGREPORT=''PACKAGE_NAME=''PACKAGE_STRING=''PACKAGE_TARNAME=''PACKAGE_VERSION=''PATH_SEPARATOR=':'PERL=''PERLFLAGS=''PERLLIB=''PERLPRIVLIBEXP=''PERL_O=''PKG_CONFIG=''RXVTNAME='urxvt'SED='/bin/sed'SHELL='/bin/sh'TIC='/usr/bin/tic'VERSION='7.7'XFT_CONFIG=''XPM_CFLAGS=''XPM_CPPFLAGS=''XPM_LIBS='-L/usr/X11R6/lib -lXpm'X_CFLAGS=''X_EXTRA_LIBS=''X_LIBS=' -L/usr/X11R6/lib'X_PRE_LIBS=''ac_ct_CC=''ac_ct_CXX=''bindir='${exec_prefix}/bin'build='i686-pc-linux-gnu'build_alias='i686-pc-linux-gnu'build_cpu='i686'build_os='linux-gnu'build_vendor='pc'datadir='/usr/share'exec_prefix='NONE'host='i686-pc-linux-gnu'host_alias='i686-pc-linux-gnu'host_cpu='i686'host_os='linux-gnu'host_vendor='pc'include_assert_h=''include_fcntl_h=''include_stdarg_h=''include_stdint_h=''include_stdlib_h=''include_string_h=''include_sys_ioctl_h=''include_sys_select_h=''include_sys_strredir_h=''include_sys_time_h=''include_time_h=''include_unistd_h=''include_util_h=''includedir='${prefix}/include'infodir='/usr/share/info'libdir='${exec_prefix}/lib'libexecdir='${exec_prefix}/libexec'localstatedir='/var/lib'mandir='/usr/share/man'oldincludedir='/usr/include'prefix='/usr'program_transform_name='s,x,x,'rxvt_int16_typedef=''rxvt_int32_typedef=''rxvt_intp_define=''rxvt_u_intp_define=''rxvt_uint16_typedef=''rxvt_uint32_typedef=''sbindir='${exec_prefix}/sbin'sharedstatedir='${prefix}/com'sysconfdir='/etc'target_alias=''## ----------- #### confdefs.h. #### ----------- ###define HAVE_ASSERT_H 1#define HAVE_CLOCALE 1#define HAVE_CWCHAR 1#define HAVE_FCNTL_H 1#define HAVE_INTTYPES_H 1#define HAVE_MEMORY_H 1#define HAVE_STDARG_H 1#define HAVE_STDINT_H 1#define HAVE_STDINT_H 1#define HAVE_STDLIB_H 1#define HAVE_STDLIB_H 1#define HAVE_STRINGS_H 1#define HAVE_STRING_H 1#define HAVE_STRING_H 1#define HAVE_SYS_IOCTL_H 1#define HAVE_SYS_SELECT_H 1#define HAVE_SYS_STAT_H 1#define HAVE_SYS_TIME_H 1#define HAVE_SYS_TYPES_H 1#define HAVE_SYS_WAIT_H 1#define HAVE_TERMIOS_H 1#define HAVE_UNISTD_H 1#define HAVE_UNISTD_H 1#define HAVE_WCHAR_H 1#define HAVE_XPOINTER 1#define PACKAGE_BUGREPORT ""#define PACKAGE_NAME ""#define PACKAGE_STRING ""#define PACKAGE_TARNAME ""#define PACKAGE_VERSION ""#define RESCLASS "URxvt"#define RESFALLBACK "Rxvt"#define RESNAME "urxvt"#define RXVTNAME "urxvt"#define TIME_WITH_SYS_TIME 1#define XLIB_ILLEGAL_ACCESS 1#define XPM_INC_X11 1#define _GNU_SOURCE 1#endif#ifdef __cplusplusextern "C" void std::exit (int) throw (); using std::exit;configure: exit 1