Expat.c:2290: error: `XML_Parser' undeclared (first use in this function)
Expat.c:2290: error: syntax error before "parser"
Expat.c:2294: error: `parser' undeclared (first use in this function)
Expat.c: In function `XS_XML__Parser__Expat_GetCurrentByteIndex':
Expat.c:2307: error: `XML_Parser' undeclared (first use in this function)
Expat.c:2307: error: syntax error before "parser"
Expat.c:2311: error: `parser' undeclared (first use in this function)
Expat.c: In function `XS_XML__Parser__Expat_GetSpecifiedAttributeCount':
Expat.c:2324: error: `XML_Parser' undeclared (first use in this function)
Expat.c:2324: error: syntax error before "parser"
Expat.c:2328: error: `parser' undeclared (first use in this function)
Expat.xs: In function `XS_XML__Parser__Expat_ErrorString':
Expat.xs:1983: warning: initialization makes pointer from integer without a cast
Expat.c: In function `XS_XML__Parser__Expat_OriginalString':
Expat.c:2484: error: `XML_Parser' undeclared (first use in this function)
Expat.c:2484: error: syntax error before "parser"
Expat.xs:2091: error: `parser' undeclared (first use in this function)
Expat.xs:2091: warning: initialization makes pointer from integer without a cast
Expat.c: In function `XS_XML__Parser__Expat_SetStartCdataHandler':
Expat.c:2512: error: `XML_Parser' undeclared (first use in this function)
Expat.c:2512: error: syntax error before "parser"
Expat.xs:2109: error: `cbv' undeclared (first use in this function)
Expat.xs:2109: error: syntax error before ')' token
Expat.xs:2110: error: `XML_StartCdataSectionHandler' undeclared (first use in th
is function)
Expat.xs:2115: error: `scdhndl' undeclared (first use in this function)
Expat.xs:2117: error: `parser' undeclared (first use in this function)
Expat.c: In function `XS_XML__Parser__Expat_SetEndCdataHandler':
Expat.c:2540: error: `XML_Parser' undeclared (first use in this function)
Expat.c:2540: error: syntax error before "parser"
Expat.xs:2127: error: `cbv' undeclared (first use in this function)
Expat.xs:2127: error: syntax error before ')' token
Expat.xs:2128: error: `XML_EndCdataSectionHandler' undeclared (first use in this
function)
Expat.xs:2133: error: `ecdhndl' undeclared (first use in this function)
Expat.xs:2135: error: `parser' undeclared (first use in this function)
Expat.c: In function `XS_XML__Parser__Expat_UnsetAllHandlers':
Expat.c:2568: error: `XML_Parser' undeclared (first use in this function)
Expat.c:2568: error: syntax error before "parser"
Expat.xs:2144: error: `cbv' undeclared (first use in this function)
Expat.xs:2144: error: syntax error before ')' token
Expat.xs:2149: error: `XML_StartNamespaceDeclHandler' undeclared (first use in t
his function)
Expat.xs:2149: error: syntax error before numeric constant
Expat.xs:2153: error: `parser' undeclared (first use in this function)
Expat.xs:2154: error: `XML_StartElementHandler' undeclared (first use in this fu
nction)
Expat.xs:2154: error: syntax error before numeric constant
Expat.xs:2158: error: `XML_UnknownEncodingHandler' undeclared (first use in this
function)
Expat.xs:2158: error: syntax error before numeric constant
Expat.c: In function `XS_XML__Parser__Expat_ElementIndex':
Expat.c:2600: error: `XML_Parser' undeclared (first use in this function)
Expat.c:2600: error: syntax error before "parser"
Expat.xs:2167: error: `cbv' undeclared (first use in this function)
Expat.xs:2167: error: syntax error before ')' token
Expat.c: In function `XS_XML__Parser__Expat_SkipUntil':
Expat.c:2621: error: `XML_Parser' undeclared (first use in this function)
Expat.c:2621: error: syntax error before "parser"
Expat.xs:2179: error: `cbv' undeclared (first use in this function)
Expat.xs:2179: error: syntax error before ')' token
Expat.c: In function `XS_XML__Parser__Expat_Do_External_Parse':
Expat.c:2643: error: `XML_Parser' undeclared (first use in this function)
Expat.c:2643: error: syntax error before "parser"
Expat.xs:2194: error: `cbv' undeclared (first use in this function)
Expat.xs:2194: error: syntax error before ')' token
Expat.xs:2197: error: `parser' undeclared (first use in this function)
make[1]: *** [Expat.o] Error 1
make[1]: Leaving directory `/root/.cpan/build/XML-Parser-2.34/Expat'
make: *** [subdirs] Error 2
/usr/bin/make -- NOT OK
Running make test
Can't test without successful make
Running make install
make had returned bad status, install seems impossible
raindance:/home/itrebal/gaim-2.0.0beta3#