All pastes #489269 Raw Edit

Unnamed

public text v1 · immutable
·published 2007-05-15 13:18 UTC
rendered paste body
>>> Unpacking source...
>>> Unpacking initng-ifiles-0.1.2.tar.bz2 to /var/tmp/portage/sys-apps/initng-ifiles-0.1.2/work
>>> Source unpacked.
>>> Compiling source in /var/tmp/portage/sys-apps/initng-ifiles-0.1.2/work/initng-ifiles-0.1.2 ...
-- Check for working C compiler: /usr/lib/ccache/bin/gcc
-- Check for working C compiler: /usr/lib/ccache/bin/gcc -- works
-- Check size of void*
-- Check size of void* - done
INSTALL_RUNLEVEL is selected, this will overwrite your existing system.virtual and default.runlevel file.
Make a backup of your existing files or run cmake with "-DINSTALL_RUNLEVELS=OFF"
-- Configuring done
-- Generating done
-- Build files have been written to: /var/tmp/portage/sys-apps/initng-ifiles-0.1.2/work/initng-ifiles-0.1.2
[  0%] Scanning dependencies of target install_service
Generating system.virtual
[  0%] Building C object tools/CMakeFiles/install_service.dir/install_service.o
make[2]: *** [system.virtual] Error 126
make[1]: *** [CMakeFiles/runlevel.dir/all] Error 2
make[1]: *** Waiting for unfinished jobs....
Linking C executable install_service
[  0%] Built target install_service
make: *** [all] Error 2

!!! ERROR: sys-apps/initng-ifiles-0.1.2 failed.
Call stack:
  ebuild.sh, line 1615:   Called dyn_compile
  ebuild.sh, line 972:   Called qa_call 'src_compile'
  ebuild.sh, line 44:   Called src_compile
  initng-ifiles-0.1.2.ebuild, line 131:   Called die

!!! (no error message)
!!! If you need support, post the topmost build error, and the call stack if relevant.
!!! A complete build log is located at '/var/tmp/portage/sys-apps/initng-ifiles-0.1.2/temp/build.log'.