make[4]: Entering directory `/home/florian/dev/openwrt/trunk/build_mipsel/sshfs-fuse-1.7'
if mipsel-linux-uclibc-gcc -DHAVE_CONFIG_H -I. -I. -I. -D_REENTRANT -DFUSE_USE_VERSION=26 -DLIBDIR=\"/usr/lib\" -I/home/florian/dev/openwrt/trunk/staging_dir_mipsel/usr/include -I/home/florian/dev/openwrt/trunk/staging_dir_mipsel/include -I/home/florian/dev/openwrt/trunk/staging_dir_mipsel/usr/include -I/home/florian/dev/openwrt/trunk/staging_dir_mipsel/include -D_FILE_OFFSET_BITS=64 -I/home/florian/dev/openwrt/trunk/staging_dir_mipsel/usr/lib/libintl/include -I/home/florian/dev/openwrt/trunk/staging_dir_mipsel/usr/lib/libiconv/include -I/home/florian/dev/openwrt/trunk/staging_dir_mipsel/usr/include/glib-2.0/ -I/home/florian/dev/openwrt/trunk/staging_dir_mipsel/usr/include/glib-2.0/glib/ -I/home/florian/dev/openwrt/trunk/staging_dir_mipsel/usr/lib/glib-2.0/include -I/home/florian/dev/openwrt/trunk/staging_dir_mipsel/usr/lib/glib/include/ -Os -pipe -mips32 -mtune=mips32 -funit-at-a-time -I/home/florian/dev/openwrt/trunk/staging_dir_mipsel/usr/include -I/home/florian/dev/openwrt/trunk/staging_dir_mipsel/include -Wall -W -Icompat -MT sshfs-sshfs.o -MD -MP -MF ".deps/sshfs-sshfs.Tpo" -c -o sshfs-sshfs.o `test -f 'sshfs.c' || echo './'`sshfs.c; \
then mv -f ".deps/sshfs-sshfs.Tpo" ".deps/sshfs-sshfs.Po"; else rm -f ".deps/sshfs-sshfs.Tpo"; exit 1; fi
In file included from /home/florian/dev/openwrt/trunk/staging_dir_mipsel/usr/include/glib-2.0/glib/galloca.h:30,
from /home/florian/dev/openwrt/trunk/staging_dir_mipsel/usr/include/glib-2.0/glib.h:30,
from sshfs.c:32:
/home/florian/dev/openwrt/trunk/staging_dir_mipsel/usr/include/glib-2.0/glib/gtypes.h:41: error: expected '=', ',', ';', 'asm' or '__attribute__' before 'typedef'
/home/florian/dev/openwrt/trunk/staging_dir_mipsel/usr/include/glib-2.0/glib/gtypes.h:90: error: expected '=', ',', ';', 'asm' or '__attribute__' before '*' token
In file included from /home/florian/dev/openwrt/trunk/staging_dir_mipsel/usr/include/glib-2.0/glib.h:31,
from sshfs.c:32:
/home/florian/dev/openwrt/trunk/staging_dir_mipsel/usr/include/glib-2.0/glib/garray.h:32: error: expected '=', ',', ';', 'asm' or '__attribute__' before 'G_BEGIN_DECLS'
/home/florian/dev/openwrt/trunk/staging_dir_mipsel/usr/include/glib-2.0/glib/garray.h:40: error: expected specifier-qualifier-list before 'gchar'
/home/florian/dev/openwrt/trunk/staging_dir_mipsel/usr/include/glib-2.0/glib/garray.h:66: error: expected '=', ',', ';', 'asm' or '__attribute__' before '*' token
/home/florian/dev/openwrt/trunk/staging_dir_mipsel/usr/include/glib-2.0/glib/garray.h:69: error: expected '=', ',', ';', 'asm' or '__attribute__' before '*' token
/home/florian/dev/openwrt/trunk/staging_dir_mipsel/usr/include/glib-2.0/glib/garray.h:73: error: expected '=', ',', ';', 'asm' or '__attribute__' before '*' token
/home/florian/dev/openwrt/trunk/staging_dir_mipsel/usr/include/glib-2.0/glib/garray.h:75: error: expected '=', ',', ';', 'asm' or '__attribute__' before '*' token
/home/florian/dev/openwrt/trunk/staging_dir_mipsel/usr/include/glib-2.0/glib/garray.h:78: error: expected '=', ',', ';', 'asm' or '__attribute__' before '*' token
/home/florian/dev/openwrt/trunk/staging_dir_mipsel/usr/include/glib-2.0/glib/garray.h:81: error: expected '=', ',', ';', 'asm' or '__attribute__' before '*' token
/home/florian/dev/openwrt/trunk/staging_dir_mipsel/usr/include/glib-2.0/glib/garray.h:85: error: expected '=', ',', ';', 'asm' or '__attribute__' before '*' token
/home/florian/dev/openwrt/trunk/staging_dir_mipsel/usr/include/glib-2.0/glib/garray.h:87: error: expected '=', ',', ';', 'asm' or '__attribute__' before '*' token
/home/florian/dev/openwrt/trunk/staging_dir_mipsel/usr/include/glib-2.0/glib/garray.h:89: error: expected '=', ',', ';', 'asm' or '__attribute__' before '*' token
/home/florian/dev/openwrt/trunk/staging_dir_mipsel/usr/include/glib-2.0/glib/garray.h:91: error: expected '=', ',', ';', 'asm' or '__attribute__' before '*' token
/home/florian/dev/openwrt/trunk/staging_dir_mipsel/usr/include/glib-2.0/glib/garray.h:94: error: expected ')' before '*' token
/home/florian/dev/openwrt/trunk/staging_dir_mipsel/usr/include/glib-2.0/glib/garray.h:96: error: expected ')' before '*' token
In file included from /home/florian/dev/openwrt/trunk/staging_dir_mipsel/usr/include/glib-2.0/glib/gerror.h:24,
from /home/florian/dev/openwrt/trunk/staging_dir_mipsel/usr/include/glib-2.0/glib/gthread.h:30,
from /home/florian/dev/openwrt/trunk/staging_dir_mipsel/usr/include/glib-2.0/glib/gasyncqueue.h:30,
from /home/florian/dev/openwrt/trunk/staging_dir_mipsel/usr/include/glib-2.0/glib.h:32,
from sshfs.c:32:
/home/florian/dev/openwrt/trunk/staging_dir_mipsel/usr/include/glib-2.0/glib/gquark.h:32: error: expected '=', ',', ';', 'asm' or '__attribute__' before 'G_BEGIN_DECLS'
/home/florian/dev/openwrt/trunk/staging_dir_mipsel/usr/include/glib-2.0/glib/gquark.h:38: error: expected '=', ',', ';', 'asm' or '__attribute__' before 'g_quark_try_string'
/home/florian/dev/openwrt/trunk/staging_dir_mipsel/usr/include/glib-2.0/glib/gquark.h:39: error: expected '=', ',', ';', 'asm' or '__attribute__' before 'g_quark_from_static_string'
/home/florian/dev/openwrt/trunk/staging_dir_mipsel/usr/include/glib-2.0/glib/gquark.h:40: error: expected '=', ',', ';', 'asm' or '__attribute__' before 'g_quark_from_string'
/home/florian/dev/openwrt/trunk/staging_dir_mipsel/usr/include/glib-2.0/glib/gquark.h:41: error: expected '=', ',', ';', 'asm' or '__attribute__' before 'gchar'
/home/florian/dev/openwrt/trunk/staging_dir_mipsel/usr/include/glib-2.0/glib/gquark.h:43: error: expected '=', ',', ';', 'asm' or '__attribute__' before 'gchar'
/home/florian/dev/openwrt/trunk/staging_dir_mipsel/usr/include/glib-2.0/glib/gquark.h:44: error: expected '=', ',', ';', 'asm' or '__attribute__' before 'gchar'
In file included from /home/florian/dev/openwrt/trunk/staging_dir_mipsel/usr/include/glib-2.0/glib/gthread.h:30,
from /home/florian/dev/openwrt/trunk/staging_dir_mipsel/usr/include/glib-2.0/glib/gasyncqueue.h:30,
from /home/florian/dev/openwrt/trunk/staging_dir_mipsel/usr/include/glib-2.0/glib.h:32,
from sshfs.c:32:
/home/florian/dev/openwrt/trunk/staging_dir_mipsel/usr/include/glib-2.0/glib/gerror.h:26: error: expected '=', ',', ';', 'asm' or '__attribute__' before 'G_BEGIN_DECLS'
/home/florian/dev/openwrt/trunk/staging_dir_mipsel/usr/include/glib-2.0/glib/gerror.h:32: error: expected specifier-qualifier-list before 'GQuark'
/home/florian/dev/openwrt/trunk/staging_dir_mipsel/usr/include/glib-2.0/glib/gerror.h:37: error: expected '=', ',', ';', 'asm' or '__attribute__' before '*' token
/home/florian/dev/openwrt/trunk/staging_dir_mipsel/usr/include/glib-2.0/glib/gerror.h:42: error: expected '=', ',', ';', 'asm' or '__attribute__' before '*' token
/home/florian/dev/openwrt/trunk/staging_dir_mipsel/usr/include/glib-2.0/glib/gerror.h:46: error: expected ')' before '*' token
/home/florian/dev/openwrt/trunk/staging_dir_mipsel/usr/include/glib-2.0/glib/gerror.h:47: error: expected '=', ',', ';', 'asm' or '__attribute__' before '*' token
/home/florian/dev/openwrt/trunk/staging_dir_mipsel/usr/include/glib-2.0/glib/gerror.h:49: warning: type defaults to 'int' in declaration of 'GError'
/home/florian/dev/openwrt/trunk/staging_dir_mipsel/usr/include/glib-2.0/glib/gerror.h:49: error: expected ';', ',' or ')' before '*' token
/home/florian/dev/openwrt/trunk/staging_dir_mipsel/usr/include/glib-2.0/glib/gerror.h:56: error: expected ')' before '*' token
/home/florian/dev/openwrt/trunk/staging_dir_mipsel/usr/include/glib-2.0/glib/gerror.h:64: error: expected ')' before '*' token
/home/florian/dev/openwrt/trunk/staging_dir_mipsel/usr/include/glib-2.0/glib/gerror.h:68: error: expected ')' before '*' token
In file included from /home/florian/dev/openwrt/trunk/staging_dir_mipsel/usr/include/glib-2.0/glib/gthread.h:32,
from /home/florian/dev/openwrt/trunk/staging_dir_mipsel/usr/include/glib-2.0/glib/gasyncqueue.h:30,
from /home/florian/dev/openwrt/trunk/staging_dir_mipsel/usr/include/glib-2.0/glib.h:32,
from sshfs.c:32:
/home/florian/dev/openwrt/trunk/staging_dir_mipsel/usr/include/glib-2.0/glib/gatomic.h:35: error: expected '=', ',', ';', 'asm' or '__attribute__' before 'G_BEGIN_DECLS'
In file included from /home/florian/dev/openwrt/trunk/staging_dir_mipsel/usr/include/glib-2.0/glib/gasyncqueue.h:30,
from /home/florian/dev/openwrt/trunk/staging_dir_mipsel/usr/include/glib-2.0/glib.h:32,
from sshfs.c:32:
/home/florian/dev/openwrt/trunk/staging_dir_mipsel/usr/include/glib-2.0/glib/gthread.h:34: error: expected '=', ',', ';', 'asm' or '__attribute__' before 'G_BEGIN_DECLS'
/home/florian/dev/openwrt/trunk/staging_dir_mipsel/usr/include/glib-2.0/glib/gthread.h:100: error: expected declaration specifiers or '...' before 'GError'
/home/florian/dev/openwrt/trunk/staging_dir_mipsel/usr/include/glib-2.0/glib/gthread.h:217: error: expected declaration specifiers or '...' before 'GError'
/home/florian/dev/openwrt/trunk/staging_dir_mipsel/usr/include/glib-2.0/glib/gthread.h:258: error: expected specifier-qualifier-list before 'GSystemThread'
In file included from /home/florian/dev/openwrt/trunk/staging_dir_mipsel/usr/include/glib-2.0/glib.h:32,
from sshfs.c:32:
/home/florian/dev/openwrt/trunk/staging_dir_mipsel/usr/include/glib-2.0/glib/gasyncqueue.h:32: error: expected '=', ',', ';', 'asm' or '__attribute__' before 'G_BEGIN_DECLS'
/home/florian/dev/openwrt/trunk/staging_dir_mipsel/usr/include/glib-2.0/glib/gasyncqueue.h:39: error: expected '=', ',', ';', 'asm' or '__attribute__' before '*' token
/home/florian/dev/openwrt/trunk/staging_dir_mipsel/usr/include/glib-2.0/glib/gasyncqueue.h:45: error: expected ')' before '*' token
/home/florian/dev/openwrt/trunk/staging_dir_mipsel/usr/include/glib-2.0/glib/gasyncqueue.h:46: error: expected ')' before '*' token
/home/florian/dev/openwrt/trunk/staging_dir_mipsel/usr/include/glib-2.0/glib/gasyncqueue.h:49: error: expected '=', ',', ';', 'asm' or '__attribute__' before '*' token
/home/florian/dev/openwrt/trunk/staging_dir_mipsel/usr/include/glib-2.0/glib/gasyncqueue.h:50: error: expected ')' before '*' token
/home/florian/dev/openwrt/trunk/staging_dir_mipsel/usr/include/glib-2.0/glib/gasyncqueue.h:54: error: expected ')' before '*' token
/home/florian/dev/openwrt/trunk/staging_dir_mipsel/usr/include/glib-2.0/glib/gasyncqueue.h:55: error: expected ')' before '*' token
/home/florian/dev/openwrt/trunk/staging_dir_mipsel/usr/include/glib-2.0/glib/gasyncqueue.h:59: error: expected ')' before '*' token
/home/florian/dev/openwrt/trunk/staging_dir_mipsel/usr/include/glib-2.0/glib/gasyncqueue.h:61: error: expected ')' before '*' token
/home/florian/dev/openwrt/trunk/staging_dir_mipsel/usr/include/glib-2.0/glib/gasyncqueue.h:64: error: expected ')' before '*' token
/home/florian/dev/openwrt/trunk/staging_dir_mipsel/usr/include/glib-2.0/glib/gasyncqueue.h:68: error: expected ')' before '*' token
/home/florian/dev/openwrt/trunk/staging_dir_mipsel/usr/include/glib-2.0/glib/gasyncqueue.h:76: error: expected ')' before '*' token
/home/florian/dev/openwrt/trunk/staging_dir_mipsel/usr/include/glib-2.0/glib/gasyncqueue.h:77: error: expected ')' before '*' token
/home/florian/dev/openwrt/trunk/staging_dir_mipsel/usr/include/glib-2.0/glib/gasyncqueue.h:80: error: expected ')' before '*' token
/home/florian/dev/openwrt/trunk/staging_dir_mipsel/usr/include/glib-2.0/glib/gasyncqueue.h:81: error: expected ')' before '*' token
/home/florian/dev/openwrt/trunk/staging_dir_mipsel/usr/include/glib-2.0/glib/gasyncqueue.h:88: error: expected ')' before '*' token
/home/florian/dev/openwrt/trunk/staging_dir_mipsel/usr/include/glib-2.0/glib/gasyncqueue.h:90: error: expected ')' before '*' token
/home/florian/dev/openwrt/trunk/staging_dir_mipsel/usr/include/glib-2.0/glib/gasyncqueue.h:100: error: expected ')' before '*' token
/home/florian/dev/openwrt/trunk/staging_dir_mipsel/usr/include/glib-2.0/glib/gasyncqueue.h:101: error: expected ')' before '*' token
/home/florian/dev/openwrt/trunk/staging_dir_mipsel/usr/include/glib-2.0/glib/gasyncqueue.h:102: error: expected ')' before '*' token
/home/florian/dev/openwrt/trunk/staging_dir_mipsel/usr/include/glib-2.0/glib/gasyncqueue.h:105: error: expected ')' before '*' token
/home/florian/dev/openwrt/trunk/staging_dir_mipsel/usr/include/glib-2.0/glib/gasyncqueue.h:110: error: expected ')' before '*' token
In file included from /home/florian/dev/openwrt/trunk/staging_dir_mipsel/usr/include/glib-2.0/glib.h:34,
from sshfs.c:32:
/home/florian/dev/openwrt/trunk/staging_dir_mipsel/usr/include/glib-2.0/glib/gbacktrace.h:32: error: expected '=', ',', ';', 'asm' or '__attribute__' before 'G_BEGIN_DECLS'
/home/florian/dev/openwrt/trunk/staging_dir_mipsel/usr/include/glib-2.0/glib/gbacktrace.h:44: warning: type defaults to 'int' in declaration of 'gchar'
/home/florian/dev/openwrt/trunk/staging_dir_mipsel/usr/include/glib-2.0/glib/gbacktrace.h:44: error: expected ';', ',' or ')' before '*' token
In file included from /home/florian/dev/openwrt/trunk/staging_dir_mipsel/usr/include/glib-2.0/glib.h:35,
from sshfs.c:32:
/home/florian/dev/openwrt/trunk/staging_dir_mipsel/usr/include/glib-2.0/glib/gbase64.h:26: error: expected '=', ',', ';', 'asm' or '__attribute__' before 'G_BEGIN_DECLS'
/home/florian/dev/openwrt/trunk/staging_dir_mipsel/usr/include/glib-2.0/glib/gbase64.h:34: error: expected '=', ',', ';', 'asm' or '__attribute__' before 'g_base64_encode_close'
/home/florian/dev/openwrt/trunk/staging_dir_mipsel/usr/include/glib-2.0/glib/gbase64.h:38: error: expected '=', ',', ';', 'asm' or '__attribute__' before '*' token
/home/florian/dev/openwrt/trunk/staging_dir_mipsel/usr/include/glib-2.0/glib/gbase64.h:40: error: expected '=', ',', ';', 'asm' or '__attribute__' before 'g_base64_decode_step'
/home/florian/dev/openwrt/trunk/staging_dir_mipsel/usr/include/glib-2.0/glib/gbase64.h:45: warning: type defaults to 'int' in declaration of 'gchar'
/home/florian/dev/openwrt/trunk/staging_dir_mipsel/usr/include/glib-2.0/glib/gbase64.h:45: error: expected ';', ',' or ')' before '*' token
In file included from /home/florian/dev/openwrt/trunk/staging_dir_mipsel/usr/include/glib-2.0/glib.h:36,
from sshfs.c:32:
/home/florian/dev/openwrt/trunk/staging_dir_mipsel/usr/include/glib-2.0/glib/gbookmarkfile.h:26: error: expected '=', ',', ';', 'asm' or '__attribute__' before 'G_BEGIN_DECLS'
/home/florian/dev/openwrt/trunk/staging_dir_mipsel/usr/include/glib-2.0/glib/gbookmarkfile.h:42: warning: data definition has no type or storage class
/home/florian/dev/openwrt/trunk/staging_dir_mipsel/usr/include/glib-2.0/glib/gbookmarkfile.h:42: warning: type defaults to 'int' in declaration of 'GBookmarkFileError'
/home/florian/dev/openwrt/trunk/staging_dir_mipsel/usr/include/glib-2.0/glib/gbookmarkfile.h:44: error: expected '=', ',', ';', 'asm' or '__attribute__' before 'g_bookmark_file_error_quark'
/home/florian/dev/openwrt/trunk/staging_dir_mipsel/usr/include/glib-2.0/glib/gbookmarkfile.h:55: warning: type defaults to 'int' in declaration of 'gchar'
/home/florian/dev/openwrt/trunk/staging_dir_mipsel/usr/include/glib-2.0/glib/gbookmarkfile.h:55: error: expected ';', ',' or ')' before '*' token
/home/florian/dev/openwrt/trunk/staging_dir_mipsel/usr/include/glib-2.0/glib/gbookmarkfile.h:58: warning: type defaults to 'int' in declaration of 'gchar'
/home/florian/dev/openwrt/trunk/staging_dir_mipsel/usr/include/glib-2.0/glib/gbookmarkfile.h:58: error: expected ';', ',' or ')' before '*' token
/home/florian/dev/openwrt/trunk/staging_dir_mipsel/usr/include/glib-2.0/glib/gbookmarkfile.h:62: warning: type defaults to 'int' in declaration of 'gchar'
/home/florian/dev/openwrt/trunk/staging_dir_mipsel/usr/include/glib-2.0/glib/gbookmarkfile.h:62: error: expected ';', ',' or ')' before '*' token
/home/florian/dev/openwrt/trunk/staging_dir_mipsel/usr/include/glib-2.0/glib/gbookmarkfile.h:65: error: expected '=', ',', ';', 'asm' or '__attribute__' before '*' token
/home/florian/dev/openwrt/trunk/staging_dir_mipsel/usr/include/glib-2.0/glib/gbookmarkfile.h:69: warning: type defaults to 'int' in declaration of 'gchar'
/home/florian/dev/openwrt/trunk/staging_dir_mipsel/usr/include/glib-2.0/glib/gbookmarkfile.h:69: error: expected ';', ',' or ')' before '*' token
/home/florian/dev/openwrt/trunk/staging_dir_mipsel/usr/include/glib-2.0/glib/gbookmarkfile.h:73: warning: type defaults to 'int' in declaration of 'gchar'
/home/florian/dev/openwrt/trunk/staging_dir_mipsel/usr/include/glib-2.0/glib/gbookmarkfile.h:73: error: expected ';', ',' or ')' before '*' token
/home/florian/dev/openwrt/trunk/staging_dir_mipsel/usr/include/glib-2.0/glib/gbookmarkfile.h:75: error: expected '=', ',', ';', 'asm' or '__attribute__' before '*' token
/home/florian/dev/openwrt/trunk/staging_dir_mipsel/usr/include/glib-2.0/glib/gbookmarkfile.h:79: warning: type defaults to 'int' in declaration of 'gchar'
/home/florian/dev/openwrt/trunk/staging_dir_mipsel/usr/include/glib-2.0/glib/gbookmarkfile.h:79: error: expected ';', ',' or ')' before '*' token
/home/florian/dev/openwrt/trunk/staging_dir_mipsel/usr/include/glib-2.0/glib/gbookmarkfile.h:81: error: expected '=', ',', ';', 'asm' or '__attribute__' before '*' token
/home/florian/dev/openwrt/trunk/staging_dir_mipsel/usr/include/glib-2.0/glib/gbookmarkfile.h:85: warning: type defaults to 'int' in declaration of 'gchar'
/home/florian/dev/openwrt/trunk/staging_dir_mipsel/usr/include/glib-2.0/glib/gbookmarkfile.h:85: error: expected ';', ',' or ')' before '*' token
/home/florian/dev/openwrt/trunk/staging_dir_mipsel/usr/include/glib-2.0/glib/gbookmarkfile.h:87: error: expected '=', ',', ';', 'asm' or '__attribute__' before '*' token
/home/florian/dev/openwrt/trunk/staging_dir_mipsel/usr/include/glib-2.0/glib/gbookmarkfile.h:91: warning: type defaults to 'int' in declaration of 'gchar'
/home/florian/dev/openwrt/trunk/staging_dir_mipsel/usr/include/glib-2.0/glib/gbookmarkfile.h:91: error: expected ';', ',' or ')' before '*' token
/home/florian/dev/openwrt/trunk/staging_dir_mipsel/usr/include/glib-2.0/glib/gbookmarkfile.h:95: warning: type defaults to 'int' in declaration of 'gchar'
/home/florian/dev/openwrt/trunk/staging_dir_mipsel/usr/include/glib-2.0/glib/gbookmarkfile.h:95: error: expected ';', ',' or ')' before '*' token
/home/florian/dev/openwrt/trunk/staging_dir_mipsel/usr/include/glib-2.0/glib/gbookmarkfile.h:98: warning: type defaults to 'int' in declaration of 'gchar'
/home/florian/dev/openwrt/trunk/staging_dir_mipsel/usr/include/glib-2.0/glib/gbookmarkfile.h:98: error: expected ';', ',' or ')' before '*' token
/home/florian/dev/openwrt/trunk/staging_dir_mipsel/usr/include/glib-2.0/glib/gbookmarkfile.h:101: error: expected '=', ',', ';', 'asm' or '__attribute__' before '*' token
/home/florian/dev/openwrt/trunk/staging_dir_mipsel/usr/include/glib-2.0/glib/gbookmarkfile.h:106: warning: type defaults to 'int' in declaration of 'gchar'
/home/florian/dev/openwrt/trunk/staging_dir_mipsel/usr/include/glib-2.0/glib/gbookmarkfile.h:106: error: expected ';', ',' or ')' before '*' token
/home/florian/dev/openwrt/trunk/staging_dir_mipsel/usr/include/glib-2.0/glib/gbookmarkfile.h:110: warning: type defaults to 'int' in declaration of 'gchar'
/home/florian/dev/openwrt/trunk/staging_dir_mipsel/usr/include/glib-2.0/glib/gbookmarkfile.h:110: error: expected ';', ',' or ')' before '*' token
/home/florian/dev/openwrt/trunk/staging_dir_mipsel/usr/include/glib-2.0/glib/gbookmarkfile.h:113: error: expected '=', ',', ';', 'asm' or '__attribute__' before '*' token
/home/florian/dev/openwrt/trunk/staging_dir_mipsel/usr/include/glib-2.0/glib/gbookmarkfile.h:118: warning: type defaults to 'int' in declaration of 'gchar'
/home/florian/dev/openwrt/trunk/staging_dir_mipsel/usr/include/glib-2.0/glib/gbookmarkfile.h:118: error: expected ';', ',' or ')' before '*' token
/home/florian/dev/openwrt/trunk/staging_dir_mipsel/usr/include/glib-2.0/glib/gbookmarkfile.h:125: warning: type defaults to 'int' in declaration of 'gchar'
/home/florian/dev/openwrt/trunk/staging_dir_mipsel/usr/include/glib-2.0/glib/gbookmarkfile.h:125: error: expected ';', ',' or ')' before '*' token
/home/florian/dev/openwrt/trunk/staging_dir_mipsel/usr/include/glib-2.0/glib/gbookmarkfile.h:132: warning: type defaults to 'int' in declaration of 'gchar'
/home/florian/dev/openwrt/trunk/staging_dir_mipsel/usr/include/glib-2.0/glib/gbookmarkfile.h:132: error: expected ';', ',' or ')' before '*' token
/home/florian/dev/openwrt/trunk/staging_dir_mipsel/usr/include/glib-2.0/glib/gbookmarkfile.h:135: warning: type defaults to 'int' in declaration of 'gchar'
/home/florian/dev/openwrt/trunk/staging_dir_mipsel/usr/include/glib-2.0/glib/gbookmarkfile.h:135: error: expected ';', ',' or ')' before '*' token
/home/florian/dev/openwrt/trunk/staging_dir_mipsel/usr/include/glib-2.0/glib/gbookmarkfile.h:138: warning: type defaults to 'int' in declaration of 'gchar'
/home/florian/dev/openwrt/trunk/staging_dir_mipsel/usr/include/glib-2.0/glib/gbookmarkfile.h:138: error: expected ';', ',' or ')' before '*' token
/home/florian/dev/openwrt/trunk/staging_dir_mipsel/usr/include/glib-2.0/glib/gbookmarkfile.h:142: warning: type defaults to 'int' in declaration of 'gchar'
/home/florian/dev/openwrt/trunk/staging_dir_mipsel/usr/include/glib-2.0/glib/gbookmarkfile.h:142: error: expected ';', ',' or ')' before '*' token
/home/florian/dev/openwrt/trunk/staging_dir_mipsel/usr/include/glib-2.0/glib/gbookmarkfile.h:147: warning: type defaults to 'int' in declaration of 'gchar'
/home/florian/dev/openwrt/trunk/staging_dir_mipsel/usr/include/glib-2.0/glib/gbookmarkfile.h:147: error: expected ';', ',' or ')' before '*' token
/home/florian/dev/openwrt/trunk/staging_dir_mipsel/usr/include/glib-2.0/glib/gbookmarkfile.h:150: warning: type defaults to 'int' in declaration of 'gchar'
/home/florian/dev/openwrt/trunk/staging_dir_mipsel/usr/include/glib-2.0/glib/gbookmarkfile.h:150: error: expected ';', ',' or ')' before '*' token
/home/florian/dev/openwrt/trunk/staging_dir_mipsel/usr/include/glib-2.0/glib/gbookmarkfile.h:153: warning: type defaults to 'int' in declaration of 'gchar'
/home/florian/dev/openwrt/trunk/staging_dir_mipsel/usr/include/glib-2.0/glib/gbookmarkfile.h:153: error: expected ';', ',' or ')' before '*' token
/home/florian/dev/openwrt/trunk/staging_dir_mipsel/usr/include/glib-2.0/glib/gbookmarkfile.h:156: warning: type defaults to 'int' in declaration of 'gchar'
/home/florian/dev/openwrt/trunk/staging_dir_mipsel/usr/include/glib-2.0/glib/gbookmarkfile.h:156: error: expected ';', ',' or ')' before '*' token
/home/florian/dev/openwrt/trunk/staging_dir_mipsel/usr/include/glib-2.0/glib/gbookmarkfile.h:159: warning: type defaults to 'int' in declaration of 'gchar'
/home/florian/dev/openwrt/trunk/staging_dir_mipsel/usr/include/glib-2.0/glib/gbookmarkfile.h:159: error: expected ';', ',' or ')' before '*' token
/home/florian/dev/openwrt/trunk/staging_dir_mipsel/usr/include/glib-2.0/glib/gbookmarkfile.h:162: warning: type defaults to 'int' in declaration of 'gchar'
/home/florian/dev/openwrt/trunk/staging_dir_mipsel/usr/include/glib-2.0/glib/gbookmarkfile.h:162: error: expected ';', ',' or ')' before '*' token
/home/florian/dev/openwrt/trunk/staging_dir_mipsel/usr/include/glib-2.0/glib/gbookmarkfile.h:165: warning: type defaults to 'int' in declaration of 'gchar'
/home/florian/dev/openwrt/trunk/staging_dir_mipsel/usr/include/glib-2.0/glib/gbookmarkfile.h:165: error: expected ';', ',' or ')' before '*' token
/home/florian/dev/openwrt/trunk/staging_dir_mipsel/usr/include/glib-2.0/glib/gbookmarkfile.h:167: error: expected '=', ',', ';', 'asm' or '__attribute__' before '*' token
/home/florian/dev/openwrt/trunk/staging_dir_mipsel/usr/include/glib-2.0/glib/gbookmarkfile.h:170: warning: type defaults to 'int' in declaration of 'gchar'
/home/florian/dev/openwrt/trunk/staging_dir_mipsel/usr/include/glib-2.0/glib/gbookmarkfile.h:170: error: expected ';', ',' or ')' before '*' token
/home/florian/dev/openwrt/trunk/staging_dir_mipsel/usr/include/glib-2.0/glib/gbookmarkfile.h:174: warning: type defaults to 'int' in declaration of 'gchar'
/home/florian/dev/openwrt/trunk/staging_dir_mipsel/usr/include/glib-2.0/glib/gbookmarkfile.h:174: error: expected ';', ',' or ')' before '*' token
/home/florian/dev/openwrt/trunk/staging_dir_mipsel/usr/include/glib-2.0/glib/gbookmarkfile.h:178: warning: type defaults to 'int' in declaration of 'gchar'
/home/florian/dev/openwrt/trunk/staging_dir_mipsel/usr/include/glib-2.0/glib/gbookmarkfile.h:178: error: expected ';', ',' or ')' before '*' token
/home/florian/dev/openwrt/trunk/staging_dir_mipsel/usr/include/glib-2.0/glib/gbookmarkfile.h:181: warning: type defaults to 'int' in declaration of 'gchar'
/home/florian/dev/openwrt/trunk/staging_dir_mipsel/usr/include/glib-2.0/glib/gbookmarkfile.h:181: error: expected ';', ',' or ')' before '*' token
In file included from /home/florian/dev/openwrt/trunk/staging_dir_mipsel/usr/include/glib-2.0/glib/gmem.h:30,
from /home/florian/dev/openwrt/trunk/staging_dir_mipsel/usr/include/glib-2.0/glib/glist.h:30,
from /home/florian/dev/openwrt/trunk/staging_dir_mipsel/usr/include/glib-2.0/glib/gcache.h:30,
from /home/florian/dev/openwrt/trunk/staging_dir_mipsel/usr/include/glib-2.0/glib.h:37,
from sshfs.c:32:
/home/florian/dev/openwrt/trunk/staging_dir_mipsel/usr/include/glib-2.0/glib/gslice.h:28: error: expected '=', ',', ';', 'asm' or '__attribute__' before 'G_BEGIN_DECLS'
/home/florian/dev/openwrt/trunk/staging_dir_mipsel/usr/include/glib-2.0/glib/gslice.h:33: error: expected ')' before 'block_size'
/home/florian/dev/openwrt/trunk/staging_dir_mipsel/usr/include/glib-2.0/glib/gslice.h:34: error: expected ')' before 'block_size'
/home/florian/dev/openwrt/trunk/staging_dir_mipsel/usr/include/glib-2.0/glib/gslice.h:36: error: expected ')' before 'block_size'
In file included from /home/florian/dev/openwrt/trunk/staging_dir_mipsel/usr/include/glib-2.0/glib/glist.h:30,
from /home/florian/dev/openwrt/trunk/staging_dir_mipsel/usr/include/glib-2.0/glib/gcache.h:30,
from /home/florian/dev/openwrt/trunk/staging_dir_mipsel/usr/include/glib-2.0/glib.h:37,
from sshfs.c:32:
/home/florian/dev/openwrt/trunk/staging_dir_mipsel/usr/include/glib-2.0/glib/gmem.h:33: error: expected '=', ',', ';', 'asm' or '__attribute__' before 'G_BEGIN_DECLS'
/home/florian/dev/openwrt/trunk/staging_dir_mipsel/usr/include/glib-2.0/glib/gmem.h: In function 'g_malloc':
/home/florian/dev/openwrt/trunk/staging_dir_mipsel/usr/include/glib-2.0/glib/gmem.h:47: error: expected declaration specifiers before 'G_GNUC_MALLOC'
/home/florian/dev/openwrt/trunk/staging_dir_mipsel/usr/include/glib-2.0/glib/gmem.h:48: error: expected '=', ',', ';', 'asm' or '__attribute__' before 'G_GNUC_MALLOC'
/home/florian/dev/openwrt/trunk/staging_dir_mipsel/usr/include/glib-2.0/glib/gmem.h:50: error: expected '=', ',', ';', 'asm' or '__attribute__' before 'G_GNUC_WARN_UNUSED_RESULT'
/home/florian/dev/openwrt/trunk/staging_dir_mipsel/usr/include/glib-2.0/glib/gmem.h:52: error: expected '=', ',', ';', 'asm' or '__attribute__' before 'G_GNUC_MALLOC'
/home/florian/dev/openwrt/trunk/staging_dir_mipsel/usr/include/glib-2.0/glib/gmem.h:53: error: expected '=', ',', ';', 'asm' or '__attribute__' before 'G_GNUC_MALLOC'
/home/florian/dev/openwrt/trunk/staging_dir_mipsel/usr/include/glib-2.0/glib/gmem.h:55: error: expected '=', ',', ';', 'asm' or '__attribute__' before 'G_GNUC_WARN_UNUSED_RESULT'
/home/florian/dev/openwrt/trunk/staging_dir_mipsel/usr/include/glib-2.0/glib/gmem.h:81: error: expected ')' before 'n_bytes'
/home/florian/dev/openwrt/trunk/staging_dir_mipsel/usr/include/glib-2.0/glib/gmem.h:82: error: expected ';' before 'gpointer'
/home/florian/dev/openwrt/trunk/staging_dir_mipsel/usr/include/glib-2.0/glib/gmem.h:91: warning: empty declaration
/home/florian/dev/openwrt/trunk/staging_dir_mipsel/usr/include/glib-2.0/glib/gmem.h:92: error: expected ')' before '*' token
/home/florian/dev/openwrt/trunk/staging_dir_mipsel/usr/include/glib-2.0/glib/gmem.h:95: error: storage class specified for parameter 'g_mem_gc_friendly'
/home/florian/dev/openwrt/trunk/staging_dir_mipsel/usr/include/glib-2.0/glib/gmem.h:99: error: expected '=', ',', ';', 'asm' or '__attribute__' before '*' token
/home/florian/dev/openwrt/trunk/staging_dir_mipsel/usr/include/glib-2.0/glib/gmem.h:105: error: storage class specified for parameter 'GAllocator'
/home/florian/dev/openwrt/trunk/staging_dir_mipsel/usr/include/glib-2.0/glib/gmem.h:106: error: storage class specified for parameter 'GMemChunk'
/home/florian/dev/openwrt/trunk/staging_dir_mipsel/usr/include/glib-2.0/glib/gmem.h:124: error: expected declaration specifiers before 'GMemChunk'
/home/florian/dev/openwrt/trunk/staging_dir_mipsel/usr/include/glib-2.0/glib/gmem.h:128: error: expected ')' before '*' token
/home/florian/dev/openwrt/trunk/staging_dir_mipsel/usr/include/glib-2.0/glib/gmem.h:129: error: expected ')' before '*' token
/home/florian/dev/openwrt/trunk/staging_dir_mipsel/usr/include/glib-2.0/glib/gmem.h:130: error: expected ')' before '*' token
/home/florian/dev/openwrt/trunk/staging_dir_mipsel/usr/include/glib-2.0/glib/gmem.h:131: error: expected ')' before '*' token
/home/florian/dev/openwrt/trunk/staging_dir_mipsel/usr/include/glib-2.0/glib/gmem.h:133: error: expected ')' before '*' token
/home/florian/dev/openwrt/trunk/staging_dir_mipsel/usr/include/glib-2.0/glib/gmem.h:134: error: expected ')' before '*' token
/home/florian/dev/openwrt/trunk/staging_dir_mipsel/usr/include/glib-2.0/glib/gmem.h:135: error: expected ')' before '*' token
/home/florian/dev/openwrt/trunk/staging_dir_mipsel/usr/include/glib-2.0/glib/gmem.h:138: error: expected declaration specifiers before 'GAllocator'
/home/florian/dev/openwrt/trunk/staging_dir_mipsel/usr/include/glib-2.0/glib/gmem.h:140: error: expected ')' before '*' token
/home/florian/dev/openwrt/trunk/staging_dir_mipsel/usr/include/glib-2.0/glib/gmem.h:146: error: expected declaration specifiers before 'G_END_DECLS'
In file included from /home/florian/dev/openwrt/trunk/staging_dir_mipsel/usr/include/glib-2.0/glib/gcache.h:30,
from /home/florian/dev/openwrt/trunk/staging_dir_mipsel/usr/include/glib-2.0/glib.h:37,
from sshfs.c:32:
/home/florian/dev/openwrt/trunk/staging_dir_mipsel/usr/include/glib-2.0/glib/glist.h:39: error: expected specifier-qualifier-list before 'GList'
/home/florian/dev/openwrt/trunk/staging_dir_mipsel/usr/include/glib-2.0/glib/glist.h:41: warning: empty declaration
/home/florian/dev/openwrt/trunk/staging_dir_mipsel/usr/include/glib-2.0/glib/glist.h:45: error: expected declaration specifiers before 'GList'
/home/florian/dev/openwrt/trunk/staging_dir_mipsel/usr/include/glib-2.0/glib/glist.h:46: error: expected ')' before '*' token
/home/florian/dev/openwrt/trunk/staging_dir_mipsel/usr/include/glib-2.0/glib/glist.h:47: error: expected ')' before '*' token
/home/florian/dev/openwrt/trunk/staging_dir_mipsel/usr/include/glib-2.0/glib/glist.h:49: error: expected declaration specifiers before 'GList'
/home/florian/dev/openwrt/trunk/staging_dir_mipsel/usr/include/glib-2.0/glib/glist.h:51: error: expected declaration specifiers before 'GList'
/home/florian/dev/openwrt/trunk/staging_dir_mipsel/usr/include/glib-2.0/glib/glist.h:53: error: expected declaration specifiers before 'GList'
/home/florian/dev/openwrt/trunk/staging_dir_mipsel/usr/include/glib-2.0/glib/glist.h:56: error: expected declaration specifiers before 'GList'
/home/florian/dev/openwrt/trunk/staging_dir_mipsel/usr/include/glib-2.0/glib/glist.h:59: error: expected declaration specifiers before 'GList'
/home/florian/dev/openwrt/trunk/staging_dir_mipsel/usr/include/glib-2.0/glib/glist.h:63: error: expected declaration specifiers before 'GList'
/home/florian/dev/openwrt/trunk/staging_dir_mipsel/usr/include/glib-2.0/glib/glist.h:66: error: expected declaration specifiers before 'GList'
/home/florian/dev/openwrt/trunk/staging_dir_mipsel/usr/include/glib-2.0/glib/glist.h:68: error: expected declaration specifiers before 'GList'
/home/florian/dev/openwrt/trunk/staging_dir_mipsel/usr/include/glib-2.0/glib/glist.h:70: error: expected declaration specifiers before 'GList'
/home/florian/dev/openwrt/trunk/staging_dir_mipsel/usr/include/glib-2.0/glib/glist.h:72: error: expected declaration specifiers before 'GList'
/home/florian/dev/openwrt/trunk/staging_dir_mipsel/usr/include/glib-2.0/glib/glist.h:74: error: expected declaration specifiers before 'GList'
/home/florian/dev/openwrt/trunk/staging_dir_mipsel/usr/include/glib-2.0/glib/glist.h:76: error: expected declaration specifiers before 'GList'
/home/florian/dev/openwrt/trunk/staging_dir_mipsel/usr/include/glib-2.0/glib/glist.h:77: error: expected declaration specifiers before 'GList'
/home/florian/dev/openwrt/trunk/staging_dir_mipsel/usr/include/glib-2.0/glib/glist.h:78: error: expected declaration specifiers before 'GList'
/home/florian/dev/openwrt/trunk/staging_dir_mipsel/usr/include/glib-2.0/glib/glist.h:80: error: expected declaration specifiers before 'GList'
/home/florian/dev/openwrt/trunk/staging_dir_mipsel/usr/include/glib-2.0/glib/glist.h:82: error: expected declaration specifiers before 'GList'
/home/florian/dev/openwrt/trunk/staging_dir_mipsel/usr/include/glib-2.0/glib/glist.h:84: error: expected declaration specifiers before 'GList'
/home/florian/dev/openwrt/trunk/staging_dir_mipsel/usr/include/glib-2.0/glib/glist.h:87: error: expected ')' before '*' token
/home/florian/dev/openwrt/trunk/staging_dir_mipsel/usr/include/glib-2.0/glib/glist.h:89: error: expected ')' before '*' token
/home/florian/dev/openwrt/trunk/staging_dir_mipsel/usr/include/glib-2.0/glib/glist.h:91: error: expected declaration specifiers before 'GList'
/home/florian/dev/openwrt/trunk/staging_dir_mipsel/usr/include/glib-2.0/glib/glist.h:92: error: expected declaration specifiers before 'GList'
/home/florian/dev/openwrt/trunk/staging_dir_mipsel/usr/include/glib-2.0/glib/glist.h:93: error: expected ')' before '*' token
/home/florian/dev/openwrt/trunk/staging_dir_mipsel/usr/include/glib-2.0/glib/glist.h:94: error: expected ')' before '*' token
/home/florian/dev/openwrt/trunk/staging_dir_mipsel/usr/include/glib-2.0/glib/glist.h:97: error: expected declaration specifiers before 'GList'
/home/florian/dev/openwrt/trunk/staging_dir_mipsel/usr/include/glib-2.0/glib/glist.h:99: error: expected declaration specifiers before 'GList'
/home/florian/dev/openwrt/trunk/staging_dir_mipsel/usr/include/glib-2.0/glib/glist.h:102: error: expected ')' before '*' token
/home/florian/dev/openwrt/trunk/staging_dir_mipsel/usr/include/glib-2.0/glib/glist.h:113: error: expected declaration specifiers before 'G_END_DECLS'
In file included from /home/florian/dev/openwrt/trunk/staging_dir_mipsel/usr/include/glib-2.0/glib.h:37,
from sshfs.c:32:
/home/florian/dev/openwrt/trunk/staging_dir_mipsel/usr/include/glib-2.0/glib/gcache.h:36: error: storage class specified for parameter 'GCacheNewFunc'
/home/florian/dev/openwrt/trunk/staging_dir_mipsel/usr/include/glib-2.0/glib/gcache.h:37: error: storage class specified for parameter 'GCacheDupFunc'
/home/florian/dev/openwrt/trunk/staging_dir_mipsel/usr/include/glib-2.0/glib/gcache.h:38: error: storage class specified for parameter 'GCacheDestroyFunc'
/home/florian/dev/openwrt/trunk/staging_dir_mipsel/usr/include/glib-2.0/glib/gcache.h:42: error: expected declaration specifiers before 'GCache'
/home/florian/dev/openwrt/trunk/staging_dir_mipsel/usr/include/glib-2.0/glib/gcache.h:49: error: expected ')' before '*' token
/home/florian/dev/openwrt/trunk/staging_dir_mipsel/usr/include/glib-2.0/glib/gcache.h:50: error: expected ')' before '*' token
/home/florian/dev/openwrt/trunk/staging_dir_mipsel/usr/include/glib-2.0/glib/gcache.h:52: error: expected ')' before '*' token
/home/florian/dev/openwrt/trunk/staging_dir_mipsel/usr/include/glib-2.0/glib/gcache.h:54: error: expected ')' before '*' token
/home/florian/dev/openwrt/trunk/staging_dir_mipsel/usr/include/glib-2.0/glib/gcache.h:58: error: expected ')' before '*' token
/home/florian/dev/openwrt/trunk/staging_dir_mipsel/usr/include/glib-2.0/glib/gcache.h:63: error: expected declaration specifiers before 'G_END_DECLS'
In file included from /home/florian/dev/openwrt/trunk/staging_dir_mipsel/usr/include/glib-2.0/glib.h:38,
from sshfs.c:32:
/home/florian/dev/openwrt/trunk/staging_dir_mipsel/usr/include/glib-2.0/glib/gcompletion.h:36: error: expected '=', ',', ';', 'asm' or '__attribute__' before '*' token
/home/florian/dev/openwrt/trunk/staging_dir_mipsel/usr/include/glib-2.0/glib/gcompletion.h:41: warning: type defaults to 'int' in declaration of 'gchar'
/home/florian/dev/openwrt/trunk/staging_dir_mipsel/usr/include/glib-2.0/glib/gcompletion.h:41: error: expected ';', ',' or ')' before '*' token
/home/florian/dev/openwrt/trunk/staging_dir_mipsel/usr/include/glib-2.0/glib/gcompletion.h:47: error: expected specifier-qualifier-list before 'GList'
/home/florian/dev/openwrt/trunk/staging_dir_mipsel/usr/include/glib-2.0/glib/gcompletion.h:53: warning: empty declaration
/home/florian/dev/openwrt/trunk/staging_dir_mipsel/usr/include/glib-2.0/glib/gcompletion.h:55: error: expected declaration specifiers before 'GCompletion'
/home/florian/dev/openwrt/trunk/staging_dir_mipsel/usr/include/glib-2.0/glib/gcompletion.h:56: error: expected ')' before '*' token
/home/florian/dev/openwrt/trunk/staging_dir_mipsel/usr/include/glib-2.0/glib/gcompletion.h:58: error: expected ')' before '*' token
/home/florian/dev/openwrt/trunk/staging_dir_mipsel/usr/include/glib-2.0/glib/gcompletion.h:60: error: expected ')' before '*' token
/home/florian/dev/openwrt/trunk/staging_dir_mipsel/usr/include/glib-2.0/glib/gcompletion.h:61: error: expected declaration specifiers before 'GList'
/home/florian/dev/openwrt/trunk/staging_dir_mipsel/usr/include/glib-2.0/glib/gcompletion.h:64: error: expected declaration specifiers before 'GList'
/home/florian/dev/openwrt/trunk/staging_dir_mipsel/usr/include/glib-2.0/glib/gcompletion.h:67: error: expected ')' before '*' token
/home/florian/dev/openwrt/trunk/staging_dir_mipsel/usr/include/glib-2.0/glib/gcompletion.h:69: error: expected ')' before '*' token
/home/florian/dev/openwrt/trunk/staging_dir_mipsel/usr/include/glib-2.0/glib/gcompletion.h:71: error: expected declaration specifiers before 'G_END_DECLS'
In file included from /home/florian/dev/openwrt/trunk/staging_dir_mipsel/usr/include/glib-2.0/glib.h:39,
from sshfs.c:32:
/home/florian/dev/openwrt/trunk/staging_dir_mipsel/usr/include/glib-2.0/glib/gconvert.h:33: error: expected declaration specifiers before 'G_BEGIN_DECLS'
/home/florian/dev/openwrt/trunk/staging_dir_mipsel/usr/include/glib-2.0/glib/gconvert.h:43: error: expected declaration specifiers before 'GConvertError'
/home/florian/dev/openwrt/trunk/staging_dir_mipsel/usr/include/glib-2.0/glib/gconvert.h:46: error: expected declaration specifiers before 'GQuark'
/home/florian/dev/openwrt/trunk/staging_dir_mipsel/usr/include/glib-2.0/glib/gconvert.h:50: error: storage class specified for parameter 'GIConv'
/home/florian/dev/openwrt/trunk/staging_dir_mipsel/usr/include/glib-2.0/glib/gconvert.h:52: error: expected declaration specifiers before 'GIConv'
/home/florian/dev/openwrt/trunk/staging_dir_mipsel/usr/include/glib-2.0/glib/gconvert.h:54: error: expected ')' before 'converter'
/home/florian/dev/openwrt/trunk/staging_dir_mipsel/usr/include/glib-2.0/glib/gconvert.h:59: error: expected ')' before 'converter'
/home/florian/dev/openwrt/trunk/staging_dir_mipsel/usr/include/glib-2.0/glib/gconvert.h:62: error: expected declaration specifiers before 'gchar'
/home/florian/dev/openwrt/trunk/staging_dir_mipsel/usr/include/glib-2.0/glib/gconvert.h:69: error: expected declaration specifiers before 'gchar'
/home/florian/dev/openwrt/trunk/staging_dir_mipsel/usr/include/glib-2.0/glib/gconvert.h:75: error: expected declaration specifiers before 'gchar'
/home/florian/dev/openwrt/trunk/staging_dir_mipsel/usr/include/glib-2.0/glib/gconvert.h:87: error: expected declaration specifiers before 'gchar'
/home/florian/dev/openwrt/trunk/staging_dir_mipsel/usr/include/glib-2.0/glib/gconvert.h:92: error: expected declaration specifiers before 'gchar'
/home/florian/dev/openwrt/trunk/staging_dir_mipsel/usr/include/glib-2.0/glib/gconvert.h:108: error: expected declaration specifiers before 'gchar'
/home/florian/dev/openwrt/trunk/staging_dir_mipsel/usr/include/glib-2.0/glib/gconvert.h:113: error: expected declaration specifiers before 'gchar'
/home/florian/dev/openwrt/trunk/staging_dir_mipsel/usr/include/glib-2.0/glib/gconvert.h:119: error: expected declaration specifiers before 'gchar'
/home/florian/dev/openwrt/trunk/staging_dir_mipsel/usr/include/glib-2.0/glib/gconvert.h:123: error: expected declaration specifiers before 'gchar'
/home/florian/dev/openwrt/trunk/staging_dir_mipsel/usr/include/glib-2.0/glib/gconvert.h:126: error: expected declaration specifiers before 'gchar'
/home/florian/dev/openwrt/trunk/staging_dir_mipsel/usr/include/glib-2.0/glib/gconvert.h:127: error: expected ')' before 'gchar'
/home/florian/dev/openwrt/trunk/staging_dir_mipsel/usr/include/glib-2.0/glib/gconvert.h:129: error: expected declaration specifiers before 'gchar'
/home/florian/dev/openwrt/trunk/staging_dir_mipsel/usr/include/glib-2.0/glib/gconvert.h:131: error: expected declaration specifiers before 'gchar'
/home/florian/dev/openwrt/trunk/staging_dir_mipsel/usr/include/glib-2.0/glib/gconvert.h:133: error: expected declaration specifiers before 'G_END_DECLS'
In file included from /home/florian/dev/openwrt/trunk/staging_dir_mipsel/usr/include/glib-2.0/glib.h:40,
from sshfs.c:32:
/home/florian/dev/openwrt/trunk/staging_dir_mipsel/usr/include/glib-2.0/glib/gdataset.h:36: error: expected ')' before 'key_id'
/home/florian/dev/openwrt/trunk/staging_dir_mipsel/usr/include/glib-2.0/glib/gdataset.h:42: error: expected ')' before '*' token
/home/florian/dev/openwrt/trunk/staging_dir_mipsel/usr/include/glib-2.0/glib/gdataset.h:43: error: expected ')' before '*' token
/home/florian/dev/openwrt/trunk/staging_dir_mipsel/usr/include/glib-2.0/glib/gdataset.h:44: error: expected ')' before '*' token
/home/florian/dev/openwrt/trunk/staging_dir_mipsel/usr/include/glib-2.0/glib/gdataset.h:46: error: expected ')' before '*' token
/home/florian/dev/openwrt/trunk/staging_dir_mipsel/usr/include/glib-2.0/glib/gdataset.h:50: error: expected ')' before '*' token
/home/florian/dev/openwrt/trunk/staging_dir_mipsel/usr/include/glib-2.0/glib/gdataset.h:52: error: expected ')' before '*' token
/home/florian/dev/openwrt/trunk/staging_dir_mipsel/usr/include/glib-2.0/glib/gdataset.h:65: error: expected ')' before '*' token
/home/florian/dev/openwrt/trunk/staging_dir_mipsel/usr/include/glib-2.0/glib/gdataset.h:67: error: expected ')' before '*' token
/home/florian/dev/openwrt/trunk/staging_dir_mipsel/usr/include/glib-2.0/glib/gdataset.h:69: error: expected ')' before '*' token
/home/florian/dev/openwrt/trunk/staging_dir_mipsel/usr/include/glib-2.0/glib/gdataset.h:91: error: expected declaration specifiers or '...' before 'GQuark'
/home/florian/dev/openwrt/trunk/staging_dir_mipsel/usr/include/glib-2.0/glib/gdataset.h:93: error: expected declaration specifiers or '...' before 'GQuark'
/home/florian/dev/openwrt/trunk/staging_dir_mipsel/usr/include/glib-2.0/glib/gdataset.h:97: error: expected declaration specifiers or '...' before 'GQuark'
/home/florian/dev/openwrt/trunk/staging_dir_mipsel/usr/include/glib-2.0/glib/gdataset.h:99: error: expected declaration specifiers or '...' before 'GDataForeachFunc'
/home/florian/dev/openwrt/trunk/staging_dir_mipsel/usr/include/glib-2.0/glib/gdataset.h:116: error: expected declaration specifiers before 'G_END_DECLS'
In file included from /home/florian/dev/openwrt/trunk/staging_dir_mipsel/usr/include/glib-2.0/glib.h:41,
from sshfs.c:32:
/home/florian/dev/openwrt/trunk/staging_dir_mipsel/usr/include/glib-2.0/glib/gdate.h:47: error: storage class specified for parameter 'GDateYear'
/home/florian/dev/openwrt/trunk/staging_dir_mipsel/usr/include/glib-2.0/glib/gdate.h:48: error: storage class specified for parameter 'GDateDay'
/home/florian/dev/openwrt/trunk/staging_dir_mipsel/usr/include/glib-2.0/glib/gdate.h:49: error: storage class specified for parameter 'GDate'
/home/florian/dev/openwrt/trunk/staging_dir_mipsel/usr/include/glib-2.0/glib/gdate.h:51: warning: empty declaration
/home/florian/dev/openwrt/trunk/staging_dir_mipsel/usr/include/glib-2.0/glib/gdate.h:59: error: storage class specified for parameter 'GDateDMY'
/home/florian/dev/openwrt/trunk/staging_dir_mipsel/usr/include/glib-2.0/glib/gdate.h:72: error: storage class specified for parameter 'GDateWeekday'
/home/florian/dev/openwrt/trunk/staging_dir_mipsel/usr/include/glib-2.0/glib/gdate.h:88: error: storage class specified for parameter 'GDateMonth'
/home/florian/dev/openwrt/trunk/staging_dir_mipsel/usr/include/glib-2.0/glib/gdate.h:114: warning: empty declaration
/home/florian/dev/openwrt/trunk/staging_dir_mipsel/usr/include/glib-2.0/glib/gdate.h:120: error: expected declaration specifiers before 'GDate'
/home/florian/dev/openwrt/trunk/staging_dir_mipsel/usr/include/glib-2.0/glib/gdate.h:121: error: expected declaration specifiers before 'GDate'
/home/florian/dev/openwrt/trunk/staging_dir_mipsel/usr/include/glib-2.0/glib/gdate.h:124: error: expected declaration specifiers before 'GDate'
/home/florian/dev/openwrt/trunk/staging_dir_mipsel/usr/include/glib-2.0/glib/gdate.h:125: error: expected ')' before '*' token
/home/florian/dev/openwrt/trunk/staging_dir_mipsel/usr/include/glib-2.0/glib/gdate.h:132: warning: type defaults to 'int' in declaration of 'GDate'
/home/florian/dev/openwrt/trunk/staging_dir_mipsel/usr/include/glib-2.0/glib/gdate.h:132: error: expected ';', ',' or ')' before '*' token
/home/florian/dev/openwrt/trunk/staging_dir_mipsel/usr/include/glib-2.0/glib/gdate.h:133: error: expected ')' before 'day'
/home/florian/dev/openwrt/trunk/staging_dir_mipsel/usr/include/glib-2.0/glib/gdate.h:134: error: expected ')' before 'month'
/home/florian/dev/openwrt/trunk/staging_dir_mipsel/usr/include/glib-2.0/glib/gdate.h:135: error: expected ')' before 'year'
/home/florian/dev/openwrt/trunk/staging_dir_mipsel/usr/include/glib-2.0/glib/gdate.h:136: error: expected ')' before 'weekday'
/home/florian/dev/openwrt/trunk/staging_dir_mipsel/usr/include/glib-2.0/glib/gdate.h:137: error: expected '=', ',', ';', 'asm' or '__attribute__' before 'G_GNUC_CONST'
/home/florian/dev/openwrt/trunk/staging_dir_mipsel/usr/include/glib-2.0/glib/gdate.h:138: error: expected ')' before 'day'
/home/florian/dev/openwrt/trunk/staging_dir_mipsel/usr/include/glib-2.0/glib/gdate.h:142: error: expected declaration specifiers before 'GDateWeekday'
/home/florian/dev/openwrt/trunk/staging_dir_mipsel/usr/include/glib-2.0/glib/gdate.h:143: error: expected declaration specifiers before 'GDateMonth'
/home/florian/dev/openwrt/trunk/staging_dir_mipsel/usr/include/glib-2.0/glib/gdate.h:144: error: expected declaration specifiers before 'GDateYear'
/home/florian/dev/openwrt/trunk/staging_dir_mipsel/usr/include/glib-2.0/glib/gdate.h:145: error: expected declaration specifiers before 'GDateDay'
/home/florian/dev/openwrt/trunk/staging_dir_mipsel/usr/include/glib-2.0/glib/gdate.h:146: warning: type defaults to 'int' in declaration of 'GDate'
/home/florian/dev/openwrt/trunk/staging_dir_mipsel/usr/include/glib-2.0/glib/gdate.h:146: error: expected ';', ',' or ')' before '*' token
/home/florian/dev/openwrt/trunk/staging_dir_mipsel/usr/include/glib-2.0/glib/gdate.h:147: warning: type defaults to 'int' in declaration of 'GDate'
/home/florian/dev/openwrt/trunk/staging_dir_mipsel/usr/include/glib-2.0/glib/gdate.h:147: error: expected ';', ',' or ')' before '*' token
/home/florian/dev/openwrt/trunk/staging_dir_mipsel/usr/include/glib-2.0/glib/gdate.h:154: warning: type defaults to 'int' in declaration of 'GDate'
/home/florian/dev/openwrt/trunk/staging_dir_mipsel/usr/include/glib-2.0/glib/gdate.h:154: error: expected ';', ',' or ')' before '*' token
/home/florian/dev/openwrt/trunk/staging_dir_mipsel/usr/include/glib-2.0/glib/gdate.h:155: warning: type defaults to 'int' in declaration of 'GDate'
/home/florian/dev/openwrt/trunk/staging_dir_mipsel/usr/include/glib-2.0/glib/gdate.h:155: error: expected ';', ',' or ')' before '*' token
/home/florian/dev/openwrt/trunk/staging_dir_mipsel/usr/include/glib-2.0/glib/gdate.h:156: warning: type defaults to 'int' in declaration of 'GDate'
/home/florian/dev/openwrt/trunk/staging_dir_mipsel/usr/include/glib-2.0/glib/gdate.h:156: error: expected ';', ',' or ')' before '*' token
/home/florian/dev/openwrt/trunk/staging_dir_mipsel/usr/include/glib-2.0/glib/gdate.h:162: error: expected ')' before '*' token
/home/florian/dev/openwrt/trunk/staging_dir_mipsel/usr/include/glib-2.0/glib/gdate.h:169: error: expected ')' before '*' token
/home/florian/dev/openwrt/trunk/staging_dir_mipsel/usr/include/glib-2.0/glib/gdate.h:171: error: expected ')' before '*' token
/home/florian/dev/openwrt/trunk/staging_dir_mipsel/usr/include/glib-2.0/glib/gdate.h:173: error: expected ')' before '*' token
/home/florian/dev/openwrt/trunk/staging_dir_mipsel/usr/include/glib-2.0/glib/gdate.h:176: error: expected ')' before '*' token
/home/florian/dev/openwrt/trunk/staging_dir_mipsel/usr/include/glib-2.0/glib/gdate.h:179: error: expected ')' before '*' token
/home/florian/dev/openwrt/trunk/staging_dir_mipsel/usr/include/glib-2.0/glib/gdate.h:181: error: expected ')' before '*' token
/home/florian/dev/openwrt/trunk/staging_dir_mipsel/usr/include/glib-2.0/glib/gdate.h:183: error: expected ')' before '*' token
/home/florian/dev/openwrt/trunk/staging_dir_mipsel/usr/include/glib-2.0/glib/gdate.h:185: error: expected ')' before '*' token
/home/florian/dev/openwrt/trunk/staging_dir_mipsel/usr/include/glib-2.0/glib/gdate.h:189: error: expected ')' before '*' token
/home/florian/dev/openwrt/trunk/staging_dir_mipsel/usr/include/glib-2.0/glib/gdate.h:191: warning: type defaults to 'int' in declaration of 'GDate'
/home/florian/dev/openwrt/trunk/staging_dir_mipsel/usr/include/glib-2.0/glib/gdate.h:191: error: expected ';', ',' or ')' before '*' token
/home/florian/dev/openwrt/trunk/staging_dir_mipsel/usr/include/glib-2.0/glib/gdate.h:192: warning: type defaults to 'int' in declaration of 'GDate'
/home/florian/dev/openwrt/trunk/staging_dir_mipsel/usr/include/glib-2.0/glib/gdate.h:192: error: expected ';', ',' or ')' before '*' token
/home/florian/dev/openwrt/trunk/staging_dir_mipsel/usr/include/glib-2.0/glib/gdate.h:195: error: expected ')' before '*' token
/home/florian/dev/openwrt/trunk/staging_dir_mipsel/usr/include/glib-2.0/glib/gdate.h:197: error: expected ')' before '*' token
/home/florian/dev/openwrt/trunk/staging_dir_mipsel/usr/include/glib-2.0/glib/gdate.h:201: error: expected ')' before '*' token
/home/florian/dev/openwrt/trunk/staging_dir_mipsel/usr/include/glib-2.0/glib/gdate.h:203: error: expected ')' before '*' token
/home/florian/dev/openwrt/trunk/staging_dir_mipsel/usr/include/glib-2.0/glib/gdate.h:207: error: expected ')' before '*' token
/home/florian/dev/openwrt/trunk/staging_dir_mipsel/usr/include/glib-2.0/glib/gdate.h:209: error: expected ')' before '*' token
/home/florian/dev/openwrt/trunk/staging_dir_mipsel/usr/include/glib-2.0/glib/gdate.h:211: error: expected ')' before 'year'
/home/florian/dev/openwrt/trunk/staging_dir_mipsel/usr/include/glib-2.0/glib/gdate.h:212: error: expected ')' before 'month'
/home/florian/dev/openwrt/trunk/staging_dir_mipsel/usr/include/glib-2.0/glib/gdate.h:214: error: expected ')' before 'year'
/home/florian/dev/openwrt/trunk/staging_dir_mipsel/usr/include/glib-2.0/glib/gdate.h:215: error: expected ')' before 'year'
/home/florian/dev/openwrt/trunk/staging_dir_mipsel/usr/include/glib-2.0/glib/gdate.h:219: warning: type defaults to 'int' in declaration of 'GDate'
/home/florian/dev/openwrt/trunk/staging_dir_mipsel/usr/include/glib-2.0/glib/gdate.h:219: error: expected ';', ',' or ')' before '*' token
/home/florian/dev/openwrt/trunk/staging_dir_mipsel/usr/include/glib-2.0/glib/gdate.h:223: warning: type defaults to 'int' in declaration of 'GDate'
/home/florian/dev/openwrt/trunk/staging_dir_mipsel/usr/include/glib-2.0/glib/gdate.h:223: error: expected ';', ',' or ')' before '*' token
/home/florian/dev/openwrt/trunk/staging_dir_mipsel/usr/include/glib-2.0/glib/gdate.h:225: warning: type defaults to 'int' in declaration of 'GDate'
/home/florian/dev/openwrt/trunk/staging_dir_mipsel/usr/include/glib-2.0/glib/gdate.h:225: error: expected ';', ',' or ')' before '*' token
/home/florian/dev/openwrt/trunk/staging_dir_mipsel/usr/include/glib-2.0/glib/gdate.h:228: error: expected ')' before '*' token
/home/florian/dev/openwrt/trunk/staging_dir_mipsel/usr/include/glib-2.0/glib/gdate.h:233: error: expected ')' before '*' token
/home/florian/dev/openwrt/trunk/staging_dir_mipsel/usr/include/glib-2.0/glib/gdate.h:238: error: expected declaration specifiers before 'gsize'
/home/florian/dev/openwrt/trunk/staging_dir_mipsel/usr/include/glib-2.0/glib/gdate.h:259: error: expected declaration specifiers before 'G_END_DECLS'
In file included from /home/florian/dev/openwrt/trunk/staging_dir_mipsel/usr/include/glib-2.0/glib.h:42,
from sshfs.c:32:
/home/florian/dev/openwrt/trunk/staging_dir_mipsel/usr/include/glib-2.0/glib/gdir.h:38: error: expected declaration specifiers before 'GDir'
/home/florian/dev/openwrt/trunk/staging_dir_mipsel/usr/include/glib-2.0/glib/gdir.h:41: error: expected declaration specifiers before 'G_CONST_RETURN'
/home/florian/dev/openwrt/trunk/staging_dir_mipsel/usr/include/glib-2.0/glib/gdir.h:42: error: expected ')' before '*' token
/home/florian/dev/openwrt/trunk/staging_dir_mipsel/usr/include/glib-2.0/glib/gdir.h:43: error: expected ')' before '*' token
/home/florian/dev/openwrt/trunk/staging_dir_mipsel/usr/include/glib-2.0/glib/gdir.h:45: error: expected declaration specifiers before 'G_END_DECLS'
In file included from /home/florian/dev/openwrt/trunk/staging_dir_mipsel/usr/include/glib-2.0/glib.h:44,
from sshfs.c:32:
/home/florian/dev/openwrt/trunk/staging_dir_mipsel/usr/include/glib-2.0/glib/gfileutils.h:57: error: expected declaration specifiers before 'GFileError'
/home/florian/dev/openwrt/trunk/staging_dir_mipsel/usr/include/glib-2.0/glib/gfileutils.h:70: error: storage class specified for parameter 'GFileTest'
/home/florian/dev/openwrt/trunk/staging_dir_mipsel/usr/include/glib-2.0/glib/gfileutils.h:72: error: expected declaration specifiers before 'GQuark'
/home/florian/dev/openwrt/trunk/staging_dir_mipsel/usr/include/glib-2.0/glib/gfileutils.h:74: error: expected declaration specifiers before 'GFileError'
/home/florian/dev/openwrt/trunk/staging_dir_mipsel/usr/include/glib-2.0/glib/gfileutils.h:83: warning: type defaults to 'int' in declaration of 'gchar'
/home/florian/dev/openwrt/trunk/staging_dir_mipsel/usr/include/glib-2.0/glib/gfileutils.h:83: error: expected ';', ',' or ')' before '*' token
/home/florian/dev/openwrt/trunk/staging_dir_mipsel/usr/include/glib-2.0/glib/gfileutils.h:85: warning: type defaults to 'int' in declaration of 'gchar'
/home/florian/dev/openwrt/trunk/staging_dir_mipsel/usr/include/glib-2.0/glib/gfileutils.h:85: error: expected ';', ',' or ')' before '*' token
/home/florian/dev/openwrt/trunk/staging_dir_mipsel/usr/include/glib-2.0/glib/gfileutils.h:89: warning: type defaults to 'int' in declaration of 'gchar'
/home/florian/dev/openwrt/trunk/staging_dir_mipsel/usr/include/glib-2.0/glib/gfileutils.h:89: error: expected ';', ',' or ')' before '*' token
/home/florian/dev/openwrt/trunk/staging_dir_mipsel/usr/include/glib-2.0/glib/gfileutils.h:93: error: expected declaration specifiers before 'gchar'
/home/florian/dev/openwrt/trunk/staging_dir_mipsel/usr/include/glib-2.0/glib/gfileutils.h:97: error: expected ')' before '*' token
/home/florian/dev/openwrt/trunk/staging_dir_mipsel/usr/include/glib-2.0/glib/gfileutils.h:100: warning: type defaults to 'int' in declaration of 'gchar'
/home/florian/dev/openwrt/trunk/staging_dir_mipsel/usr/include/glib-2.0/glib/gfileutils.h:100: error: expected ';', ',' or ')' before '*' token
/home/florian/dev/openwrt/trunk/staging_dir_mipsel/usr/include/glib-2.0/glib/gfileutils.h:104: error: expected declaration specifiers before 'gchar'
/home/florian/dev/openwrt/trunk/staging_dir_mipsel/usr/include/glib-2.0/glib/gfileutils.h:107: error: expected declaration specifiers before 'gchar'
/home/florian/dev/openwrt/trunk/staging_dir_mipsel/usr/include/glib-2.0/glib/gfileutils.h:110: error: expected declaration specifiers before 'gchar'
/home/florian/dev/openwrt/trunk/staging_dir_mipsel/usr/include/glib-2.0/glib/gfileutils.h:112: error: expected declaration specifiers before 'gchar'
/home/florian/dev/openwrt/trunk/staging_dir_mipsel/usr/include/glib-2.0/glib/gfileutils.h:114: warning: type defaults to 'int' in declaration of 'gchar'
/home/florian/dev/openwrt/trunk/staging_dir_mipsel/usr/include/glib-2.0/glib/gfileutils.h:114: error: expected ';', ',' or ')' before '*' token
/home/florian/dev/openwrt/trunk/staging_dir_mipsel/usr/include/glib-2.0/glib/gfileutils.h:117: error: expected declaration specifiers before 'G_END_DECLS'
In file included from /home/florian/dev/openwrt/trunk/staging_dir_mipsel/usr/include/glib-2.0/glib.h:45,
from sshfs.c:32:
/home/florian/dev/openwrt/trunk/staging_dir_mipsel/usr/include/glib-2.0/glib/ghash.h:38: error: storage class specified for parameter 'GHRFunc'
/home/florian/dev/openwrt/trunk/staging_dir_mipsel/usr/include/glib-2.0/glib/ghash.h:42: error: expected declaration specifiers before 'GHashTable'
/home/florian/dev/openwrt/trunk/staging_dir_mipsel/usr/include/glib-2.0/glib/ghash.h:44: error: expected declaration specifiers before 'GHashTable'
/home/florian/dev/openwrt/trunk/staging_dir_mipsel/usr/include/glib-2.0/glib/ghash.h:48: error: expected ')' before '*' token
/home/florian/dev/openwrt/trunk/staging_dir_mipsel/usr/include/glib-2.0/glib/ghash.h:49: error: expected ')' before '*' token
/home/florian/dev/openwrt/trunk/staging_dir_mipsel/usr/include/glib-2.0/glib/ghash.h:52: error: expected ')' before '*' token
/home/florian/dev/openwrt/trunk/staging_dir_mipsel/usr/include/glib-2.0/glib/ghash.h:55: error: expected ')' before '*' token
/home/florian/dev/openwrt/trunk/staging_dir_mipsel/usr/include/glib-2.0/glib/ghash.h:57: error: expected ')' before '*' token
/home/florian/dev/openwrt/trunk/staging_dir_mipsel/usr/include/glib-2.0/glib/ghash.h:58: error: expected ')' before '*' token
/home/florian/dev/openwrt/trunk/staging_dir_mipsel/usr/include/glib-2.0/glib/ghash.h:60: error: expected ')' before '*' token
/home/florian/dev/openwrt/trunk/staging_dir_mipsel/usr/include/glib-2.0/glib/ghash.h:61: error: expected ')' before '*' token
/home/florian/dev/openwrt/trunk/staging_dir_mipsel/usr/include/glib-2.0/glib/ghash.h:63: error: expected ')' before '*' token
/home/florian/dev/openwrt/trunk/staging_dir_mipsel/usr/include/glib-2.0/glib/ghash.h:67: error: expected ')' before '*' token
/home/florian/dev/openwrt/trunk/staging_dir_mipsel/usr/include/glib-2.0/glib/ghash.h:70: error: expected ')' before '*' token
/home/florian/dev/openwrt/trunk/staging_dir_mipsel/usr/include/glib-2.0/glib/ghash.h:73: error: expected ')' before '*' token
/home/florian/dev/openwrt/trunk/staging_dir_mipsel/usr/include/glib-2.0/glib/ghash.h:76: error: expected ')' before '*' token
/home/florian/dev/openwrt/trunk/staging_dir_mipsel/usr/include/glib-2.0/glib/ghash.h:79: error: expected ')' before '*' token
/home/florian/dev/openwrt/trunk/staging_dir_mipsel/usr/include/glib-2.0/glib/ghash.h:82: error: expected declaration specifiers before 'GHashTable'
/home/florian/dev/openwrt/trunk/staging_dir_mipsel/usr/include/glib-2.0/glib/ghash.h:83: error: expected ')' before '*' token
/home/florian/dev/openwrt/trunk/staging_dir_mipsel/usr/include/glib-2.0/glib/ghash.h:110: error: expected '=', ',', ';', 'asm' or '__attribute__' before 'G_GNUC_CONST'
/home/florian/dev/openwrt/trunk/staging_dir_mipsel/usr/include/glib-2.0/glib/ghash.h:112: error: expected '=', ',', ';', 'asm' or '__attribute__' before 'G_GNUC_CONST'
/home/florian/dev/openwrt/trunk/staging_dir_mipsel/usr/include/glib-2.0/glib/ghash.h:114: error: expected declaration specifiers before 'G_END_DECLS'
In file included from /home/florian/dev/openwrt/trunk/staging_dir_mipsel/usr/include/glib-2.0/glib.h:46,
from sshfs.c:32:
/home/florian/dev/openwrt/trunk/staging_dir_mipsel/usr/include/glib-2.0/glib/ghook.h:37: error: storage class specified for parameter 'GHookList'
/home/florian/dev/openwrt/trunk/staging_dir_mipsel/usr/include/glib-2.0/glib/ghook.h:39: error: expected ')' before '*' token
/home/florian/dev/openwrt/trunk/staging_dir_mipsel/usr/include/glib-2.0/glib/ghook.h:41: error: expected ')' before '*' token
/home/florian/dev/openwrt/trunk/staging_dir_mipsel/usr/include/glib-2.0/glib/ghook.h:43: error: expected ')' before '*' token
/home/florian/dev/openwrt/trunk/staging_dir_mipsel/usr/include/glib-2.0/glib/ghook.h:45: error: expected ')' before '*' token
/home/florian/dev/openwrt/trunk/staging_dir_mipsel/usr/include/glib-2.0/glib/ghook.h:47: error: storage class specified for parameter 'GHookFunc'
/home/florian/dev/openwrt/trunk/staging_dir_mipsel/usr/include/glib-2.0/glib/ghook.h:48: error: storage class specified for parameter 'GHookCheckFunc'
/home/florian/dev/openwrt/trunk/staging_dir_mipsel/usr/include/glib-2.0/glib/ghook.h:49: error: expected ')' before '*' token
/home/florian/dev/openwrt/trunk/staging_dir_mipsel/usr/include/glib-2.0/glib/ghook.h:56: error: storage class specified for parameter 'GHookFlagMask'
/home/florian/dev/openwrt/trunk/staging_dir_mipsel/usr/include/glib-2.0/glib/ghook.h:66: error: expected specifier-qualifier-list before 'GHook'
/home/florian/dev/openwrt/trunk/staging_dir_mipsel/usr/include/glib-2.0/glib/ghook.h:70: warning: empty declaration
/home/florian/dev/openwrt/trunk/staging_dir_mipsel/usr/include/glib-2.0/glib/ghook.h:74: error: expected specifier-qualifier-list before 'GHook'
/home/florian/dev/openwrt/trunk/staging_dir_mipsel/usr/include/glib-2.0/glib/ghook.h:81: warning: empty declaration
/home/florian/dev/openwrt/trunk/staging_dir_mipsel/usr/include/glib-2.0/glib/ghook.h:102: error: expected ')' before '*' token
/home/florian/dev/openwrt/trunk/staging_dir_mipsel/usr/include/glib-2.0/glib/ghook.h:104: error: expected ')' before '*' token
/home/florian/dev/openwrt/trunk/staging_dir_mipsel/usr/include/glib-2.0/glib/ghook.h:105: error: expected declaration specifiers before 'GHook'
/home/florian/dev/openwrt/trunk/staging_dir_mipsel/usr/include/glib-2.0/glib/ghook.h:106: error: expected ')' before '*' token
/home/florian/dev/openwrt/trunk/staging_dir_mipsel/usr/include/glib-2.0/glib/ghook.h:108: error: expected declaration specifiers before 'GHook'
/home/florian/dev/openwrt/trunk/staging_dir_mipsel/usr/include/glib-2.0/glib/ghook.h:110: error: expected ')' before '*' token
/home/florian/dev/openwrt/trunk/staging_dir_mipsel/usr/include/glib-2.0/glib/ghook.h:112: error: expected ')' before '*' token
/home/florian/dev/openwrt/trunk/staging_dir_mipsel/usr/include/glib-2.0/glib/ghook.h:114: error: expected ')' before '*' token
/home/florian/dev/openwrt/trunk/staging_dir_mipsel/usr/include/glib-2.0/glib/ghook.h:116: error: expected ')' before '*' token
/home/florian/dev/openwrt/trunk/staging_dir_mipsel/usr/include/glib-2.0/glib/ghook.h:118: error: expected ')' before '*' token
/home/florian/dev/openwrt/trunk/staging_dir_mipsel/usr/include/glib-2.0/glib/ghook.h:121: error: expected ')' before '*' token
/home/florian/dev/openwrt/trunk/staging_dir_mipsel/usr/include/glib-2.0/glib/ghook.h:124: error: expected declaration specifiers before 'GHook'
/home/florian/dev/openwrt/trunk/staging_dir_mipsel/usr/include/glib-2.0/glib/ghook.h:126: error: expected declaration specifiers before 'GHook'
/home/florian/dev/openwrt/trunk/staging_dir_mipsel/usr/include/glib-2.0/glib/ghook.h:130: error: expected declaration specifiers before 'GHook'
/home/florian/dev/openwrt/trunk/staging_dir_mipsel/usr/include/glib-2.0/glib/ghook.h:133: error: expected declaration specifiers before 'GHook'
/home/florian/dev/openwrt/trunk/staging_dir_mipsel/usr/include/glib-2.0/glib/ghook.h:136: error: expected declaration specifiers before 'GHook'
/home/florian/dev/openwrt/trunk/staging_dir_mipsel/usr/include/glib-2.0/glib/ghook.h:141: error: expected declaration specifiers before 'GHook'
/home/florian/dev/openwrt/trunk/staging_dir_mipsel/usr/include/glib-2.0/glib/ghook.h:146: error: expected declaration specifiers before 'GHook'
/home/florian/dev/openwrt/trunk/staging_dir_mipsel/usr/include/glib-2.0/glib/ghook.h:150: error: expected ')' before '*' token
/home/florian/dev/openwrt/trunk/staging_dir_mipsel/usr/include/glib-2.0/glib/ghook.h:157: error: expected ')' before '*' token
/home/florian/dev/openwrt/trunk/staging_dir_mipsel/usr/include/glib-2.0/glib/ghook.h:162: error: expected ')' before '*' token
/home/florian/dev/openwrt/trunk/staging_dir_mipsel/usr/include/glib-2.0/glib/ghook.h:166: error: expected ')' before '*' token
/home/florian/dev/openwrt/trunk/staging_dir_mipsel/usr/include/glib-2.0/glib/ghook.h:170: error: expected ')' before '*' token
/home/florian/dev/openwrt/trunk/staging_dir_mipsel/usr/include/glib-2.0/glib/ghook.h:175: error: expected declaration specifiers before 'G_END_DECLS'
In file included from /home/florian/dev/openwrt/trunk/staging_dir_mipsel/usr/include/glib-2.0/glib/gmain.h:23,
from /home/florian/dev/openwrt/trunk/staging_dir_mipsel/usr/include/glib-2.0/glib/giochannel.h:31,
from /home/florian/dev/openwrt/trunk/staging_dir_mipsel/usr/include/glib-2.0/glib.h:47,
from sshfs.c:32:
/home/florian/dev/openwrt/trunk/staging_dir_mipsel/usr/include/glib-2.0/glib/gslist.h:39: error: expected specifier-qualifier-list before 'GSList'
/home/florian/dev/openwrt/trunk/staging_dir_mipsel/usr/include/glib-2.0/glib/gslist.h:40: warning: empty declaration
/home/florian/dev/openwrt/trunk/staging_dir_mipsel/usr/include/glib-2.0/glib/gslist.h:44: error: expected declaration specifiers before 'GSList'
/home/florian/dev/openwrt/trunk/staging_dir_mipsel/usr/include/glib-2.0/glib/gslist.h:45: error: expected ')' before '*' token
/home/florian/dev/openwrt/trunk/staging_dir_mipsel/usr/include/glib-2.0/glib/gslist.h:46: error: expected ')' before '*' token
/home/florian/dev/openwrt/trunk/staging_dir_mipsel/usr/include/glib-2.0/glib/gslist.h:48: error: expected declaration specifiers before 'GSList'
/home/florian/dev/openwrt/trunk/staging_dir_mipsel/usr/include/glib-2.0/glib/gslist.h:50: error: expected declaration specifiers before 'GSList'
/home/florian/dev/openwrt/trunk/staging_dir_mipsel/usr/include/glib-2.0/glib/gslist.h:52: error: expected declaration specifiers before 'GSList'
/home/florian/dev/openwrt/trunk/staging_dir_mipsel/usr/include/glib-2.0/glib/gslist.h:55: error: expected declaration specifiers before 'GSList'
/home/florian/dev/openwrt/trunk/staging_dir_mipsel/usr/include/glib-2.0/glib/gslist.h:58: error: expected declaration specifiers before 'GSList'
/home/florian/dev/openwrt/trunk/staging_dir_mipsel/usr/include/glib-2.0/glib/gslist.h:62: error: expected declaration specifiers before 'GSList'
/home/florian/dev/openwrt/trunk/staging_dir_mipsel/usr/include/glib-2.0/glib/gslist.h:65: error: expected declaration specifiers before 'GSList'
/home/florian/dev/openwrt/trunk/staging_dir_mipsel/usr/include/glib-2.0/glib/gslist.h:67: error: expected declaration specifiers before 'GSList'
/home/florian/dev/openwrt/trunk/staging_dir_mipsel/usr/include/glib-2.0/glib/gslist.h:69: error: expected declaration specifiers before 'GSList'
/home/florian/dev/openwrt/trunk/staging_dir_mipsel/usr/include/glib-2.0/glib/gslist.h:71: error: expected declaration specifiers before 'GSList'
/home/florian/dev/openwrt/trunk/staging_dir_mipsel/usr/include/glib-2.0/glib/gslist.h:73: error: expected declaration specifiers before 'GSList'
/home/florian/dev/openwrt/trunk/staging_dir_mipsel/usr/include/glib-2.0/glib/gslist.h:75: error: expected declaration specifiers before 'GSList'
/home/florian/dev/openwrt/trunk/staging_dir_mipsel/usr/include/glib-2.0/glib/gslist.h:76: error: expected declaration specifiers before 'GSList'
/home/florian/dev/openwrt/trunk/staging_dir_mipsel/usr/include/glib-2.0/glib/gslist.h:77: error: expected declaration specifiers before 'GSList'
/home/florian/dev/openwrt/trunk/staging_dir_mipsel/usr/include/glib-2.0/glib/gslist.h:79: error: expected declaration specifiers before 'GSList'
/home/florian/dev/openwrt/trunk/staging_dir_mipsel/usr/include/glib-2.0/glib/gslist.h:81: error: expected declaration specifiers before 'GSList'
/home/florian/dev/openwrt/trunk/staging_dir_mipsel/usr/include/glib-2.0/glib/gslist.h:84: error: expected ')' before '*' token
/home/florian/dev/openwrt/trunk/staging_dir_mipsel/usr/include/glib-2.0/glib/gslist.h:86: error: expected ')' before '*' token
/home/florian/dev/openwrt/trunk/staging_dir_mipsel/usr/include/glib-2.0/glib/gslist.h:88: error: expected declaration specifiers before 'GSList'
/home/florian/dev/openwrt/trunk/staging_dir_mipsel/usr/include/glib-2.0/glib/gslist.h:89: error: expected ')' before '*' token
/home/florian/dev/openwrt/trunk/staging_dir_mipsel/usr/include/glib-2.0/glib/gslist.h:90: error: expected ')' before '*' token
/home/florian/dev/openwrt/trunk/staging_dir_mipsel/usr/include/glib-2.0/glib/gslist.h:93: error: expected declaration specifiers before 'GSList'
/home/florian/dev/openwrt/trunk/staging_dir_mipsel/usr/include/glib-2.0/glib/gslist.h:95: error: expected declaration specifiers before 'GSList'
/home/florian/dev/openwrt/trunk/staging_dir_mipsel/usr/include/glib-2.0/glib/gslist.h:98: error: expected ')' before '*' token
/home/florian/dev/openwrt/trunk/staging_dir_mipsel/usr/include/glib-2.0/glib/gslist.h:107: error: expected declaration specifiers before 'G_END_DECLS'
In file included from /home/florian/dev/openwrt/trunk/staging_dir_mipsel/usr/include/glib-2.0/glib/giochannel.h:31,
from /home/florian/dev/openwrt/trunk/staging_dir_mipsel/usr/include/glib-2.0/glib.h:47,
from sshfs.c:32:
/home/florian/dev/openwrt/trunk/staging_dir_mipsel/usr/include/glib-2.0/glib/gmain.h:29: error: storage class specified for parameter 'GMainLoop'
/home/florian/dev/openwrt/trunk/staging_dir_mipsel/usr/include/glib-2.0/glib/gmain.h:30: error: storage class specified for parameter 'GSource'
/home/florian/dev/openwrt/trunk/staging_dir_mipsel/usr/include/glib-2.0/glib/gmain.h:31: error: storage class specified for parameter 'GSourceCallbackFuncs'
/home/florian/dev/openwrt/trunk/staging_dir_mipsel/usr/include/glib-2.0/glib/gmain.h:32: error: storage class specified for parameter 'GSourceFuncs'
/home/florian/dev/openwrt/trunk/staging_dir_mipsel/usr/include/glib-2.0/glib/gmain.h:34: error: storage class specified for parameter 'GSourceFunc'
/home/florian/dev/openwrt/trunk/staging_dir_mipsel/usr/include/glib-2.0/glib/gmain.h:35: error: expected ')' before 'pid'
/home/florian/dev/openwrt/trunk/staging_dir_mipsel/usr/include/glib-2.0/glib/gmain.h:42: error: expected specifier-qualifier-list before 'GSourceCallbackFuncs'
/home/florian/dev/openwrt/trunk/staging_dir_mipsel/usr/include/glib-2.0/glib/gmain.h:60: warning: empty declaration
/home/florian/dev/openwrt/trunk/staging_dir_mipsel/usr/include/glib-2.0/glib/gmain.h:67: error: expected declaration specifiers or '...' before 'GSource'
/home/florian/dev/openwrt/trunk/staging_dir_mipsel/usr/include/glib-2.0/glib/gmain.h:68: error: expected declaration specifiers or '...' before 'GSourceFunc'
/home/florian/dev/openwrt/trunk/staging_dir_mipsel/usr/include/glib-2.0/glib/gmain.h:70: warning: empty declaration
/home/florian/dev/openwrt/trunk/staging_dir_mipsel/usr/include/glib-2.0/glib/gmain.h:72: error: storage class specified for parameter 'GSourceDummyMarshal'
/home/florian/dev/openwrt/trunk/staging_dir_mipsel/usr/include/glib-2.0/glib/gmain.h:76: error: expected ')' before '*' token
/home/florian/dev/openwrt/trunk/staging_dir_mipsel/usr/include/glib-2.0/glib/gmain.h:78: error: expected ';' before 'gboolean'
/home/florian/dev/openwrt/trunk/staging_dir_mipsel/usr/include/glib-2.0/glib/gmain.h:87: warning: empty declaration
/home/florian/dev/openwrt/trunk/staging_dir_mipsel/usr/include/glib-2.0/glib/gmain.h:116: error: storage class specified for parameter 'GPollFD'
/home/florian/dev/openwrt/trunk/staging_dir_mipsel/usr/include/glib-2.0/glib/gmain.h:117: error: expected ')' before '*' token
/home/florian/dev/openwrt/trunk/staging_dir_mipsel/usr/include/glib-2.0/glib/gmain.h:126: warning: empty declaration
/home/florian/dev/openwrt/trunk/staging_dir_mipsel/usr/include/glib-2.0/glib/gmain.h:138: error: expected declaration specifiers before 'GMainContext'
/home/florian/dev/openwrt/trunk/staging_dir_mipsel/usr/include/glib-2.0/glib/gmain.h:139: error: expected declaration specifiers before 'GMainContext'
/home/florian/dev/openwrt/trunk/staging_dir_mipsel/usr/include/glib-2.0/glib/gmain.h:140: error: expected ')' before '*' token
/home/florian/dev/openwrt/trunk/staging_dir_mipsel/usr/include/glib-2.0/glib/gmain.h:141: error: expected declaration specifiers before 'GMainContext'
/home/florian/dev/openwrt/trunk/staging_dir_mipsel/usr/include/glib-2.0/glib/gmain.h:143: error: expected ')' before '*' token
/home/florian/dev/openwrt/trunk/staging_dir_mipsel/usr/include/glib-2.0/glib/gmain.h:145: error: expected ')' before '*' token
/home/florian/dev/openwrt/trunk/staging_dir_mipsel/usr/include/glib-2.0/glib/gmain.h:149: error: expected declaration specifiers before 'GSource'
/home/florian/dev/openwrt/trunk/staging_dir_mipsel/usr/include/glib-2.0/glib/gmain.h:151: error: expected declaration specifiers before 'GSource'
/home/florian/dev/openwrt/trunk/staging_dir_mipsel/usr/include/glib-2.0/glib/gmain.h:153: error: expected declaration specifiers before 'GSource'
/home/florian/dev/openwrt/trunk/staging_dir_mipsel/usr/include/glib-2.0/glib/gmain.h:159: error: expected ')' before '*' token
/home/florian/dev/openwrt/trunk/staging_dir_mipsel/usr/include/glib-2.0/glib/gmain.h:160: error: expected ')' before '*' token
/home/florian/dev/openwrt/trunk/staging_dir_mipsel/usr/include/glib-2.0/glib/gmain.h:161: error: expected ')' before '*' token
/home/florian/dev/openwrt/trunk/staging_dir_mipsel/usr/include/glib-2.0/glib/gmain.h:162: error: expected ')' before '*' token
/home/florian/dev/openwrt/trunk/staging_dir_mipsel/usr/include/glib-2.0/glib/gmain.h:163: error: expected ')' before '*' token
/home/florian/dev/openwrt/trunk/staging_dir_mipsel/usr/include/glib-2.0/glib/gmain.h:167: error: expected ')' before '*' token
/home/florian/dev/openwrt/trunk/staging_dir_mipsel/usr/include/glib-2.0/glib/gmain.h:169: error: expected ')' before '*' token
/home/florian/dev/openwrt/trunk/staging_dir_mipsel/usr/include/glib-2.0/glib/gmain.h:174: error: expected ')' before '*' token
/home/florian/dev/openwrt/trunk/staging_dir_mipsel/usr/include/glib-2.0/glib/gmain.h:178: error: expected ')' before '*' token
/home/florian/dev/openwrt/trunk/staging_dir_mipsel/usr/include/glib-2.0/glib/gmain.h:180: error: expected ')' before '*' token
/home/florian/dev/openwrt/trunk/staging_dir_mipsel/usr/include/glib-2.0/glib/gmain.h:182: error: expected declaration specifiers before 'GPollFunc'
/home/florian/dev/openwrt/trunk/staging_dir_mipsel/usr/include/glib-2.0/glib/gmain.h:186: error: expected ')' before '*' token
/home/florian/dev/openwrt/trunk/staging_dir_mipsel/usr/include/glib-2.0/glib/gmain.h:189: error: expected ')' before '*' token
/home/florian/dev/openwrt/trunk/staging_dir_mipsel/usr/include/glib-2.0/glib/gmain.h:193: error: expected declaration specifiers before 'GSource'
/home/florian/dev/openwrt/trunk/staging_dir_mipsel/usr/include/glib-2.0/glib/gmain.h:198: error: expected declaration specifiers before 'GMainLoop'
/home/florian/dev/openwrt/trunk/staging_dir_mipsel/usr/include/glib-2.0/glib/gmain.h:200: error: expected ')' before '*' token
/home/florian/dev/openwrt/trunk/staging_dir_mipsel/usr/include/glib-2.0/glib/gmain.h:201: error: expected ')' before '*' token
/home/florian/dev/openwrt/trunk/staging_dir_mipsel/usr/include/glib-2.0/glib/gmain.h:202: error: expected declaration specifiers before 'GMainLoop'
/home/florian/dev/openwrt/trunk/staging_dir_mipsel/usr/include/glib-2.0/glib/gmain.h:203: error: expected ')' before '*' token
/home/florian/dev/openwrt/trunk/staging_dir_mipsel/usr/include/glib-2.0/glib/gmain.h:204: error: expected ')' before '*' token
/home/florian/dev/openwrt/trunk/staging_dir_mipsel/usr/include/glib-2.0/glib/gmain.h:205: error: expected declaration specifiers before 'GMainContext'
/home/florian/dev/openwrt/trunk/staging_dir_mipsel/usr/include/glib-2.0/glib/gmain.h:209: error: expected declaration specifiers before 'GSource'
/home/florian/dev/openwrt/trunk/staging_dir_mipsel/usr/include/glib-2.0/glib/gmain.h:211: error: expected declaration specifiers before 'GSource'
/home/florian/dev/openwrt/trunk/staging_dir_mipsel/usr/include/glib-2.0/glib/gmain.h:212: error: expected ')' before '*' token
/home/florian/dev/openwrt/trunk/staging_dir_mipsel/usr/include/glib-2.0/glib/gmain.h:214: error: expected ')' before '*' token
/home/florian/dev/openwrt/trunk/staging_dir_mipsel/usr/include/glib-2.0/glib/gmain.h:216: error: expected ')' before '*' token
/home/florian/dev/openwrt/trunk/staging_dir_mipsel/usr/include/glib-2.0/glib/gmain.h:218: error: expected ')' before '*' token
/home/florian/dev/openwrt/trunk/staging_dir_mipsel/usr/include/glib-2.0/glib/gmain.h:220: error: expected ')' before '*' token
/home/florian/dev/openwrt/trunk/staging_dir_mipsel/usr/include/glib-2.0/glib/gmain.h:221: error: expected ')' before '*' token
/home/florian/dev/openwrt/trunk/staging_dir_mipsel/usr/include/glib-2.0/glib/gmain.h:223: error: expected ')' before '*' token
/home/florian/dev/openwrt/trunk/staging_dir_mipsel/usr/include/glib-2.0/glib/gmain.h:224: error: expected ')' before '*' token
/home/florian/dev/openwrt/trunk/staging_dir_mipsel/usr/include/glib-2.0/glib/gmain.h:226: error: expected declaration specifiers before 'GMainContext'
/home/florian/dev/openwrt/trunk/staging_dir_mipsel/usr/include/glib-2.0/glib/gmain.h:228: error: expected ')' before '*' token
/home/florian/dev/openwrt/trunk/staging_dir_mipsel/usr/include/glib-2.0/glib/gmain.h:233: error: expected ')' before '*' token
/home/florian/dev/openwrt/trunk/staging_dir_mipsel/usr/include/glib-2.0/glib/gmain.h:235: error: expected ')' before '*' token
/home/florian/dev/openwrt/trunk/staging_dir_mipsel/usr/include/glib-2.0/glib/gmain.h:238: error: expected ')' before '*' token
/home/florian/dev/openwrt/trunk/staging_dir_mipsel/usr/include/glib-2.0/glib/gmain.h:242: error: expected ')' before '*' token
/home/florian/dev/openwrt/trunk/staging_dir_mipsel/usr/include/glib-2.0/glib/gmain.h:244: error: expected ')' before '*' token
/home/florian/dev/openwrt/trunk/staging_dir_mipsel/usr/include/glib-2.0/glib/gmain.h:247: error: expected ')' before '*' token
/home/florian/dev/openwrt/trunk/staging_dir_mipsel/usr/include/glib-2.0/glib/gmain.h:256: error: expected declaration specifiers before 'GSource'
/home/florian/dev/openwrt/trunk/staging_dir_mipsel/usr/include/glib-2.0/glib/gmain.h:257: error: expected declaration specifiers before 'GSource'
/home/florian/dev/openwrt/trunk/staging_dir_mipsel/usr/include/glib-2.0/glib/gmain.h:258: error: expected declaration specifiers before 'GSource'
/home/florian/dev/openwrt/trunk/staging_dir_mipsel/usr/include/glib-2.0/glib/gmain.h:289: error: expected ')' before '*' token
/home/florian/dev/openwrt/trunk/staging_dir_mipsel/usr/include/glib-2.0/glib/gmain.h:295: error: expected declaration specifiers or '...' before 'GSourceFunc'
/home/florian/dev/openwrt/trunk/staging_dir_mipsel/usr/include/glib-2.0/glib/gmain.h:299: error: expected declaration specifiers or '...' before 'GSourceFunc'
/home/florian/dev/openwrt/trunk/staging_dir_mipsel/usr/include/glib-2.0/glib/gmain.h:302: error: expected declaration specifiers or '...' before 'GPid'
/home/florian/dev/openwrt/trunk/staging_dir_mipsel/usr/include/glib-2.0/glib/gmain.h:303: error: expected declaration specifiers or '...' before 'GChildWatchFunc'
/home/florian/dev/openwrt/trunk/staging_dir_mipsel/usr/include/glib-2.0/glib/gmain.h:306: error: expected ')' before 'pid'
/home/florian/dev/openwrt/trunk/staging_dir_mipsel/usr/include/glib-2.0/glib/gmain.h:309: error: expected ')' before 'function'
/home/florian/dev/openwrt/trunk/staging_dir_mipsel/usr/include/glib-2.0/glib/gmain.h:312: error: expected declaration specifiers or '...' before 'GSourceFunc'
/home/florian/dev/openwrt/trunk/staging_dir_mipsel/usr/include/glib-2.0/glib/gmain.h:318: error: expected '=', ',', ';', 'asm' or '__attribute__' before 'g_timeout_funcs'
/home/florian/dev/openwrt/trunk/staging_dir_mipsel/usr/include/glib-2.0/glib/gmain.h:319: error: expected '=', ',', ';', 'asm' or '__attribute__' before 'g_child_watch_funcs'
/home/florian/dev/openwrt/trunk/staging_dir_mipsel/usr/include/glib-2.0/glib/gmain.h:320: error: expected '=', ',', ';', 'asm' or '__attribute__' before 'g_idle_funcs'
/home/florian/dev/openwrt/trunk/staging_dir_mipsel/usr/include/glib-2.0/glib/gmain.h:322: error: expected declaration specifiers before 'G_END_DECLS'
In file included from /home/florian/dev/openwrt/trunk/staging_dir_mipsel/usr/include/glib-2.0/glib/gstring.h:31,
from /home/florian/dev/openwrt/trunk/staging_dir_mipsel/usr/include/glib-2.0/glib/giochannel.h:32,
from /home/florian/dev/openwrt/trunk/staging_dir_mipsel/usr/include/glib-2.0/glib.h:47,
from sshfs.c:32:
/home/florian/dev/openwrt/trunk/staging_dir_mipsel/usr/include/glib-2.0/glib/gunicode.h:31: error: storage class specified for parameter 'gunichar2'
/home/florian/dev/openwrt/trunk/staging_dir_mipsel/usr/include/glib-2.0/glib/gunicode.h:68: error: storage class specified for parameter 'GUnicodeType'
/home/florian/dev/openwrt/trunk/staging_dir_mipsel/usr/include/glib-2.0/glib/gunicode.h:113: error: storage class specified for parameter 'GUnicodeBreakType'
/home/florian/dev/openwrt/trunk/staging_dir_mipsel/usr/include/glib-2.0/glib/gunicode.h:121: error: expected ')' before 'char'
/home/florian/dev/openwrt/trunk/staging_dir_mipsel/usr/include/glib-2.0/glib/gunicode.h:125: error: expected ')' before 'c'
/home/florian/dev/openwrt/trunk/staging_dir_mipsel/usr/include/glib-2.0/glib/gunicode.h:126: error: expected ')' before 'c'
/home/florian/dev/openwrt/trunk/staging_dir_mipsel/usr/include/glib-2.0/glib/gunicode.h:127: error: expected ')' before 'c'
/home/florian/dev/openwrt/trunk/staging_dir_mipsel/usr/include/glib-2.0/glib/gunicode.h:128: error: expected ')' before 'c'
/home/florian/dev/openwrt/trunk/staging_dir_mipsel/usr/include/glib-2.0/glib/gunicode.h:129: error: expected ')' before 'c'
/home/florian/dev/openwrt/trunk/staging_dir_mipsel/usr/include/glib-2.0/glib/gunicode.h:130: error: expected ')' before 'c'
/home/florian/dev/openwrt/trunk/staging_dir_mipsel/usr/include/glib-2.0/glib/gunicode.h:131: error: expected ')' before 'c'
/home/florian/dev/openwrt/trunk/staging_dir_mipsel/usr/include/glib-2.0/glib/gunicode.h:132: error: expected ')' before 'c'
/home/florian/dev/openwrt/trunk/staging_dir_mipsel/usr/include/glib-2.0/glib/gunicode.h:133: error: expected ')' before 'c'
/home/florian/dev/openwrt/trunk/staging_dir_mipsel/usr/include/glib-2.0/glib/gunicode.h:134: error: expected ')' before 'c'
/home/florian/dev/openwrt/trunk/staging_dir_mipsel/usr/include/glib-2.0/glib/gunicode.h:135: error: expected ')' before 'c'
/home/florian/dev/openwrt/trunk/staging_dir_mipsel/usr/include/glib-2.0/glib/gunicode.h:136: error: expected ')' before 'c'
/home/florian/dev/openwrt/trunk/staging_dir_mipsel/usr/include/glib-2.0/glib/gunicode.h:137: error: expected ')' before 'c'
/home/florian/dev/openwrt/trunk/staging_dir_mipsel/usr/include/glib-2.0/glib/gunicode.h:138: error: expected ')' before 'c'
/home/florian/dev/openwrt/trunk/staging_dir_mipsel/usr/include/glib-2.0/glib/gunicode.h:139: error: expected ')' before 'c'
/home/florian/dev/openwrt/trunk/staging_dir_mipsel/usr/include/glib-2.0/glib/gunicode.h:143: error: expected declaration specifiers before 'gunichar'
/home/florian/dev/openwrt/trunk/staging_dir_mipsel/usr/include/glib-2.0/glib/gunicode.h:144: error: expected declaration specifiers before 'gunichar'
/home/florian/dev/openwrt/trunk/staging_dir_mipsel/usr/include/glib-2.0/glib/gunicode.h:145: error: expected declaration specifiers before 'gunichar'
/home/florian/dev/openwrt/trunk/staging_dir_mipsel/usr/include/glib-2.0/glib/gunicode.h:149: error: expected ')' before 'c'
/home/florian/dev/openwrt/trunk/staging_dir_mipsel/usr/include/glib-2.0/glib/gunicode.h:151: error: expected ')' before 'c'
/home/florian/dev/openwrt/trunk/staging_dir_mipsel/usr/include/glib-2.0/glib/gunicode.h:154: error: expected declaration specifiers before 'GUnicodeType'
/home/florian/dev/openwrt/trunk/staging_dir_mipsel/usr/include/glib-2.0/glib/gunicode.h:157: error: expected declaration specifiers before 'GUnicodeBreakType'
/home/florian/dev/openwrt/trunk/staging_dir_mipsel/usr/include/glib-2.0/glib/gunicode.h:163: error: expected ')' before '*' token
/home/florian/dev/openwrt/trunk/staging_dir_mipsel/usr/include/glib-2.0/glib/gunicode.h:169: error: expected declaration specifiers before 'gunichar'
/home/florian/dev/openwrt/trunk/staging_dir_mipsel/usr/include/glib-2.0/glib/gunicode.h:174: error: expected '=', ',', ';', 'asm' or '__attribute__' before '*' token
/home/florian/dev/openwrt/trunk/staging_dir_mipsel/usr/include/glib-2.0/glib/gunicode.h:178: error: expected declaration specifiers before 'gunichar'
/home/florian/dev/openwrt/trunk/staging_dir_mipsel/usr/include/glib-2.0/glib/gunicode.h:179: error: expected declaration specifiers before 'gunichar'
/home/florian/dev/openwrt/trunk/staging_dir_mipsel/usr/include/glib-2.0/glib/gunicode.h:182: error: expected declaration specifiers before 'gchar'
/home/florian/dev/openwrt/trunk/staging_dir_mipsel/usr/include/glib-2.0/glib/gunicode.h:184: warning: type defaults to 'int' in declaration of 'gchar'
/home/florian/dev/openwrt/trunk/staging_dir_mipsel/usr/include/glib-2.0/glib/gunicode.h:184: error: expected ';', ',' or ')' before '*' token
/home/florian/dev/openwrt/trunk/staging_dir_mipsel/usr/include/glib-2.0/glib/gunicode.h:186: error: expected declaration specifiers before 'gchar'
/home/florian/dev/openwrt/trunk/staging_dir_mipsel/usr/include/glib-2.0/glib/gunicode.h:187: error: expected declaration specifiers before 'gchar'
/home/florian/dev/openwrt/trunk/staging_dir_mipsel/usr/include/glib-2.0/glib/gunicode.h:189: error: expected declaration specifiers before 'gchar'
/home/florian/dev/openwrt/trunk/staging_dir_mipsel/usr/include/glib-2.0/glib/gunicode.h:192: warning: type defaults to 'int' in declaration of 'gchar'
/home/florian/dev/openwrt/trunk/staging_dir_mipsel/usr/include/glib-2.0/glib/gunicode.h:192: error: expected ';', ',' or ')' before '*' token
/home/florian/dev/openwrt/trunk/staging_dir_mipsel/usr/include/glib-2.0/glib/gunicode.h:196: error: expected declaration specifiers before 'gchar'
/home/florian/dev/openwrt/trunk/staging_dir_mipsel/usr/include/glib-2.0/glib/gunicode.h:202: error: expected declaration specifiers before 'gchar'
/home/florian/dev/openwrt/trunk/staging_dir_mipsel/usr/include/glib-2.0/glib/gunicode.h:205: error: expected declaration specifiers before 'gchar'
/home/florian/dev/openwrt/trunk/staging_dir_mipsel/usr/include/glib-2.0/glib/gunicode.h:208: error: expected declaration specifiers before 'gchar'
/home/florian/dev/openwrt/trunk/staging_dir_mipsel/usr/include/glib-2.0/glib/gunicode.h:211: error: expected declaration specifiers before 'gunichar2'
/home/florian/dev/openwrt/trunk/staging_dir_mipsel/usr/include/glib-2.0/glib/gunicode.h:216: error: expected declaration specifiers before 'gunichar'
/home/florian/dev/openwrt/trunk/staging_dir_mipsel/usr/include/glib-2.0/glib/gunicode.h:221: error: expected declaration specifiers before 'gunichar'
/home/florian/dev/openwrt/trunk/staging_dir_mipsel/usr/include/glib-2.0/glib/gunicode.h:224: error: expected declaration specifiers before 'gunichar'
/home/florian/dev/openwrt/trunk/staging_dir_mipsel/usr/include/glib-2.0/glib/gunicode.h:229: error: expected declaration specifiers before 'gchar'
/home/florian/dev/openwrt/trunk/staging_dir_mipsel/usr/include/glib-2.0/glib/gunicode.h:234: error: expected declaration specifiers before 'gunichar2'
/home/florian/dev/openwrt/trunk/staging_dir_mipsel/usr/include/glib-2.0/glib/gunicode.h:239: error: expected declaration specifiers before 'gchar'
/home/florian/dev/openwrt/trunk/staging_dir_mipsel/usr/include/glib-2.0/glib/gunicode.h:249: error: expected ')' before 'c'
/home/florian/dev/openwrt/trunk/staging_dir_mipsel/usr/include/glib-2.0/glib/gunicode.h:256: warning: type defaults to 'int' in declaration of 'gchar'
/home/florian/dev/openwrt/trunk/staging_dir_mipsel/usr/include/glib-2.0/glib/gunicode.h:256: error: expected ';', ',' or ')' before '*' token
/home/florian/dev/openwrt/trunk/staging_dir_mipsel/usr/include/glib-2.0/glib/gunicode.h:261: error: expected ')' before 'ch'
/home/florian/dev/openwrt/trunk/staging_dir_mipsel/usr/include/glib-2.0/glib/gunicode.h:263: error: expected declaration specifiers before 'gchar'
/home/florian/dev/openwrt/trunk/staging_dir_mipsel/usr/include/glib-2.0/glib/gunicode.h:265: error: expected declaration specifiers before 'gchar'
/home/florian/dev/openwrt/trunk/staging_dir_mipsel/usr/include/glib-2.0/glib/gunicode.h:267: error: expected declaration specifiers before 'gchar'
/home/florian/dev/openwrt/trunk/staging_dir_mipsel/usr/include/glib-2.0/glib/gunicode.h:279: error: storage class specified for parameter 'GNormalizeMode'
/home/florian/dev/openwrt/trunk/staging_dir_mipsel/usr/include/glib-2.0/glib/gunicode.h:281: error: expected declaration specifiers before 'gchar'
/home/florian/dev/openwrt/trunk/staging_dir_mipsel/usr/include/glib-2.0/glib/gunicode.h:285: warning: type defaults to 'int' in declaration of 'gchar'
/home/florian/dev/openwrt/trunk/staging_dir_mipsel/usr/include/glib-2.0/glib/gunicode.h:285: error: expected ';', ',' or ')' before '*' token
/home/florian/dev/openwrt/trunk/staging_dir_mipsel/usr/include/glib-2.0/glib/gunicode.h:287: error: expected declaration specifiers before 'gchar'
/home/florian/dev/openwrt/trunk/staging_dir_mipsel/usr/include/glib-2.0/glib/gunicode.h:289: error: expected declaration specifiers before 'gchar'
/home/florian/dev/openwrt/trunk/staging_dir_mipsel/usr/include/glib-2.0/glib/gunicode.h:292: error: expected ')' before 'ch'
/home/florian/dev/openwrt/trunk/staging_dir_mipsel/usr/include/glib-2.0/glib/gunicode.h:297: error: expected declaration specifiers before 'gchar'
/home/florian/dev/openwrt/trunk/staging_dir_mipsel/usr/include/glib-2.0/glib/gunicode.h:300: error: expected declaration specifiers before 'G_END_DECLS'
In file included from /home/florian/dev/openwrt/trunk/staging_dir_mipsel/usr/include/glib-2.0/glib/gstring.h:32,
from /home/florian/dev/openwrt/trunk/staging_dir_mipsel/usr/include/glib-2.0/glib/giochannel.h:32,
from /home/florian/dev/openwrt/trunk/staging_dir_mipsel/usr/include/glib-2.0/glib.h:47,
from sshfs.c:32:
/home/florian/dev/openwrt/trunk/staging_dir_mipsel/usr/include/glib-2.0/glib/gutils.h:33: error: expected declaration specifiers before 'G_BEGIN_DECLS'
/home/florian/dev/openwrt/trunk/staging_dir_mipsel/usr/include/glib-2.0/glib/gutils.h:117: error: expected declaration specifiers before 'G_CONST_RETURN'
/home/florian/dev/openwrt/trunk/staging_dir_mipsel/usr/include/glib-2.0/glib/gutils.h:118: error: expected declaration specifiers before 'G_CONST_RETURN'
/home/florian/dev/openwrt/trunk/staging_dir_mipsel/usr/include/glib-2.0/glib/gutils.h:119: error: expected declaration specifiers before 'G_CONST_RETURN'
/home/florian/dev/openwrt/trunk/staging_dir_mipsel/usr/include/glib-2.0/glib/gutils.h:120: error: expected declaration specifiers before 'G_CONST_RETURN'
/home/florian/dev/openwrt/trunk/staging_dir_mipsel/usr/include/glib-2.0/glib/gutils.h:121: error: expected declaration specifiers before 'gchar'
/home/florian/dev/openwrt/trunk/staging_dir_mipsel/usr/include/glib-2.0/glib/gutils.h:122: warning: type defaults to 'int' in declaration of 'gchar'
/home/florian/dev/openwrt/trunk/staging_dir_mipsel/usr/include/glib-2.0/glib/gutils.h:122: error: expected ';', ',' or ')' before '*' token
/home/florian/dev/openwrt/trunk/staging_dir_mipsel/usr/include/glib-2.0/glib/gutils.h:123: error: expected declaration specifiers before 'G_CONST_RETURN'
/home/florian/dev/openwrt/trunk/staging_dir_mipsel/usr/include/glib-2.0/glib/gutils.h:124: warning: type defaults to 'int' in declaration of 'gchar'
/home/florian/dev/openwrt/trunk/staging_dir_mipsel/usr/include/glib-2.0/glib/gutils.h:124: error: expected ';', ',' or ')' before '*' token
/home/florian/dev/openwrt/trunk/staging_dir_mipsel/usr/include/glib-2.0/glib/gutils.h:126: error: expected declaration specifiers before 'G_CONST_RETURN'
/home/florian/dev/openwrt/trunk/staging_dir_mipsel/usr/include/glib-2.0/glib/gutils.h:127: error: expected declaration specifiers before 'G_CONST_RETURN'
/home/florian/dev/openwrt/trunk/staging_dir_mipsel/usr/include/glib-2.0/glib/gutils.h:128: error: expected declaration specifiers before 'G_CONST_RETURN'
/home/florian/dev/openwrt/trunk/staging_dir_mipsel/usr/include/glib-2.0/glib/gutils.h:129: error: expected declaration specifiers before 'G_CONST_RETURN'
/home/florian/dev/openwrt/trunk/staging_dir_mipsel/usr/include/glib-2.0/glib/gutils.h:144: error: expected declaration specifiers before 'G_CONST_RETURN'
/home/florian/dev/openwrt/trunk/staging_dir_mipsel/usr/include/glib-2.0/glib/gutils.h:146: error: expected declaration specifiers before 'G_CONST_RETURN'
/home/florian/dev/openwrt/trunk/staging_dir_mipsel/usr/include/glib-2.0/glib/gutils.h:148: error: storage class specified for parameter 'GDebugKey'
/home/florian/dev/openwrt/trunk/staging_dir_mipsel/usr/include/glib-2.0/glib/gutils.h:151: error: expected specifier-qualifier-list before 'gchar'
/home/florian/dev/openwrt/trunk/staging_dir_mipsel/usr/include/glib-2.0/glib/gutils.h:153: warning: empty declaration
/home/florian/dev/openwrt/trunk/staging_dir_mipsel/usr/include/glib-2.0/glib/gutils.h:157: warning: type defaults to 'int' in declaration of 'gchar'
/home/florian/dev/openwrt/trunk/staging_dir_mipsel/usr/include/glib-2.0/glib/gutils.h:157: error: expected ';', ',' or ')' before '*' token
/home/florian/dev/openwrt/trunk/staging_dir_mipsel/usr/include/glib-2.0/glib/gutils.h:161: error: expected ')' before '*' token
/home/florian/dev/openwrt/trunk/staging_dir_mipsel/usr/include/glib-2.0/glib/gutils.h:165: error: expected ')' before '*' token
/home/florian/dev/openwrt/trunk/staging_dir_mipsel/usr/include/glib-2.0/glib/gutils.h:171: warning: type defaults to 'int' in declaration of 'gchar'
/home/florian/dev/openwrt/trunk/staging_dir_mipsel/usr/include/glib-2.0/glib/gutils.h:171: error: expected ';', ',' or ')' before '*' token
/home/florian/dev/openwrt/trunk/staging_dir_mipsel/usr/include/glib-2.0/glib/gutils.h:174: error: expected declaration specifiers before 'G_CONST_RETURN'
/home/florian/dev/openwrt/trunk/staging_dir_mipsel/usr/include/glib-2.0/glib/gutils.h:182: error: expected declaration specifiers before 'G_CONST_RETURN'
/home/florian/dev/openwrt/trunk/staging_dir_mipsel/usr/include/glib-2.0/glib/gutils.h:192: error: expected declaration specifiers before 'gchar'
/home/florian/dev/openwrt/trunk/staging_dir_mipsel/usr/include/glib-2.0/glib/gutils.h:193: error: expected declaration specifiers before 'gchar'
/home/florian/dev/openwrt/trunk/staging_dir_mipsel/usr/include/glib-2.0/glib/gutils.h:194: error: expected declaration specifiers before 'gchar'
/home/florian/dev/openwrt/trunk/staging_dir_mipsel/usr/include/glib-2.0/glib/gutils.h:208: error: expected declaration specifiers before 'G_CONST_RETURN'
/home/florian/dev/openwrt/trunk/staging_dir_mipsel/usr/include/glib-2.0/glib/gutils.h:209: warning: type defaults to 'int' in declaration of 'gchar'
/home/florian/dev/openwrt/trunk/staging_dir_mipsel/usr/include/glib-2.0/glib/gutils.h:209: error: expected ';', ',' or ')' before '*' token
/home/florian/dev/openwrt/trunk/staging_dir_mipsel/usr/include/glib-2.0/glib/gutils.h:212: warning: type defaults to 'int' in declaration of 'gchar'
/home/florian/dev/openwrt/trunk/staging_dir_mipsel/usr/include/glib-2.0/glib/gutils.h:212: error: expected ';', ',' or ')' before '*' token
/home/florian/dev/openwrt/trunk/staging_dir_mipsel/usr/include/glib-2.0/glib/gutils.h:213: error: expected declaration specifiers before 'gchar'
/home/florian/dev/openwrt/trunk/staging_dir_mipsel/usr/include/glib-2.0/glib/gutils.h:214: error: expected '=', ',', ';', 'asm' or '__attribute__' before '*' token
/home/florian/dev/openwrt/trunk/staging_dir_mipsel/usr/include/glib-2.0/glib/gutils.h:221: error: storage class specified for parameter 'GVoidFunc'
/home/florian/dev/openwrt/trunk/staging_dir_mipsel/usr/include/glib-2.0/glib/gutils.h:232: error: expected ')' before 'func'
/home/florian/dev/openwrt/trunk/staging_dir_mipsel/usr/include/glib-2.0/glib/gutils.h:246: error: expected declaration specifiers before 'gchar'
/home/florian/dev/openwrt/trunk/staging_dir_mipsel/usr/include/glib-2.0/glib/gutils.h:251: error: expected '=', ',', ';', 'asm' or '__attribute__' before 'G_GNUC_CONST'
/home/florian/dev/openwrt/trunk/staging_dir_mipsel/usr/include/glib-2.0/glib/gutils.h:253: error: expected '=', ',', ';', 'asm' or '__attribute__' before 'G_GNUC_CONST'
/home/florian/dev/openwrt/trunk/staging_dir_mipsel/usr/include/glib-2.0/glib/gutils.h:254: error: expected '=', ',', ';', 'asm' or '__attribute__' before 'G_GNUC_CONST'
/home/florian/dev/openwrt/trunk/staging_dir_mipsel/usr/include/glib-2.0/glib/gutils.h:259: error: storage class specified for parameter 'GTrashStack'
/home/florian/dev/openwrt/trunk/staging_dir_mipsel/usr/include/glib-2.0/glib/gutils.h:262: error: expected specifier-qualifier-list before 'GTrashStack'
/home/florian/dev/openwrt/trunk/staging_dir_mipsel/usr/include/glib-2.0/glib/gutils.h:263: warning: empty declaration
/home/florian/dev/openwrt/trunk/staging_dir_mipsel/usr/include/glib-2.0/glib/gutils.h:265: error: expected ')' before '*' token
/home/florian/dev/openwrt/trunk/staging_dir_mipsel/usr/include/glib-2.0/glib/gutils.h:267: error: expected ')' before '*' token
/home/florian/dev/openwrt/trunk/staging_dir_mipsel/usr/include/glib-2.0/glib/gutils.h:268: error: expected ')' before '*' token
/home/florian/dev/openwrt/trunk/staging_dir_mipsel/usr/include/glib-2.0/glib/gutils.h:269: error: expected ')' before '*' token
/home/florian/dev/openwrt/trunk/staging_dir_mipsel/usr/include/glib-2.0/glib/gutils.h:371: error: storage class specified for parameter 'glib_major_version'
/home/florian/dev/openwrt/trunk/staging_dir_mipsel/usr/include/glib-2.0/glib/gutils.h:372: error: storage class specified for parameter 'glib_minor_version'
/home/florian/dev/openwrt/trunk/staging_dir_mipsel/usr/include/glib-2.0/glib/gutils.h:373: error: storage class specified for parameter 'glib_micro_version'
/home/florian/dev/openwrt/trunk/staging_dir_mipsel/usr/include/glib-2.0/glib/gutils.h:374: error: storage class specified for parameter 'glib_interface_age'
/home/florian/dev/openwrt/trunk/staging_dir_mipsel/usr/include/glib-2.0/glib/gutils.h:375: error: storage class specified for parameter 'glib_binary_age'
/home/florian/dev/openwrt/trunk/staging_dir_mipsel/usr/include/glib-2.0/glib/gutils.h:377: error: expected '=', ',', ';', 'asm' or '__attribute__' before '*' token
/home/florian/dev/openwrt/trunk/staging_dir_mipsel/usr/include/glib-2.0/glib/gutils.h:387: error: expected declaration specifiers before 'G_END_DECLS'
In file included from /home/florian/dev/openwrt/trunk/staging_dir_mipsel/usr/include/glib-2.0/glib/giochannel.h:32,
from /home/florian/dev/openwrt/trunk/staging_dir_mipsel/usr/include/glib-2.0/glib.h:47,
from sshfs.c:32:
/home/florian/dev/openwrt/trunk/staging_dir_mipsel/usr/include/glib-2.0/glib/gstring.h:37: error: storage class specified for parameter 'GStringChunk'
/home/florian/dev/openwrt/trunk/staging_dir_mipsel/usr/include/glib-2.0/glib/gstring.h:41: error: expected specifier-qualifier-list before 'gchar'
/home/florian/dev/openwrt/trunk/staging_dir_mipsel/usr/include/glib-2.0/glib/gstring.h:44: warning: empty declaration
/home/florian/dev/openwrt/trunk/staging_dir_mipsel/usr/include/glib-2.0/glib/gstring.h:48: error: expected declaration specifiers before 'GStringChunk'
/home/florian/dev/openwrt/trunk/staging_dir_mipsel/usr/include/glib-2.0/glib/gstring.h:49: error: expected ')' before '*' token
/home/florian/dev/openwrt/trunk/staging_dir_mipsel/usr/include/glib-2.0/glib/gstring.h:50: error: expected declaration specifiers before 'gchar'
/home/florian/dev/openwrt/trunk/staging_dir_mipsel/usr/include/glib-2.0/glib/gstring.h:52: error: expected declaration specifiers before 'gchar'
/home/florian/dev/openwrt/trunk/staging_dir_mipsel/usr/include/glib-2.0/glib/gstring.h:55: error: expected declaration specifiers before 'gchar'
/home/florian/dev/openwrt/trunk/staging_dir_mipsel/usr/include/glib-2.0/glib/gstring.h:61: error: expected declaration specifiers before 'GString'
/home/florian/dev/openwrt/trunk/staging_dir_mipsel/usr/include/glib-2.0/glib/gstring.h:62: error: expected declaration specifiers before 'GString'
/home/florian/dev/openwrt/trunk/staging_dir_mipsel/usr/include/glib-2.0/glib/gstring.h:64: error: expected declaration specifiers before 'GString'
/home/florian/dev/openwrt/trunk/staging_dir_mipsel/usr/include/glib-2.0/glib/gstring.h:65: error: expected declaration specifiers before 'gchar'
/home/florian/dev/openwrt/trunk/staging_dir_mipsel/usr/include/glib-2.0/glib/gstring.h:67: warning: type defaults to 'int' in declaration of 'GString'
/home/florian/dev/openwrt/trunk/staging_dir_mipsel/usr/include/glib-2.0/glib/gstring.h:67: error: expected ';', ',' or ')' before '*' token
/home/florian/dev/openwrt/trunk/staging_dir_mipsel/usr/include/glib-2.0/glib/gstring.h:69: warning: type defaults to 'int' in declaration of 'GString'
/home/florian/dev/openwrt/trunk/staging_dir_mipsel/usr/include/glib-2.0/glib/gstring.h:69: error: expected ';', ',' or ')' before '*' token
/home/florian/dev/openwrt/trunk/staging_dir_mipsel/usr/include/glib-2.0/glib/gstring.h:70: error: expected declaration specifiers before 'GString'
/home/florian/dev/openwrt/trunk/staging_dir_mipsel/usr/include/glib-2.0/glib/gstring.h:72: error: expected declaration specifiers before 'GString'
/home/florian/dev/openwrt/trunk/staging_dir_mipsel/usr/include/glib-2.0/glib/gstring.h:74: error: expected declaration specifiers before 'GString'
/home/florian/dev/openwrt/trunk/staging_dir_mipsel/usr/include/glib-2.0/glib/gstring.h:76: error: expected declaration specifiers before 'GString'
/home/florian/dev/openwrt/trunk/staging_dir_mipsel/usr/include/glib-2.0/glib/gstring.h:80: error: expected declaration specifiers before 'GString'
/home/florian/dev/openwrt/trunk/staging_dir_mipsel/usr/include/glib-2.0/glib/gstring.h:82: error: expected declaration specifiers before 'GString'
/home/florian/dev/openwrt/trunk/staging_dir_mipsel/usr/include/glib-2.0/glib/gstring.h:85: error: expected declaration specifiers before 'GString'
/home/florian/dev/openwrt/trunk/staging_dir_mipsel/usr/include/glib-2.0/glib/gstring.h:87: error: expected declaration specifiers before 'GString'
/home/florian/dev/openwrt/trunk/staging_dir_mipsel/usr/include/glib-2.0/glib/gstring.h:89: error: expected declaration specifiers before 'GString'
/home/florian/dev/openwrt/trunk/staging_dir_mipsel/usr/include/glib-2.0/glib/gstring.h:91: error: expected declaration specifiers before 'GString'
/home/florian/dev/openwrt/trunk/staging_dir_mipsel/usr/include/glib-2.0/glib/gstring.h:93: error: expected declaration specifiers before 'GString'
/home/florian/dev/openwrt/trunk/staging_dir_mipsel/usr/include/glib-2.0/glib/gstring.h:95: error: expected declaration specifiers before 'GString'
/home/florian/dev/openwrt/trunk/staging_dir_mipsel/usr/include/glib-2.0/glib/gstring.h:98: error: expected declaration specifiers before 'GString'
/home/florian/dev/openwrt/trunk/staging_dir_mipsel/usr/include/glib-2.0/glib/gstring.h:101: error: expected declaration specifiers before 'GString'
/home/florian/dev/openwrt/trunk/staging_dir_mipsel/usr/include/glib-2.0/glib/gstring.h:104: error: expected declaration specifiers before 'GString'
/home/florian/dev/openwrt/trunk/staging_dir_mipsel/usr/include/glib-2.0/glib/gstring.h:107: error: expected declaration specifiers before 'GString'
/home/florian/dev/openwrt/trunk/staging_dir_mipsel/usr/include/glib-2.0/glib/gstring.h:110: error: expected declaration specifiers before 'GString'
/home/florian/dev/openwrt/trunk/staging_dir_mipsel/usr/include/glib-2.0/glib/gstring.h:111: error: expected declaration specifiers before 'GString'
/home/florian/dev/openwrt/trunk/staging_dir_mipsel/usr/include/glib-2.0/glib/gstring.h:112: error: expected ')' before '*' token
/home/florian/dev/openwrt/trunk/staging_dir_mipsel/usr/include/glib-2.0/glib/gstring.h:115: error: expected ')' before '*' token
/home/florian/dev/openwrt/trunk/staging_dir_mipsel/usr/include/glib-2.0/glib/gstring.h:145: error: expected declaration specifiers before 'GString'
/home/florian/dev/openwrt/trunk/staging_dir_mipsel/usr/include/glib-2.0/glib/gstring.h:146: error: expected declaration specifiers before 'GString'
/home/florian/dev/openwrt/trunk/staging_dir_mipsel/usr/include/glib-2.0/glib/gstring.h:154: error: expected declaration specifiers before 'G_END_DECLS'
In file included from /home/florian/dev/openwrt/trunk/staging_dir_mipsel/usr/include/glib-2.0/glib.h:47,
from sshfs.c:32:
/home/florian/dev/openwrt/trunk/staging_dir_mipsel/usr/include/glib-2.0/glib/giochannel.h:40: error: storage class specified for parameter 'GIOFuncs'
/home/florian/dev/openwrt/trunk/staging_dir_mipsel/usr/include/glib-2.0/glib/giochannel.h:48: error: storage class specified for parameter 'GIOError'
/home/florian/dev/openwrt/trunk/staging_dir_mipsel/usr/include/glib-2.0/glib/giochannel.h:65: error: storage class specified for parameter 'GIOChannelError'
/home/florian/dev/openwrt/trunk/staging_dir_mipsel/usr/include/glib-2.0/glib/giochannel.h:73: error: storage class specified for parameter 'GIOStatus'
/home/florian/dev/openwrt/trunk/staging_dir_mipsel/usr/include/glib-2.0/glib/giochannel.h:80: error: storage class specified for parameter 'GSeekType'
/home/florian/dev/openwrt/trunk/staging_dir_mipsel/usr/include/glib-2.0/glib/giochannel.h:90: error: storage class specified for parameter 'GIOCondition'
/home/florian/dev/openwrt/trunk/staging_dir_mipsel/usr/include/glib-2.0/glib/giochannel.h:102: error: storage class specified for parameter 'GIOFlags'
/home/florian/dev/openwrt/trunk/staging_dir_mipsel/usr/include/glib-2.0/glib/giochannel.h:108: error: expected specifier-qualifier-list before 'GIOFuncs'
/home/florian/dev/openwrt/trunk/staging_dir_mipsel/usr/include/glib-2.0/glib/giochannel.h:133: warning: empty declaration
/home/florian/dev/openwrt/trunk/staging_dir_mipsel/usr/include/glib-2.0/glib/giochannel.h:135: error: expected ')' before '*' token
/home/florian/dev/openwrt/trunk/staging_dir_mipsel/usr/include/glib-2.0/glib/giochannel.h:140: error: expected specifier-qualifier-list before 'GIOStatus'
/home/florian/dev/openwrt/trunk/staging_dir_mipsel/usr/include/glib-2.0/glib/giochannel.h:163: warning: empty declaration
/home/florian/dev/openwrt/trunk/staging_dir_mipsel/usr/include/glib-2.0/glib/giochannel.h:165: error: expected ')' before '*' token
/home/florian/dev/openwrt/trunk/staging_dir_mipsel/usr/include/glib-2.0/glib/giochannel.h:166: error: expected declaration specifiers before 'GIOChannel'
/home/florian/dev/openwrt/trunk/staging_dir_mipsel/usr/include/glib-2.0/glib/giochannel.h:167: error: expected ')' before '*' token
/home/florian/dev/openwrt/trunk/staging_dir_mipsel/usr/include/glib-2.0/glib/giochannel.h:170: error: expected declaration specifiers before 'GIOError'
/home/florian/dev/openwrt/trunk/staging_dir_mipsel/usr/include/glib-2.0/glib/giochannel.h:174: error: expected declaration specifiers before 'GIOError'
/home/florian/dev/openwrt/trunk/staging_dir_mipsel/usr/include/glib-2.0/glib/giochannel.h:178: error: expected declaration specifiers before 'GIOError'
/home/florian/dev/openwrt/trunk/staging_dir_mipsel/usr/include/glib-2.0/glib/giochannel.h:181: error: expected ')' before '*' token
/home/florian/dev/openwrt/trunk/staging_dir_mipsel/usr/include/glib-2.0/glib/giochannel.h:184: error: expected declaration specifiers before 'GIOStatus'
/home/florian/dev/openwrt/trunk/staging_dir_mipsel/usr/include/glib-2.0/glib/giochannel.h:187: error: expected ')' before '*' token
/home/florian/dev/openwrt/trunk/staging_dir_mipsel/usr/include/glib-2.0/glib/giochannel.h:193: error: expected declaration specifiers before 'GSource'
/home/florian/dev/openwrt/trunk/staging_dir_mipsel/usr/include/glib-2.0/glib/giochannel.h:195: error: expected ')' before '*' token
/home/florian/dev/openwrt/trunk/staging_dir_mipsel/usr/include/glib-2.0/glib/giochannel.h:203: error: expected ')' before '*' token
/home/florian/dev/openwrt/trunk/staging_dir_mipsel/usr/include/glib-2.0/glib/giochannel.h:205: error: expected declaration specifiers before 'gsize'
/home/florian/dev/openwrt/trunk/staging_dir_mipsel/usr/include/glib-2.0/glib/giochannel.h:206: error: expected declaration specifiers before 'GIOCondition'
/home/florian/dev/openwrt/trunk/staging_dir_mipsel/usr/include/glib-2.0/glib/giochannel.h:207: error: expected declaration specifiers before 'GIOStatus'
/home/florian/dev/openwrt/trunk/staging_dir_mipsel/usr/include/glib-2.0/glib/giochannel.h:210: error: expected declaration specifiers before 'GIOFlags'
/home/florian/dev/openwrt/trunk/staging_dir_mipsel/usr/include/glib-2.0/glib/giochannel.h:211: error: expected ')' before '*' token
/home/florian/dev/openwrt/trunk/staging_dir_mipsel/usr/include/glib-2.0/glib/giochannel.h:214: error: expected declaration specifiers before 'G_CONST_RETURN'
/home/florian/dev/openwrt/trunk/staging_dir_mipsel/usr/include/glib-2.0/glib/giochannel.h:216: error: expected ')' before '*' token
/home/florian/dev/openwrt/trunk/staging_dir_mipsel/usr/include/glib-2.0/glib/giochannel.h:218: error: expected ')' before '*' token
/home/florian/dev/openwrt/trunk/staging_dir_mipsel/usr/include/glib-2.0/glib/giochannel.h:219: error: expected declaration specifiers before 'GIOStatus'
/home/florian/dev/openwrt/trunk/staging_dir_mipsel/usr/include/glib-2.0/glib/giochannel.h:222: error: expected declaration specifiers before 'G_CONST_RETURN'
/home/florian/dev/openwrt/trunk/staging_dir_mipsel/usr/include/glib-2.0/glib/giochannel.h:223: error: expected ')' before '*' token
/home/florian/dev/openwrt/trunk/staging_dir_mipsel/usr/include/glib-2.0/glib/giochannel.h:225: error: expected ')' before '*' token
/home/florian/dev/openwrt/trunk/staging_dir_mipsel/usr/include/glib-2.0/glib/giochannel.h:228: error: expected declaration specifiers before 'GIOStatus'
/home/florian/dev/openwrt/trunk/staging_dir_mipsel/usr/include/glib-2.0/glib/giochannel.h:230: error: expected declaration specifiers before 'GIOStatus'
/home/florian/dev/openwrt/trunk/staging_dir_mipsel/usr/include/glib-2.0/glib/giochannel.h:235: error: expected declaration specifiers before 'GIOStatus'
/home/florian/dev/openwrt/trunk/staging_dir_mipsel/usr/include/glib-2.0/glib/giochannel.h:239: error: expected declaration specifiers before 'GIOStatus'
/home/florian/dev/openwrt/trunk/staging_dir_mipsel/usr/include/glib-2.0/glib/giochannel.h:243: error: expected declaration specifiers before 'GIOStatus'
/home/florian/dev/openwrt/trunk/staging_dir_mipsel/usr/include/glib-2.0/glib/giochannel.h:248: error: expected declaration specifiers before 'GIOStatus'
/home/florian/dev/openwrt/trunk/staging_dir_mipsel/usr/include/glib-2.0/glib/giochannel.h:251: error: expected declaration specifiers before 'GIOStatus'
/home/florian/dev/openwrt/trunk/staging_dir_mipsel/usr/include/glib-2.0/glib/giochannel.h:256: error: expected declaration specifiers before 'GIOStatus'
/home/florian/dev/openwrt/trunk/staging_dir_mipsel/usr/include/glib-2.0/glib/giochannel.h:259: error: expected declaration specifiers before 'GIOStatus'
/home/florian/dev/openwrt/trunk/staging_dir_mipsel/usr/include/glib-2.0/glib/giochannel.h:267: error: expected declaration specifiers before 'GIOChannel'
/home/florian/dev/openwrt/trunk/staging_dir_mipsel/usr/include/glib-2.0/glib/giochannel.h:273: error: expected declaration specifiers before 'GQuark'
/home/florian/dev/openwrt/trunk/staging_dir_mipsel/usr/include/glib-2.0/glib/giochannel.h:274: error: expected declaration specifiers before 'GIOChannelError'
/home/florian/dev/openwrt/trunk/staging_dir_mipsel/usr/include/glib-2.0/glib/giochannel.h:294: error: expected declaration specifiers before 'GIOChannel'
/home/florian/dev/openwrt/trunk/staging_dir_mipsel/usr/include/glib-2.0/glib/giochannel.h:295: error: expected ')' before '*' token
/home/florian/dev/openwrt/trunk/staging_dir_mipsel/usr/include/glib-2.0/glib/giochannel.h:299: error: expected '=', ',', ';', 'asm' or '__attribute__' before 'g_io_watch_funcs'
/home/florian/dev/openwrt/trunk/staging_dir_mipsel/usr/include/glib-2.0/glib/giochannel.h:352: error: expected declaration specifiers before 'G_END_DECLS'
In file included from /home/florian/dev/openwrt/trunk/staging_dir_mipsel/usr/include/glib-2.0/glib.h:48,
from sshfs.c:32:
/home/florian/dev/openwrt/trunk/staging_dir_mipsel/usr/include/glib-2.0/glib/gkeyfile.h:38: error: expected declaration specifiers before 'GKeyFileError'
/home/florian/dev/openwrt/trunk/staging_dir_mipsel/usr/include/glib-2.0/glib/gkeyfile.h:42: error: expected declaration specifiers before 'GQuark'
/home/florian/dev/openwrt/trunk/staging_dir_mipsel/usr/include/glib-2.0/glib/gkeyfile.h:44: error: storage class specified for parameter 'GKeyFile'
/home/florian/dev/openwrt/trunk/staging_dir_mipsel/usr/include/glib-2.0/glib/gkeyfile.h:51: error: storage class specified for parameter 'GKeyFileFlags'
/home/florian/dev/openwrt/trunk/staging_dir_mipsel/usr/include/glib-2.0/glib/gkeyfile.h:53: error: expected declaration specifiers before 'GKeyFile'
/home/florian/dev/openwrt/trunk/staging_dir_mipsel/usr/include/glib-2.0/glib/gkeyfile.h:54: error: expected ')' before '*' token
/home/florian/dev/openwrt/trunk/staging_dir_mipsel/usr/include/glib-2.0/glib/gkeyfile.h:55: error: expected ')' before '*' token
/home/florian/dev/openwrt/trunk/staging_dir_mipsel/usr/include/glib-2.0/glib/gkeyfile.h:57: error: expected ')' before '*' token
/home/florian/dev/openwrt/trunk/staging_dir_mipsel/usr/include/glib-2.0/glib/gkeyfile.h:61: error: expected ')' before '*' token
/home/florian/dev/openwrt/trunk/staging_dir_mipsel/usr/include/glib-2.0/glib/gkeyfile.h:66: error: expected ')' before '*' token
/home/florian/dev/openwrt/trunk/staging_dir_mipsel/usr/include/glib-2.0/glib/gkeyfile.h:71: error: expected declaration specifiers before 'gchar'
/home/florian/dev/openwrt/trunk/staging_dir_mipsel/usr/include/glib-2.0/glib/gkeyfile.h:74: error: expected declaration specifiers before 'gchar'
/home/florian/dev/openwrt/trunk/staging_dir_mipsel/usr/include/glib-2.0/glib/gkeyfile.h:75: error: expected declaration specifiers before 'gchar'
/home/florian/dev/openwrt/trunk/staging_dir_mipsel/usr/include/glib-2.0/glib/gkeyfile.h:77: error: expected declaration specifiers before 'gchar'
/home/florian/dev/openwrt/trunk/staging_dir_mipsel/usr/include/glib-2.0/glib/gkeyfile.h:81: error: expected ')' before '*' token
/home/florian/dev/openwrt/trunk/staging_dir_mipsel/usr/include/glib-2.0/glib/gkeyfile.h:83: error: expected ')' before '*' token
/home/florian/dev/openwrt/trunk/staging_dir_mipsel/usr/include/glib-2.0/glib/gkeyfile.h:87: error: expected declaration specifiers before 'gchar'
/home/florian/dev/openwrt/trunk/staging_dir_mipsel/usr/include/glib-2.0/glib/gkeyfile.h:91: error: expected ')' before '*' token
/home/florian/dev/openwrt/trunk/staging_dir_mipsel/usr/include/glib-2.0/glib/gkeyfile.h:95: error: expected declaration specifiers before 'gchar'
/home/florian/dev/openwrt/trunk/staging_dir_mipsel/usr/include/glib-2.0/glib/gkeyfile.h:99: error: expected ')' before '*' token
/home/florian/dev/openwrt/trunk/staging_dir_mipsel/usr/include/glib-2.0/glib/gkeyfile.h:103: error: expected declaration specifiers before 'gchar'
/home/florian/dev/openwrt/trunk/staging_dir_mipsel/usr/include/glib-2.0/glib/gkeyfile.h:108: error: expected ')' before '*' token
/home/florian/dev/openwrt/trunk/staging_dir_mipsel/usr/include/glib-2.0/glib/gkeyfile.h:113: error: expected ')' before '*' token
/home/florian/dev/openwrt/trunk/staging_dir_mipsel/usr/include/glib-2.0/glib/gkeyfile.h:117: error: expected ')' before '*' token
/home/florian/dev/openwrt/trunk/staging_dir_mipsel/usr/include/glib-2.0/glib/gkeyfile.h:121: error: expected ')' before '*' token
/home/florian/dev/openwrt/trunk/staging_dir_mipsel/usr/include/glib-2.0/glib/gkeyfile.h:125: error: expected ')' before '*' token
/home/florian/dev/openwrt/trunk/staging_dir_mipsel/usr/include/glib-2.0/glib/gkeyfile.h:129: error: expected ')' before '*' token
/home/florian/dev/openwrt/trunk/staging_dir_mipsel/usr/include/glib-2.0/glib/gkeyfile.h:133: error: expected ')' before '*' token
/home/florian/dev/openwrt/trunk/staging_dir_mipsel/usr/include/glib-2.0/glib/gkeyfile.h:137: error: expected declaration specifiers before 'gchar'
/home/florian/dev/openwrt/trunk/staging_dir_mipsel/usr/include/glib-2.0/glib/gkeyfile.h:142: error: expected ')' before '*' token
/home/florian/dev/openwrt/trunk/staging_dir_mipsel/usr/include/glib-2.0/glib/gkeyfile.h:147: error: expected declaration specifiers before 'gchar'
/home/florian/dev/openwrt/trunk/staging_dir_mipsel/usr/include/glib-2.0/glib/gkeyfile.h:153: error: expected ')' before '*' token
/home/florian/dev/openwrt/trunk/staging_dir_mipsel/usr/include/glib-2.0/glib/gkeyfile.h:159: error: expected ')' before '*' token
/home/florian/dev/openwrt/trunk/staging_dir_mipsel/usr/include/glib-2.0/glib/gkeyfile.h:164: error: expected ')' before '*' token
/home/florian/dev/openwrt/trunk/staging_dir_mipsel/usr/include/glib-2.0/glib/gkeyfile.h:169: error: expected ')' before '*' token
/home/florian/dev/openwrt/trunk/staging_dir_mipsel/usr/include/glib-2.0/glib/gkeyfile.h:174: error: expected ')' before '*' token
/home/florian/dev/openwrt/trunk/staging_dir_mipsel/usr/include/glib-2.0/glib/gkeyfile.h:179: error: expected ')' before '*' token
/home/florian/dev/openwrt/trunk/staging_dir_mipsel/usr/include/glib-2.0/glib/gkeyfile.h:184: error: expected ')' before '*' token
/home/florian/dev/openwrt/trunk/staging_dir_mipsel/usr/include/glib-2.0/glib/gkeyfile.h:189: error: expected ')' before '*' token
/home/florian/dev/openwrt/trunk/staging_dir_mipsel/usr/include/glib-2.0/glib/gkeyfile.h:194: error: expected declaration specifiers before 'gchar'
/home/florian/dev/openwrt/trunk/staging_dir_mipsel/usr/include/glib-2.0/glib/gkeyfile.h:199: error: expected ')' before '*' token
/home/florian/dev/openwrt/trunk/staging_dir_mipsel/usr/include/glib-2.0/glib/gkeyfile.h:203: error: expected ')' before '*' token
/home/florian/dev/openwrt/trunk/staging_dir_mipsel/usr/include/glib-2.0/glib/gkeyfile.h:207: error: expected ')' before '*' token
/home/florian/dev/openwrt/trunk/staging_dir_mipsel/usr/include/glib-2.0/glib/gkeyfile.h:211: error: expected declaration specifiers before 'G_END_DECLS'
In file included from /home/florian/dev/openwrt/trunk/staging_dir_mipsel/usr/include/glib-2.0/glib.h:52,
from sshfs.c:32:
/home/florian/dev/openwrt/trunk/staging_dir_mipsel/usr/include/glib-2.0/glib/gmappedfile.h:30: error: expected declaration specifiers before 'GMappedFile'
/home/florian/dev/openwrt/trunk/staging_dir_mipsel/usr/include/glib-2.0/glib/gmappedfile.h:33: error: expected declaration specifiers before 'gsize'
/home/florian/dev/openwrt/trunk/staging_dir_mipsel/usr/include/glib-2.0/glib/gmappedfile.h:34: error: expected declaration specifiers before 'gchar'
/home/florian/dev/openwrt/trunk/staging_dir_mipsel/usr/include/glib-2.0/glib/gmappedfile.h:35: error: expected ')' before '*' token
In file included from /home/florian/dev/openwrt/trunk/staging_dir_mipsel/usr/include/glib-2.0/glib.h:53,
from sshfs.c:32:
/home/florian/dev/openwrt/trunk/staging_dir_mipsel/usr/include/glib-2.0/glib/gmarkup.h:41: error: storage class specified for parameter 'GMarkupError'
/home/florian/dev/openwrt/trunk/staging_dir_mipsel/usr/include/glib-2.0/glib/gmarkup.h:45: error: expected declaration specifiers before 'GQuark'
/home/florian/dev/openwrt/trunk/staging_dir_mipsel/usr/include/glib-2.0/glib/gmarkup.h:51: error: storage class specified for parameter 'GMarkupParseFlags'
/home/florian/dev/openwrt/trunk/staging_dir_mipsel/usr/include/glib-2.0/glib/gmarkup.h:53: error: storage class specified for parameter 'GMarkupParseContext'
/home/florian/dev/openwrt/trunk/staging_dir_mipsel/usr/include/glib-2.0/glib/gmarkup.h:54: error: storage class specified for parameter 'GMarkupParser'
/home/florian/dev/openwrt/trunk/staging_dir_mipsel/usr/include/glib-2.0/glib/gmarkup.h:59: error: expected ')' before '*' token
/home/florian/dev/openwrt/trunk/staging_dir_mipsel/usr/include/glib-2.0/glib/gmarkup.h:67: error: expected ';' before 'void'
/home/florian/dev/openwrt/trunk/staging_dir_mipsel/usr/include/glib-2.0/glib/gmarkup.h:97: warning: empty declaration
/home/florian/dev/openwrt/trunk/staging_dir_mipsel/usr/include/glib-2.0/glib/gmarkup.h:99: error: expected declaration specifiers before 'GMarkupParseContext'
/home/florian/dev/openwrt/trunk/staging_dir_mipsel/usr/include/glib-2.0/glib/gmarkup.h:103: error: expected ')' before '*' token
/home/florian/dev/openwrt/trunk/staging_dir_mipsel/usr/include/glib-2.0/glib/gmarkup.h:104: error: expected ')' before '*' token
/home/florian/dev/openwrt/trunk/staging_dir_mipsel/usr/include/glib-2.0/glib/gmarkup.h:109: error: expected ')' before '*' token
/home/florian/dev/openwrt/trunk/staging_dir_mipsel/usr/include/glib-2.0/glib/gmarkup.h:111: error: expected '=', ',', ';', 'asm' or '__attribute__' before '*' token
/home/florian/dev/openwrt/trunk/staging_dir_mipsel/usr/include/glib-2.0/glib/gmarkup.h:114: error: expected ')' before '*' token
/home/florian/dev/openwrt/trunk/staging_dir_mipsel/usr/include/glib-2.0/glib/gmarkup.h:119: error: expected declaration specifiers before 'gchar'
/home/florian/dev/openwrt/trunk/staging_dir_mipsel/usr/include/glib-2.0/glib/gmarkup.h:122: error: expected declaration specifiers before 'gchar'
/home/florian/dev/openwrt/trunk/staging_dir_mipsel/usr/include/glib-2.0/glib/gmarkup.h:124: error: expected declaration specifiers before 'gchar'
In file included from /home/florian/dev/openwrt/trunk/staging_dir_mipsel/usr/include/glib-2.0/glib.h:55,
from sshfs.c:32:
/home/florian/dev/openwrt/trunk/staging_dir_mipsel/usr/include/glib-2.0/glib/gmessages.h:44: error: expected declaration specifiers before 'gsize'
/home/florian/dev/openwrt/trunk/staging_dir_mipsel/usr/include/glib-2.0/glib/gmessages.h:69: error: storage class specified for parameter 'GLogLevelFlags'
/home/florian/dev/openwrt/trunk/staging_dir_mipsel/usr/include/glib-2.0/glib/gmessages.h:74: error: expected ';', ',' or ')' before '*' token
/home/florian/dev/openwrt/trunk/staging_dir_mipsel/usr/include/glib-2.0/glib/gmessages.h:81: error: expected ';', ',' or ')' before '*' token
/home/florian/dev/openwrt/trunk/staging_dir_mipsel/usr/include/glib-2.0/glib/gmessages.h:85: error: expected ';', ',' or ')' before '*' token
/home/florian/dev/openwrt/trunk/staging_dir_mipsel/usr/include/glib-2.0/glib/gmessages.h:87: error: expected ';', ',' or ')' before '*' token
/home/florian/dev/openwrt/trunk/staging_dir_mipsel/usr/include/glib-2.0/glib/gmessages.h:91: error: expected declaration specifiers before 'GLogFunc'
/home/florian/dev/openwrt/trunk/staging_dir_mipsel/usr/include/glib-2.0/glib/gmessages.h:93: error: expected ';', ',' or ')' before '*' token
/home/florian/dev/openwrt/trunk/staging_dir_mipsel/usr/include/glib-2.0/glib/gmessages.h:97: error: expected ';', ',' or ')' before '*' token
/home/florian/dev/openwrt/trunk/staging_dir_mipsel/usr/include/glib-2.0/glib/gmessages.h:101: error: expected declaration specifiers before 'GLogLevelFlags'
/home/florian/dev/openwrt/trunk/staging_dir_mipsel/usr/include/glib-2.0/glib/gmessages.h:103: error: expected declaration specifiers before 'GLogLevelFlags'
/home/florian/dev/openwrt/trunk/staging_dir_mipsel/usr/include/glib-2.0/glib/gmessages.h:106: error: expected ';', ',' or ')' before '*' token
/home/florian/dev/openwrt/trunk/staging_dir_mipsel/usr/include/glib-2.0/glib/gmessages.h:159: error: expected ';', ',' or ')' before '*' token
/home/florian/dev/openwrt/trunk/staging_dir_mipsel/usr/include/glib-2.0/glib/gmessages.h:168: error: expected ';', ',' or ')' before '*' token
/home/florian/dev/openwrt/trunk/staging_dir_mipsel/usr/include/glib-2.0/glib/gmessages.h:177: error: expected ';', ',' or ')' before '*' token
/home/florian/dev/openwrt/trunk/staging_dir_mipsel/usr/include/glib-2.0/glib/gmessages.h:186: error: expected ';', ',' or ')' before '*' token
/home/florian/dev/openwrt/trunk/staging_dir_mipsel/usr/include/glib-2.0/glib/gmessages.h:195: error: expected ';', ',' or ')' before '*' token
/home/florian/dev/openwrt/trunk/staging_dir_mipsel/usr/include/glib-2.0/glib/gmessages.h:205: error: expected ';', ',' or ')' before '*' token
/home/florian/dev/openwrt/trunk/staging_dir_mipsel/usr/include/glib-2.0/glib/gmessages.h:206: error: expected ';', ',' or ')' before '*' token
/home/florian/dev/openwrt/trunk/staging_dir_mipsel/usr/include/glib-2.0/glib/gmessages.h:208: error: expected declaration specifiers before 'GPrintFunc'
/home/florian/dev/openwrt/trunk/staging_dir_mipsel/usr/include/glib-2.0/glib/gmessages.h:209: error: expected ';', ',' or ')' before '*' token
/home/florian/dev/openwrt/trunk/staging_dir_mipsel/usr/include/glib-2.0/glib/gmessages.h:211: error: expected declaration specifiers before 'GPrintFunc'
In file included from /home/florian/dev/openwrt/trunk/staging_dir_mipsel/usr/include/glib-2.0/glib.h:56,
from sshfs.c:32:
/home/florian/dev/openwrt/trunk/staging_dir_mipsel/usr/include/glib-2.0/glib/gnode.h:34: error: storage class specified for parameter 'GNode'
/home/florian/dev/openwrt/trunk/staging_dir_mipsel/usr/include/glib-2.0/glib/gnode.h:45: error: storage class specified for parameter 'GTraverseFlags'
/home/florian/dev/openwrt/trunk/staging_dir_mipsel/usr/include/glib-2.0/glib/gnode.h:54: error: storage class specified for parameter 'GTraverseType'
/home/florian/dev/openwrt/trunk/staging_dir_mipsel/usr/include/glib-2.0/glib/gnode.h:56: error: expected ')' before '*' token
/home/florian/dev/openwrt/trunk/staging_dir_mipsel/usr/include/glib-2.0/glib/gnode.h:58: error: expected ')' before '*' token
/home/florian/dev/openwrt/trunk/staging_dir_mipsel/usr/include/glib-2.0/glib/gnode.h:61: error: storage class specified for parameter 'GCopyFunc'
/home/florian/dev/openwrt/trunk/staging_dir_mipsel/usr/include/glib-2.0/glib/gnode.h:68: error: expected specifier-qualifier-list before 'GNode'
/home/florian/dev/openwrt/trunk/staging_dir_mipsel/usr/include/glib-2.0/glib/gnode.h:72: warning: empty declaration
/home/florian/dev/openwrt/trunk/staging_dir_mipsel/usr/include/glib-2.0/glib/gnode.h:79: error: expected declaration specifiers before 'GNode'
/home/florian/dev/openwrt/trunk/staging_dir_mipsel/usr/include/glib-2.0/glib/gnode.h:80: error: expected ')' before '*' token
/home/florian/dev/openwrt/trunk/staging_dir_mipsel/usr/include/glib-2.0/glib/gnode.h:81: error: expected ')' before '*' token
/home/florian/dev/openwrt/trunk/staging_dir_mipsel/usr/include/glib-2.0/glib/gnode.h:82: error: expected declaration specifiers before 'GNode'
/home/florian/dev/openwrt/trunk/staging_dir_mipsel/usr/include/glib-2.0/glib/gnode.h:85: error: expected declaration specifiers before 'GNode'
/home/florian/dev/openwrt/trunk/staging_dir_mipsel/usr/include/glib-2.0/glib/gnode.h:86: error: expected declaration specifiers before 'GNode'
/home/florian/dev/openwrt/trunk/staging_dir_mipsel/usr/include/glib-2.0/glib/gnode.h:89: error: expected declaration specifiers before 'GNode'
/home/florian/dev/openwrt/trunk/staging_dir_mipsel/usr/include/glib-2.0/glib/gnode.h:92: error: expected declaration specifiers before 'GNode'
/home/florian/dev/openwrt/trunk/staging_dir_mipsel/usr/include/glib-2.0/glib/gnode.h:95: error: expected declaration specifiers before 'GNode'
/home/florian/dev/openwrt/trunk/staging_dir_mipsel/usr/include/glib-2.0/glib/gnode.h:97: error: expected ')' before '*' token
/home/florian/dev/openwrt/trunk/staging_dir_mipsel/usr/include/glib-2.0/glib/gnode.h:99: error: expected declaration specifiers before 'GNode'
/home/florian/dev/openwrt/trunk/staging_dir_mipsel/usr/include/glib-2.0/glib/gnode.h:100: error: expected ')' before '*' token
/home/florian/dev/openwrt/trunk/staging_dir_mipsel/usr/include/glib-2.0/glib/gnode.h:102: error: expected ')' before '*' token
/home/florian/dev/openwrt/trunk/staging_dir_mipsel/usr/include/glib-2.0/glib/gnode.h:103: error: expected declaration specifiers before 'GNode'
/home/florian/dev/openwrt/trunk/staging_dir_mipsel/usr/include/glib-2.0/glib/gnode.h:125: error: expected ')' before '*' token
/home/florian/dev/openwrt/trunk/staging_dir_mipsel/usr/include/glib-2.0/glib/gnode.h:137: error: expected ')' before '*' token
/home/florian/dev/openwrt/trunk/staging_dir_mipsel/usr/include/glib-2.0/glib/gnode.h:139: error: expected ')' before '*' token
/home/florian/dev/openwrt/trunk/staging_dir_mipsel/usr/include/glib-2.0/glib/gnode.h:143: error: expected ')' before '*' token
/home/florian/dev/openwrt/trunk/staging_dir_mipsel/usr/include/glib-2.0/glib/gnode.h:144: error: expected ')' before '*' token
/home/florian/dev/openwrt/trunk/staging_dir_mipsel/usr/include/glib-2.0/glib/gnode.h:145: error: expected declaration specifiers before 'GNode'
/home/florian/dev/openwrt/trunk/staging_dir_mipsel/usr/include/glib-2.0/glib/gnode.h:147: error: expected declaration specifiers before 'GNode'
/home/florian/dev/openwrt/trunk/staging_dir_mipsel/usr/include/glib-2.0/glib/gnode.h:148: error: expected declaration specifiers before 'GNode'
/home/florian/dev/openwrt/trunk/staging_dir_mipsel/usr/include/glib-2.0/glib/gnode.h:151: error: expected ')' before '*' token
/home/florian/dev/openwrt/trunk/staging_dir_mipsel/usr/include/glib-2.0/glib/gnode.h:153: error: expected ')' before '*' token
/home/florian/dev/openwrt/trunk/staging_dir_mipsel/usr/include/glib-2.0/glib/gnode.h:156: error: expected declaration specifiers before 'GNode'
/home/florian/dev/openwrt/trunk/staging_dir_mipsel/usr/include/glib-2.0/glib/gnode.h:157: error: expected declaration specifiers before 'GNode'
In file included from /home/florian/dev/openwrt/trunk/staging_dir_mipsel/usr/include/glib-2.0/glib.h:57,
from sshfs.c:32:
/home/florian/dev/openwrt/trunk/staging_dir_mipsel/usr/include/glib-2.0/glib/goption.h:29: error: storage class specified for parameter 'GOptionContext'
/home/florian/dev/openwrt/trunk/staging_dir_mipsel/usr/include/glib-2.0/glib/goption.h:30: error: storage class specified for parameter 'GOptionGroup'
/home/florian/dev/openwrt/trunk/staging_dir_mipsel/usr/include/glib-2.0/glib/goption.h:31: error: storage class specified for parameter 'GOptionEntry'
/home/florian/dev/openwrt/trunk/staging_dir_mipsel/usr/include/glib-2.0/glib/goption.h:42: error: storage class specified for parameter 'GOptionFlags'
/home/florian/dev/openwrt/trunk/staging_dir_mipsel/usr/include/glib-2.0/glib/goption.h:55: error: storage class specified for parameter 'GOptionArg'
/home/florian/dev/openwrt/trunk/staging_dir_mipsel/usr/include/glib-2.0/glib/goption.h:57: warning: type defaults to 'int' in declaration of 'gchar'
/home/florian/dev/openwrt/trunk/staging_dir_mipsel/usr/include/glib-2.0/glib/goption.h:57: error: expected ';', ',' or ')' before '*' token
/home/florian/dev/openwrt/trunk/staging_dir_mipsel/usr/include/glib-2.0/glib/goption.h:62: error: expected ')' before '*' token
/home/florian/dev/openwrt/trunk/staging_dir_mipsel/usr/include/glib-2.0/glib/goption.h:67: error: expected ')' before '*' token
/home/florian/dev/openwrt/trunk/staging_dir_mipsel/usr/include/glib-2.0/glib/goption.h:79: error: storage class specified for parameter 'GOptionError'
/home/florian/dev/openwrt/trunk/staging_dir_mipsel/usr/include/glib-2.0/glib/goption.h:81: error: expected declaration specifiers before 'GQuark'
/home/florian/dev/openwrt/trunk/staging_dir_mipsel/usr/include/glib-2.0/glib/goption.h:86: error: expected ':', ',', ';', '}' or '__attribute__' before '*' token
/home/florian/dev/openwrt/trunk/staging_dir_mipsel/usr/include/glib-2.0/glib/goption.h:95: warning: empty declaration
/home/florian/dev/openwrt/trunk/staging_dir_mipsel/usr/include/glib-2.0/glib/goption.h:99: error: expected declaration specifiers before 'GOptionContext'
/home/florian/dev/openwrt/trunk/staging_dir_mipsel/usr/include/glib-2.0/glib/goption.h:100: error: expected ')' before '*' token
/home/florian/dev/openwrt/trunk/staging_dir_mipsel/usr/include/glib-2.0/glib/goption.h:102: error: expected '=', ',', ';', 'asm' or '__attribute__' before '*' token
/home/florian/dev/openwrt/trunk/staging_dir_mipsel/usr/include/glib-2.0/glib/goption.h:103: error: expected ')' before '*' token
/home/florian/dev/openwrt/trunk/staging_dir_mipsel/usr/include/glib-2.0/glib/goption.h:105: error: expected '=', ',', ';', 'asm' or '__attribute__' before '*' token
/home/florian/dev/openwrt/trunk/staging_dir_mipsel/usr/include/glib-2.0/glib/goption.h:106: error: expected ')' before '*' token
/home/florian/dev/openwrt/trunk/staging_dir_mipsel/usr/include/glib-2.0/glib/goption.h:107: error: expected ')' before '*' token
/home/florian/dev/openwrt/trunk/staging_dir_mipsel/usr/include/glib-2.0/glib/goption.h:109: error: expected ')' before '*' token
/home/florian/dev/openwrt/trunk/staging_dir_mipsel/usr/include/glib-2.0/glib/goption.h:110: error: expected ')' before '*' token
/home/florian/dev/openwrt/trunk/staging_dir_mipsel/usr/include/glib-2.0/glib/goption.h:112: error: expected ')' before '*' token
/home/florian/dev/openwrt/trunk/staging_dir_mipsel/usr/include/glib-2.0/glib/goption.h:114: error: expected ')' before '*' token
/home/florian/dev/openwrt/trunk/staging_dir_mipsel/usr/include/glib-2.0/glib/goption.h:117: error: expected ')' before '*' token
/home/florian/dev/openwrt/trunk/staging_dir_mipsel/usr/include/glib-2.0/glib/goption.h:121: error: expected ')' before '*' token
/home/florian/dev/openwrt/trunk/staging_dir_mipsel/usr/include/glib-2.0/glib/goption.h:125: error: expected ')' before '*' token
/home/florian/dev/openwrt/trunk/staging_dir_mipsel/usr/include/glib-2.0/glib/goption.h:128: error: expected ')' before '*' token
/home/florian/dev/openwrt/trunk/staging_dir_mipsel/usr/include/glib-2.0/glib/goption.h:130: error: expected ')' before '*' token
/home/florian/dev/openwrt/trunk/staging_dir_mipsel/usr/include/glib-2.0/glib/goption.h:132: error: expected declaration specifiers before 'GOptionGroup'
/home/florian/dev/openwrt/trunk/staging_dir_mipsel/usr/include/glib-2.0/glib/goption.h:135: error: expected declaration specifiers before 'GOptionGroup'
/home/florian/dev/openwrt/trunk/staging_dir_mipsel/usr/include/glib-2.0/glib/goption.h:140: error: expected ')' before '*' token
/home/florian/dev/openwrt/trunk/staging_dir_mipsel/usr/include/glib-2.0/glib/goption.h:143: error: expected ')' before '*' token
/home/florian/dev/openwrt/trunk/staging_dir_mipsel/usr/include/glib-2.0/glib/goption.h:145: error: expected ')' before '*' token
/home/florian/dev/openwrt/trunk/staging_dir_mipsel/usr/include/glib-2.0/glib/goption.h:146: error: expected ')' before '*' token
/home/florian/dev/openwrt/trunk/staging_dir_mipsel/usr/include/glib-2.0/glib/goption.h:148: error: expected ')' before '*' token
/home/florian/dev/openwrt/trunk/staging_dir_mipsel/usr/include/glib-2.0/glib/goption.h:152: error: expected ')' before '*' token
In file included from /home/florian/dev/openwrt/trunk/staging_dir_mipsel/usr/include/glib-2.0/glib.h:58,
from sshfs.c:32:
/home/florian/dev/openwrt/trunk/staging_dir_mipsel/usr/include/glib-2.0/glib/gpattern.h:27: error: storage class specified for parameter 'GPatternSpec'
/home/florian/dev/openwrt/trunk/staging_dir_mipsel/usr/include/glib-2.0/glib/gpattern.h:29: error: expected declaration specifiers before 'GPatternSpec'
/home/florian/dev/openwrt/trunk/staging_dir_mipsel/usr/include/glib-2.0/glib/gpattern.h:30: error: expected ')' before '*' token
/home/florian/dev/openwrt/trunk/staging_dir_mipsel/usr/include/glib-2.0/glib/gpattern.h:31: error: expected ')' before '*' token
/home/florian/dev/openwrt/trunk/staging_dir_mipsel/usr/include/glib-2.0/glib/gpattern.h:33: error: expected ')' before '*' token
/home/florian/dev/openwrt/trunk/staging_dir_mipsel/usr/include/glib-2.0/glib/gpattern.h:37: error: expected ')' before '*' token
/home/florian/dev/openwrt/trunk/staging_dir_mipsel/usr/include/glib-2.0/glib/gpattern.h:39: warning: type defaults to 'int' in declaration of 'gchar'
/home/florian/dev/openwrt/trunk/staging_dir_mipsel/usr/include/glib-2.0/glib/gpattern.h:39: error: expected ';', ',' or ')' before '*' token
In file included from /home/florian/dev/openwrt/trunk/staging_dir_mipsel/usr/include/glib-2.0/glib.h:60,
from sshfs.c:32:
/home/florian/dev/openwrt/trunk/staging_dir_mipsel/usr/include/glib-2.0/glib/gqsort.h:37: error: expected declaration specifiers or '...' before 'gsize'
In file included from /home/florian/dev/openwrt/trunk/staging_dir_mipsel/usr/include/glib-2.0/glib.h:62,
from sshfs.c:32:
/home/florian/dev/openwrt/trunk/staging_dir_mipsel/usr/include/glib-2.0/glib/gqueue.h:34: error: storage class specified for parameter 'GQueue'
/home/florian/dev/openwrt/trunk/staging_dir_mipsel/usr/include/glib-2.0/glib/gqueue.h:38: error: expected specifier-qualifier-list before 'GList'
/home/florian/dev/openwrt/trunk/staging_dir_mipsel/usr/include/glib-2.0/glib/gqueue.h:41: warning: empty declaration
/home/florian/dev/openwrt/trunk/staging_dir_mipsel/usr/include/glib-2.0/glib/gqueue.h:45: error: expected declaration specifiers before 'GQueue'
/home/florian/dev/openwrt/trunk/staging_dir_mipsel/usr/include/glib-2.0/glib/gqueue.h:46: error: expected ')' before '*' token
/home/florian/dev/openwrt/trunk/staging_dir_mipsel/usr/include/glib-2.0/glib/gqueue.h:47: error: expected ')' before '*' token
/home/florian/dev/openwrt/trunk/staging_dir_mipsel/usr/include/glib-2.0/glib/gqueue.h:48: error: expected ')' before '*' token
/home/florian/dev/openwrt/trunk/staging_dir_mipsel/usr/include/glib-2.0/glib/gqueue.h:49: error: expected ')' before '*' token
/home/florian/dev/openwrt/trunk/staging_dir_mipsel/usr/include/glib-2.0/glib/gqueue.h:50: error: expected declaration specifiers before 'GQueue'
/home/florian/dev/openwrt/trunk/staging_dir_mipsel/usr/include/glib-2.0/glib/gqueue.h:51: error: expected ')' before '*' token
/home/florian/dev/openwrt/trunk/staging_dir_mipsel/usr/include/glib-2.0/glib/gqueue.h:54: error: expected declaration specifiers before 'GList'
/home/florian/dev/openwrt/trunk/staging_dir_mipsel/usr/include/glib-2.0/glib/gqueue.h:56: error: expected declaration specifiers before 'GList'
/home/florian/dev/openwrt/trunk/staging_dir_mipsel/usr/include/glib-2.0/glib/gqueue.h:59: error: expected ')' before '*' token
/home/florian/dev/openwrt/trunk/staging_dir_mipsel/usr/include/glib-2.0/glib/gqueue.h:63: error: expected ')' before '*' token
/home/florian/dev/openwrt/trunk/staging_dir_mipsel/usr/include/glib-2.0/glib/gqueue.h:65: error: expected ')' before '*' token
/home/florian/dev/openwrt/trunk/staging_dir_mipsel/usr/include/glib-2.0/glib/gqueue.h:67: error: expected ')' before '*' token
/home/florian/dev/openwrt/trunk/staging_dir_mipsel/usr/include/glib-2.0/glib/gqueue.h:70: error: expected ')' before '*' token
/home/florian/dev/openwrt/trunk/staging_dir_mipsel/usr/include/glib-2.0/glib/gqueue.h:71: error: expected ')' before '*' token
/home/florian/dev/openwrt/trunk/staging_dir_mipsel/usr/include/glib-2.0/glib/gqueue.h:72: error: expected ')' before '*' token
/home/florian/dev/openwrt/trunk/staging_dir_mipsel/usr/include/glib-2.0/glib/gqueue.h:74: error: expected ')' before '*' token
/home/florian/dev/openwrt/trunk/staging_dir_mipsel/usr/include/glib-2.0/glib/gqueue.h:75: error: expected ')' before '*' token
/home/florian/dev/openwrt/trunk/staging_dir_mipsel/usr/include/glib-2.0/glib/gqueue.h:76: error: expected ')' before '*' token
/home/florian/dev/openwrt/trunk/staging_dir_mipsel/usr/include/glib-2.0/glib/gqueue.h:78: error: expected ')' before '*' token
/home/florian/dev/openwrt/trunk/staging_dir_mipsel/usr/include/glib-2.0/glib/gqueue.h:80: error: expected ')' before '*' token
/home/florian/dev/openwrt/trunk/staging_dir_mipsel/usr/include/glib-2.0/glib/gqueue.h:82: error: expected ')' before '*' token
/home/florian/dev/openwrt/trunk/staging_dir_mipsel/usr/include/glib-2.0/glib/gqueue.h:84: error: expected ')' before '*' token
/home/florian/dev/openwrt/trunk/staging_dir_mipsel/usr/include/glib-2.0/glib/gqueue.h:87: error: expected ')' before '*' token
/home/florian/dev/openwrt/trunk/staging_dir_mipsel/usr/include/glib-2.0/glib/gqueue.h:90: error: expected ')' before '*' token
/home/florian/dev/openwrt/trunk/staging_dir_mipsel/usr/include/glib-2.0/glib/gqueue.h:95: error: expected ')' before '*' token
/home/florian/dev/openwrt/trunk/staging_dir_mipsel/usr/include/glib-2.0/glib/gqueue.h:97: error: expected ')' before '*' token
/home/florian/dev/openwrt/trunk/staging_dir_mipsel/usr/include/glib-2.0/glib/gqueue.h:99: error: expected ')' before '*' token
/home/florian/dev/openwrt/trunk/staging_dir_mipsel/usr/include/glib-2.0/glib/gqueue.h:102: error: expected declaration specifiers before 'GList'
/home/florian/dev/openwrt/trunk/staging_dir_mipsel/usr/include/glib-2.0/glib/gqueue.h:103: error: expected declaration specifiers before 'GList'
/home/florian/dev/openwrt/trunk/staging_dir_mipsel/usr/include/glib-2.0/glib/gqueue.h:104: error: expected declaration specifiers before 'GList'
/home/florian/dev/openwrt/trunk/staging_dir_mipsel/usr/include/glib-2.0/glib/gqueue.h:106: error: expected declaration specifiers before 'GList'
/home/florian/dev/openwrt/trunk/staging_dir_mipsel/usr/include/glib-2.0/glib/gqueue.h:107: error: expected declaration specifiers before 'GList'
/home/florian/dev/openwrt/trunk/staging_dir_mipsel/usr/include/glib-2.0/glib/gqueue.h:108: error: expected declaration specifiers before 'GList'
/home/florian/dev/openwrt/trunk/staging_dir_mipsel/usr/include/glib-2.0/glib/gqueue.h:110: error: expected ')' before '*' token
/home/florian/dev/openwrt/trunk/staging_dir_mipsel/usr/include/glib-2.0/glib/gqueue.h:112: error: expected ')' before '*' token
/home/florian/dev/openwrt/trunk/staging_dir_mipsel/usr/include/glib-2.0/glib/gqueue.h:114: error: expected ')' before '*' token
In file included from /home/florian/dev/openwrt/trunk/staging_dir_mipsel/usr/include/glib-2.0/glib.h:63,
from sshfs.c:32:
/home/florian/dev/openwrt/trunk/staging_dir_mipsel/usr/include/glib-2.0/glib/grand.h:34: error: storage class specified for parameter 'GRand'
/home/florian/dev/openwrt/trunk/staging_dir_mipsel/usr/include/glib-2.0/glib/grand.h:45: error: expected declaration specifiers before 'GRand'
/home/florian/dev/openwrt/trunk/staging_dir_mipsel/usr/include/glib-2.0/glib/grand.h:46: error: expected declaration specifiers before 'GRand'
/home/florian/dev/openwrt/trunk/staging_dir_mipsel/usr/include/glib-2.0/glib/grand.h:48: error: expected declaration specifiers before 'GRand'
/home/florian/dev/openwrt/trunk/staging_dir_mipsel/usr/include/glib-2.0/glib/grand.h:49: error: expected ')' before '*' token
/home/florian/dev/openwrt/trunk/staging_dir_mipsel/usr/include/glib-2.0/glib/grand.h:50: error: expected declaration specifiers before 'GRand'
/home/florian/dev/openwrt/trunk/staging_dir_mipsel/usr/include/glib-2.0/glib/grand.h:51: error: expected ')' before '*' token
/home/florian/dev/openwrt/trunk/staging_dir_mipsel/usr/include/glib-2.0/glib/grand.h:53: error: expected ')' before '*' token
/home/florian/dev/openwrt/trunk/staging_dir_mipsel/usr/include/glib-2.0/glib/grand.h:59: error: expected ')' before '*' token
/home/florian/dev/openwrt/trunk/staging_dir_mipsel/usr/include/glib-2.0/glib/grand.h:60: error: expected ')' before '*' token
/home/florian/dev/openwrt/trunk/staging_dir_mipsel/usr/include/glib-2.0/glib/grand.h:63: error: expected ')' before '*' token
/home/florian/dev/openwrt/trunk/staging_dir_mipsel/usr/include/glib-2.0/glib/grand.h:64: error: expected ')' before '*' token
In file included from /home/florian/dev/openwrt/trunk/staging_dir_mipsel/usr/include/glib-2.0/glib.h:64,
from sshfs.c:32:
/home/florian/dev/openwrt/trunk/staging_dir_mipsel/usr/include/glib-2.0/glib/grel.h:34: error: storage class specified for parameter 'GRelation'
/home/florian/dev/openwrt/trunk/staging_dir_mipsel/usr/include/glib-2.0/glib/grel.h:35: error: storage class specified for parameter 'GTuples'
/home/florian/dev/openwrt/trunk/staging_dir_mipsel/usr/include/glib-2.0/glib/grel.h:40: warning: empty declaration
/home/florian/dev/openwrt/trunk/staging_dir_mipsel/usr/include/glib-2.0/glib/grel.h:65: error: expected declaration specifiers before 'GRelation'
/home/florian/dev/openwrt/trunk/staging_dir_mipsel/usr/include/glib-2.0/glib/grel.h:66: error: expected ')' before '*' token
/home/florian/dev/openwrt/trunk/staging_dir_mipsel/usr/include/glib-2.0/glib/grel.h:67: error: expected ')' before '*' token
/home/florian/dev/openwrt/trunk/staging_dir_mipsel/usr/include/glib-2.0/glib/grel.h:71: error: expected ')' before '*' token
/home/florian/dev/openwrt/trunk/staging_dir_mipsel/usr/include/glib-2.0/glib/grel.h:73: error: expected ')' before '*' token
/home/florian/dev/openwrt/trunk/staging_dir_mipsel/usr/include/glib-2.0/glib/grel.h:76: error: expected declaration specifiers before 'GTuples'
/home/florian/dev/openwrt/trunk/staging_dir_mipsel/usr/include/glib-2.0/glib/grel.h:79: error: expected ')' before '*' token
/home/florian/dev/openwrt/trunk/staging_dir_mipsel/usr/include/glib-2.0/glib/grel.h:82: error: expected ')' before '*' token
/home/florian/dev/openwrt/trunk/staging_dir_mipsel/usr/include/glib-2.0/glib/grel.h:84: error: expected ')' before '*' token
/home/florian/dev/openwrt/trunk/staging_dir_mipsel/usr/include/glib-2.0/glib/grel.h:86: error: expected ')' before '*' token
/home/florian/dev/openwrt/trunk/staging_dir_mipsel/usr/include/glib-2.0/glib/grel.h:87: error: expected ')' before '*' token
In file included from /home/florian/dev/openwrt/trunk/staging_dir_mipsel/usr/include/glib-2.0/glib.h:65,
from sshfs.c:32:
/home/florian/dev/openwrt/trunk/staging_dir_mipsel/usr/include/glib-2.0/glib/gscanner.h:35: error: storage class specified for parameter 'GScanner'
/home/florian/dev/openwrt/trunk/staging_dir_mipsel/usr/include/glib-2.0/glib/gscanner.h:36: error: storage class specified for parameter 'GScannerConfig'
/home/florian/dev/openwrt/trunk/staging_dir_mipsel/usr/include/glib-2.0/glib/gscanner.h:37: error: storage class specified for parameter 'GTokenValue'
/home/florian/dev/openwrt/trunk/staging_dir_mipsel/usr/include/glib-2.0/glib/gscanner.h:39: error: expected ')' before '*' token
/home/florian/dev/openwrt/trunk/staging_dir_mipsel/usr/include/glib-2.0/glib/gscanner.h:70: error: storage class specified for parameter 'GErrorType'
/home/florian/dev/openwrt/trunk/staging_dir_mipsel/usr/include/glib-2.0/glib/gscanner.h:105: error: storage class specified for parameter 'GTokenType'
/home/florian/dev/openwrt/trunk/staging_dir_mipsel/usr/include/glib-2.0/glib/gscanner.h:110: error: expected specifier-qualifier-list before 'gchar'
/home/florian/dev/openwrt/trunk/staging_dir_mipsel/usr/include/glib-2.0/glib/gscanner.h:121: warning: empty declaration
/home/florian/dev/openwrt/trunk/staging_dir_mipsel/usr/include/glib-2.0/glib/gscanner.h:127: error: expected specifier-qualifier-list before 'gchar'
/home/florian/dev/openwrt/trunk/staging_dir_mipsel/usr/include/glib-2.0/glib/gscanner.h:161: warning: empty declaration
/home/florian/dev/openwrt/trunk/staging_dir_mipsel/usr/include/glib-2.0/glib/gscanner.h:173: error: expected ':', ',', ';', '}' or '__attribute__' before '*' token
/home/florian/dev/openwrt/trunk/staging_dir_mipsel/usr/include/glib-2.0/glib/gscanner.h:203: warning: empty declaration
/home/florian/dev/openwrt/trunk/staging_dir_mipsel/usr/include/glib-2.0/glib/gscanner.h:205: error: expected declaration specifiers before 'GScanner'
/home/florian/dev/openwrt/trunk/staging_dir_mipsel/usr/include/glib-2.0/glib/gscanner.h:206: error: expected ')' before '*' token
/home/florian/dev/openwrt/trunk/staging_dir_mipsel/usr/include/glib-2.0/glib/gscanner.h:207: error: expected ')' before '*' token
/home/florian/dev/openwrt/trunk/staging_dir_mipsel/usr/include/glib-2.0/glib/gscanner.h:209: error: expected ')' before '*' token
/home/florian/dev/openwrt/trunk/staging_dir_mipsel/usr/include/glib-2.0/glib/gscanner.h:210: error: expected ')' before '*' token
/home/florian/dev/openwrt/trunk/staging_dir_mipsel/usr/include/glib-2.0/glib/gscanner.h:213: error: expected declaration specifiers before 'GTokenType'
/home/florian/dev/openwrt/trunk/staging_dir_mipsel/usr/include/glib-2.0/glib/gscanner.h:214: error: expected declaration specifiers before 'GTokenType'
/home/florian/dev/openwrt/trunk/staging_dir_mipsel/usr/include/glib-2.0/glib/gscanner.h:215: error: expected declaration specifiers before 'GTokenType'
/home/florian/dev/openwrt/trunk/staging_dir_mipsel/usr/include/glib-2.0/glib/gscanner.h:216: error: expected declaration specifiers before 'GTokenValue'
/home/florian/dev/openwrt/trunk/staging_dir_mipsel/usr/include/glib-2.0/glib/gscanner.h:217: error: expected ')' before '*' token
/home/florian/dev/openwrt/trunk/staging_dir_mipsel/usr/include/glib-2.0/glib/gscanner.h:218: error: expected ')' before '*' token
/home/florian/dev/openwrt/trunk/staging_dir_mipsel/usr/include/glib-2.0/glib/gscanner.h:219: error: expected ')' before '*' token
/home/florian/dev/openwrt/trunk/staging_dir_mipsel/usr/include/glib-2.0/glib/gscanner.h:220: error: expected ')' before '*' token
/home/florian/dev/openwrt/trunk/staging_dir_mipsel/usr/include/glib-2.0/glib/gscanner.h:222: error: expected ')' before '*' token
/home/florian/dev/openwrt/trunk/staging_dir_mipsel/usr/include/glib-2.0/glib/gscanner.h:226: error: expected ')' before '*' token
/home/florian/dev/openwrt/trunk/staging_dir_mipsel/usr/include/glib-2.0/glib/gscanner.h:229: error: expected ')' before '*' token
/home/florian/dev/openwrt/trunk/staging_dir_mipsel/usr/include/glib-2.0/glib/gscanner.h:232: error: expected ')' before '*' token
/home/florian/dev/openwrt/trunk/staging_dir_mipsel/usr/include/glib-2.0/glib/gscanner.h:236: error: expected ')' before '*' token
/home/florian/dev/openwrt/trunk/staging_dir_mipsel/usr/include/glib-2.0/glib/gscanner.h:238: error: expected ')' before '*' token
/home/florian/dev/openwrt/trunk/staging_dir_mipsel/usr/include/glib-2.0/glib/gscanner.h:245: error: expected ')' before '*' token
/home/florian/dev/openwrt/trunk/staging_dir_mipsel/usr/include/glib-2.0/glib/gscanner.h:248: error: expected ')' before '*' token
In file included from /home/florian/dev/openwrt/trunk/staging_dir_mipsel/usr/include/glib-2.0/glib.h:66,
from sshfs.c:32:
/home/florian/dev/openwrt/trunk/staging_dir_mipsel/usr/include/glib-2.0/glib/gshell.h:37: error: storage class specified for parameter 'GShellError'
/home/florian/dev/openwrt/trunk/staging_dir_mipsel/usr/include/glib-2.0/glib/gshell.h:39: error: expected declaration specifiers before 'GQuark'
/home/florian/dev/openwrt/trunk/staging_dir_mipsel/usr/include/glib-2.0/glib/gshell.h:41: error: expected declaration specifiers before 'gchar'
/home/florian/dev/openwrt/trunk/staging_dir_mipsel/usr/include/glib-2.0/glib/gshell.h:42: error: expected declaration specifiers before 'gchar'
/home/florian/dev/openwrt/trunk/staging_dir_mipsel/usr/include/glib-2.0/glib/gshell.h:44: warning: type defaults to 'int' in declaration of 'gchar'
/home/florian/dev/openwrt/trunk/staging_dir_mipsel/usr/include/glib-2.0/glib/gshell.h:44: error: expected ';', ',' or ')' before '*' token
In file included from /home/florian/dev/openwrt/trunk/staging_dir_mipsel/usr/include/glib-2.0/glib.h:68,
from sshfs.c:32:
/home/florian/dev/openwrt/trunk/staging_dir_mipsel/usr/include/glib-2.0/glib/gspawn.h:55: error: storage class specified for parameter 'GSpawnError'
/home/florian/dev/openwrt/trunk/staging_dir_mipsel/usr/include/glib-2.0/glib/gspawn.h:57: error: storage class specified for parameter 'GSpawnChildSetupFunc'
/home/florian/dev/openwrt/trunk/staging_dir_mipsel/usr/include/glib-2.0/glib/gspawn.h:70: error: storage class specified for parameter 'GSpawnFlags'
/home/florian/dev/openwrt/trunk/staging_dir_mipsel/usr/include/glib-2.0/glib/gspawn.h:72: error: expected declaration specifiers before 'GQuark'
/home/florian/dev/openwrt/trunk/staging_dir_mipsel/usr/include/glib-2.0/glib/gspawn.h:82: warning: type defaults to 'int' in declaration of 'gchar'
/home/florian/dev/openwrt/trunk/staging_dir_mipsel/usr/include/glib-2.0/glib/gspawn.h:82: error: expected ';', ',' or ')' before '*' token
/home/florian/dev/openwrt/trunk/staging_dir_mipsel/usr/include/glib-2.0/glib/gspawn.h:95: warning: type defaults to 'int' in declaration of 'gchar'
/home/florian/dev/openwrt/trunk/staging_dir_mipsel/usr/include/glib-2.0/glib/gspawn.h:95: error: expected ';', ',' or ')' before '*' token
/home/florian/dev/openwrt/trunk/staging_dir_mipsel/usr/include/glib-2.0/glib/gspawn.h:112: warning: type defaults to 'int' in declaration of 'gchar'
/home/florian/dev/openwrt/trunk/staging_dir_mipsel/usr/include/glib-2.0/glib/gspawn.h:112: error: expected ';', ',' or ')' before '*' token
/home/florian/dev/openwrt/trunk/staging_dir_mipsel/usr/include/glib-2.0/glib/gspawn.h:123: warning: type defaults to 'int' in declaration of 'gchar'
/home/florian/dev/openwrt/trunk/staging_dir_mipsel/usr/include/glib-2.0/glib/gspawn.h:123: error: expected ';', ',' or ')' before '*' token
/home/florian/dev/openwrt/trunk/staging_dir_mipsel/usr/include/glib-2.0/glib/gspawn.h:128: warning: type defaults to 'int' in declaration of 'gchar'
/home/florian/dev/openwrt/trunk/staging_dir_mipsel/usr/include/glib-2.0/glib/gspawn.h:128: error: expected ';', ',' or ')' before '*' token
/home/florian/dev/openwrt/trunk/staging_dir_mipsel/usr/include/glib-2.0/glib/gspawn.h:131: error: expected ')' before 'pid'
In file included from /home/florian/dev/openwrt/trunk/staging_dir_mipsel/usr/include/glib-2.0/glib.h:69,
from sshfs.c:32:
/home/florian/dev/openwrt/trunk/staging_dir_mipsel/usr/include/glib-2.0/glib/gstrfuncs.h:48: error: storage class specified for parameter 'GAsciiType'
/home/florian/dev/openwrt/trunk/staging_dir_mipsel/usr/include/glib-2.0/glib/gstrfuncs.h:50: error: storage class specified for parameter 'g_ascii_table'
/home/florian/dev/openwrt/trunk/staging_dir_mipsel/usr/include/glib-2.0/glib/gstrfuncs.h:85: error: expected declaration specifiers before 'gchar'
/home/florian/dev/openwrt/trunk/staging_dir_mipsel/usr/include/glib-2.0/glib/gstrfuncs.h:86: error: expected declaration specifiers before 'gchar'
/home/florian/dev/openwrt/trunk/staging_dir_mipsel/usr/include/glib-2.0/glib/gstrfuncs.h:88: error: expected ')' before 'c'
/home/florian/dev/openwrt/trunk/staging_dir_mipsel/usr/include/glib-2.0/glib/gstrfuncs.h:89: error: expected ')' before 'c'
/home/florian/dev/openwrt/trunk/staging_dir_mipsel/usr/include/glib-2.0/glib/gstrfuncs.h:95: error: expected declaration specifiers before 'gchar'
/home/florian/dev/openwrt/trunk/staging_dir_mipsel/usr/include/glib-2.0/glib/gstrfuncs.h:98: error: expected declaration specifiers before 'gchar'
/home/florian/dev/openwrt/trunk/staging_dir_mipsel/usr/include/glib-2.0/glib/gstrfuncs.h:101: error: expected '=', ',', ';', 'asm' or '__attribute__' before '*' token
/home/florian/dev/openwrt/trunk/staging_dir_mipsel/usr/include/glib-2.0/glib/gstrfuncs.h:102: error: expected '=', ',', ';', 'asm' or '__attribute__' before '*' token
/home/florian/dev/openwrt/trunk/staging_dir_mipsel/usr/include/glib-2.0/glib/gstrfuncs.h:103: error: expected declaration specifiers before 'gchar'
/home/florian/dev/openwrt/trunk/staging_dir_mipsel/usr/include/glib-2.0/glib/gstrfuncs.h:104: error: expected declaration specifiers before 'gsize'
/home/florian/dev/openwrt/trunk/staging_dir_mipsel/usr/include/glib-2.0/glib/gstrfuncs.h:107: error: expected declaration specifiers before 'gsize'
/home/florian/dev/openwrt/trunk/staging_dir_mipsel/usr/include/glib-2.0/glib/gstrfuncs.h:110: error: expected declaration specifiers before 'gchar'
/home/florian/dev/openwrt/trunk/staging_dir_mipsel/usr/include/glib-2.0/glib/gstrfuncs.h:113: error: expected declaration specifiers before 'gchar'
/home/florian/dev/openwrt/trunk/staging_dir_mipsel/usr/include/glib-2.0/glib/gstrfuncs.h:115: error: expected declaration specifiers before 'gchar'
/home/florian/dev/openwrt/trunk/staging_dir_mipsel/usr/include/glib-2.0/glib/gstrfuncs.h:119: warning: type defaults to 'int' in declaration of 'gchar'
/home/florian/dev/openwrt/trunk/staging_dir_mipsel/usr/include/glib-2.0/glib/gstrfuncs.h:119: error: expected ';', ',' or ')' before '*' token
/home/florian/dev/openwrt/trunk/staging_dir_mipsel/usr/include/glib-2.0/glib/gstrfuncs.h:121: warning: type defaults to 'int' in declaration of 'gchar'
/home/florian/dev/openwrt/trunk/staging_dir_mipsel/usr/include/glib-2.0/glib/gstrfuncs.h:121: error: expected ';', ',' or ')' before '*' token
/home/florian/dev/openwrt/trunk/staging_dir_mipsel/usr/include/glib-2.0/glib/gstrfuncs.h:126: warning: type defaults to 'int' in declaration of 'gchar'
/home/florian/dev/openwrt/trunk/staging_dir_mipsel/usr/include/glib-2.0/glib/gstrfuncs.h:126: error: expected ';', ',' or ')' before '*' token
/home/florian/dev/openwrt/trunk/staging_dir_mipsel/usr/include/glib-2.0/glib/gstrfuncs.h:128: warning: type defaults to 'int' in declaration of 'gchar'
/home/florian/dev/openwrt/trunk/staging_dir_mipsel/usr/include/glib-2.0/glib/gstrfuncs.h:128: error: expected ';', ',' or ')' before '*' token
/home/florian/dev/openwrt/trunk/staging_dir_mipsel/usr/include/glib-2.0/glib/gstrfuncs.h:130: warning: type defaults to 'int' in declaration of 'gchar'
/home/florian/dev/openwrt/trunk/staging_dir_mipsel/usr/include/glib-2.0/glib/gstrfuncs.h:130: error: expected ';', ',' or ')' before '*' token
/home/florian/dev/openwrt/trunk/staging_dir_mipsel/usr/include/glib-2.0/glib/gstrfuncs.h:133: warning: type defaults to 'int' in declaration of 'gchar'
/home/florian/dev/openwrt/trunk/staging_dir_mipsel/usr/include/glib-2.0/glib/gstrfuncs.h:133: error: expected ';', ',' or ')' before '*' token
/home/florian/dev/openwrt/trunk/staging_dir_mipsel/usr/include/glib-2.0/glib/gstrfuncs.h:140: error: expected declaration specifiers before 'gchar'
/home/florian/dev/openwrt/trunk/staging_dir_mipsel/usr/include/glib-2.0/glib/gstrfuncs.h:143: error: expected declaration specifiers before 'gchar'
/home/florian/dev/openwrt/trunk/staging_dir_mipsel/usr/include/glib-2.0/glib/gstrfuncs.h:149: error: expected declaration specifiers before 'gchar'
/home/florian/dev/openwrt/trunk/staging_dir_mipsel/usr/include/glib-2.0/glib/gstrfuncs.h:151: error: expected declaration specifiers before 'gchar'
/home/florian/dev/openwrt/trunk/staging_dir_mipsel/usr/include/glib-2.0/glib/gstrfuncs.h:155: warning: type defaults to 'int' in declaration of 'gchar'
/home/florian/dev/openwrt/trunk/staging_dir_mipsel/usr/include/glib-2.0/glib/gstrfuncs.h:155: error: expected ';', ',' or ')' before '*' token
/home/florian/dev/openwrt/trunk/staging_dir_mipsel/usr/include/glib-2.0/glib/gstrfuncs.h:157: warning: type defaults to 'int' in declaration of 'gchar'
/home/florian/dev/openwrt/trunk/staging_dir_mipsel/usr/include/glib-2.0/glib/gstrfuncs.h:157: error: expected ';', ',' or ')' before '*' token
/home/florian/dev/openwrt/trunk/staging_dir_mipsel/usr/include/glib-2.0/glib/gstrfuncs.h:160: error: expected declaration specifiers before 'gchar'
/home/florian/dev/openwrt/trunk/staging_dir_mipsel/usr/include/glib-2.0/glib/gstrfuncs.h:162: error: expected declaration specifiers before 'gchar'
/home/florian/dev/openwrt/trunk/staging_dir_mipsel/usr/include/glib-2.0/glib/gstrfuncs.h:172: warning: type defaults to 'int' in declaration of 'gchar'
/home/florian/dev/openwrt/trunk/staging_dir_mipsel/usr/include/glib-2.0/glib/gstrfuncs.h:172: error: expected ';', ',' or ')' before '*' token
/home/florian/dev/openwrt/trunk/staging_dir_mipsel/usr/include/glib-2.0/glib/gstrfuncs.h:174: warning: type defaults to 'int' in declaration of 'gchar'
/home/florian/dev/openwrt/trunk/staging_dir_mipsel/usr/include/glib-2.0/glib/gstrfuncs.h:174: error: expected ';', ',' or ')' before '*' token
/home/florian/dev/openwrt/trunk/staging_dir_mipsel/usr/include/glib-2.0/glib/gstrfuncs.h:177: error: expected declaration specifiers before 'gchar'
/home/florian/dev/openwrt/trunk/staging_dir_mipsel/usr/include/glib-2.0/glib/gstrfuncs.h:178: error: expected declaration specifiers before 'gchar'
/home/florian/dev/openwrt/trunk/staging_dir_mipsel/usr/include/glib-2.0/glib/gstrfuncs.h:185: error: expected declaration specifiers before 'gchar'
/home/florian/dev/openwrt/trunk/staging_dir_mipsel/usr/include/glib-2.0/glib/gstrfuncs.h:186: error: expected declaration specifiers before 'gchar'
/home/florian/dev/openwrt/trunk/staging_dir_mipsel/usr/include/glib-2.0/glib/gstrfuncs.h:188: error: expected declaration specifiers before 'gchar'
/home/florian/dev/openwrt/trunk/staging_dir_mipsel/usr/include/glib-2.0/glib/gstrfuncs.h:190: error: expected declaration specifiers before 'gchar'
/home/florian/dev/openwrt/trunk/staging_dir_mipsel/usr/include/glib-2.0/glib/gstrfuncs.h:192: error: expected declaration specifiers before 'gchar'
/home/florian/dev/openwrt/trunk/staging_dir_mipsel/usr/include/glib-2.0/glib/gstrfuncs.h:194: error: expected declaration specifiers before 'gchar'
/home/florian/dev/openwrt/trunk/staging_dir_mipsel/usr/include/glib-2.0/glib/gstrfuncs.h:196: error: expected declaration specifiers before 'gchar'
/home/florian/dev/openwrt/trunk/staging_dir_mipsel/usr/include/glib-2.0/glib/gstrfuncs.h:203: error: expected declaration specifiers before 'gchar'
/home/florian/dev/openwrt/trunk/staging_dir_mipsel/usr/include/glib-2.0/glib/gstrfuncs.h:213: error: expected declaration specifiers before 'gchar'
/home/florian/dev/openwrt/trunk/staging_dir_mipsel/usr/include/glib-2.0/glib/gstrfuncs.h:217: warning: '__malloc__' attribute ignored
/home/florian/dev/openwrt/trunk/staging_dir_mipsel/usr/include/glib-2.0/glib/gstrfuncs.h:228: error: expected declaration specifiers before 'gchar'
/home/florian/dev/openwrt/trunk/staging_dir_mipsel/usr/include/glib-2.0/glib/gstrfuncs.h:231: error: expected declaration specifiers before 'gchar'
/home/florian/dev/openwrt/trunk/staging_dir_mipsel/usr/include/glib-2.0/glib/gstrfuncs.h:234: error: expected declaration specifiers before 'gchar'
/home/florian/dev/openwrt/trunk/staging_dir_mipsel/usr/include/glib-2.0/glib/gstrfuncs.h:236: error: expected ')' before '*' token
/home/florian/dev/openwrt/trunk/staging_dir_mipsel/usr/include/glib-2.0/glib/gstrfuncs.h:237: error: expected declaration specifiers before 'gchar'
/home/florian/dev/openwrt/trunk/staging_dir_mipsel/usr/include/glib-2.0/glib/gstrfuncs.h:238: error: expected ')' before '*' token
/home/florian/dev/openwrt/trunk/staging_dir_mipsel/usr/include/glib-2.0/glib/gstrfuncs.h:240: error: expected declaration specifiers before 'gchar'
/home/florian/dev/openwrt/trunk/staging_dir_mipsel/usr/include/glib-2.0/glib/gstrfuncs.h:243: error: expected '=', ',', ';', 'asm' or '__attribute__' before '*' token
In file included from /home/florian/dev/openwrt/trunk/staging_dir_mipsel/usr/include/glib-2.0/glib.h:72,
from sshfs.c:32:
/home/florian/dev/openwrt/trunk/staging_dir_mipsel/usr/include/glib-2.0/glib/gthreadpool.h:34: error: storage class specified for parameter 'GThreadPool'
/home/florian/dev/openwrt/trunk/staging_dir_mipsel/usr/include/glib-2.0/glib/gthreadpool.h:46: warning: empty declaration
/home/florian/dev/openwrt/trunk/staging_dir_mipsel/usr/include/glib-2.0/glib/gthreadpool.h:53: error: expected declaration specifiers before 'GThreadPool'
/home/florian/dev/openwrt/trunk/staging_dir_mipsel/usr/include/glib-2.0/glib/gthreadpool.h:63: error: expected ')' before '*' token
/home/florian/dev/openwrt/trunk/staging_dir_mipsel/usr/include/glib-2.0/glib/gthreadpool.h:70: error: expected ')' before '*' token
/home/florian/dev/openwrt/trunk/staging_dir_mipsel/usr/include/glib-2.0/glib/gthreadpool.h:73: error: expected ')' before '*' token
/home/florian/dev/openwrt/trunk/staging_dir_mipsel/usr/include/glib-2.0/glib/gthreadpool.h:77: error: expected ')' before '*' token
/home/florian/dev/openwrt/trunk/staging_dir_mipsel/usr/include/glib-2.0/glib/gthreadpool.h:80: error: expected ')' before '*' token
/home/florian/dev/openwrt/trunk/staging_dir_mipsel/usr/include/glib-2.0/glib/gthreadpool.h:86: error: expected ')' before '*' token
/home/florian/dev/openwrt/trunk/staging_dir_mipsel/usr/include/glib-2.0/glib/gthreadpool.h:100: error: expected ')' before '*' token
In file included from /home/florian/dev/openwrt/trunk/staging_dir_mipsel/usr/include/glib-2.0/glib.h:73,
from sshfs.c:32:
/home/florian/dev/openwrt/trunk/staging_dir_mipsel/usr/include/glib-2.0/glib/gtimer.h:38: error: storage class specified for parameter 'GTimer'
/home/florian/dev/openwrt/trunk/staging_dir_mipsel/usr/include/glib-2.0/glib/gtimer.h:42: error: expected declaration specifiers before 'GTimer'
/home/florian/dev/openwrt/trunk/staging_dir_mipsel/usr/include/glib-2.0/glib/gtimer.h:43: error: expected ')' before '*' token
/home/florian/dev/openwrt/trunk/staging_dir_mipsel/usr/include/glib-2.0/glib/gtimer.h:44: error: expected ')' before '*' token
/home/florian/dev/openwrt/trunk/staging_dir_mipsel/usr/include/glib-2.0/glib/gtimer.h:45: error: expected ')' before '*' token
/home/florian/dev/openwrt/trunk/staging_dir_mipsel/usr/include/glib-2.0/glib/gtimer.h:46: error: expected ')' before '*' token
/home/florian/dev/openwrt/trunk/staging_dir_mipsel/usr/include/glib-2.0/glib/gtimer.h:47: error: expected ')' before '*' token
/home/florian/dev/openwrt/trunk/staging_dir_mipsel/usr/include/glib-2.0/glib/gtimer.h:48: error: expected ')' before '*' token
/home/florian/dev/openwrt/trunk/staging_dir_mipsel/usr/include/glib-2.0/glib/gtimer.h:55: warning: type defaults to 'int' in declaration of 'gchar'
/home/florian/dev/openwrt/trunk/staging_dir_mipsel/usr/include/glib-2.0/glib/gtimer.h:55: error: expected ';', ',' or ')' before '*' token
/home/florian/dev/openwrt/trunk/staging_dir_mipsel/usr/include/glib-2.0/glib/gtimer.h:57: error: expected declaration specifiers before 'gchar'
In file included from /home/florian/dev/openwrt/trunk/staging_dir_mipsel/usr/include/glib-2.0/glib.h:74,
from sshfs.c:32:
/home/florian/dev/openwrt/trunk/staging_dir_mipsel/usr/include/glib-2.0/glib/gtree.h:34: error: storage class specified for parameter 'GTree'
/home/florian/dev/openwrt/trunk/staging_dir_mipsel/usr/include/glib-2.0/glib/gtree.h:38: error: storage class specified for parameter 'GTraverseFunc'
/home/florian/dev/openwrt/trunk/staging_dir_mipsel/usr/include/glib-2.0/glib/gtree.h:42: error: expected declaration specifiers before 'GTree'
/home/florian/dev/openwrt/trunk/staging_dir_mipsel/usr/include/glib-2.0/glib/gtree.h:43: error: expected declaration specifiers before 'GTree'
/home/florian/dev/openwrt/trunk/staging_dir_mipsel/usr/include/glib-2.0/glib/gtree.h:45: error: expected declaration specifiers before 'GTree'
/home/florian/dev/openwrt/trunk/staging_dir_mipsel/usr/include/glib-2.0/glib/gtree.h:49: error: expected ')' before '*' token
/home/florian/dev/openwrt/trunk/staging_dir_mipsel/usr/include/glib-2.0/glib/gtree.h:50: error: expected ')' before '*' token
/home/florian/dev/openwrt/trunk/staging_dir_mipsel/usr/include/glib-2.0/glib/gtree.h:53: error: expected ')' before '*' token
/home/florian/dev/openwrt/trunk/staging_dir_mipsel/usr/include/glib-2.0/glib/gtree.h:56: error: expected ')' before '*' token
/home/florian/dev/openwrt/trunk/staging_dir_mipsel/usr/include/glib-2.0/glib/gtree.h:58: error: expected ')' before '*' token
/home/florian/dev/openwrt/trunk/staging_dir_mipsel/usr/include/glib-2.0/glib/gtree.h:60: error: expected ')' before '*' token
/home/florian/dev/openwrt/trunk/staging_dir_mipsel/usr/include/glib-2.0/glib/gtree.h:62: error: expected ')' before '*' token
/home/florian/dev/openwrt/trunk/staging_dir_mipsel/usr/include/glib-2.0/glib/gtree.h:66: error: expected ')' before '*' token
/home/florian/dev/openwrt/trunk/staging_dir_mipsel/usr/include/glib-2.0/glib/gtree.h:71: error: expected ')' before '*' token
/home/florian/dev/openwrt/trunk/staging_dir_mipsel/usr/include/glib-2.0/glib/gtree.h:77: error: expected ')' before '*' token
/home/florian/dev/openwrt/trunk/staging_dir_mipsel/usr/include/glib-2.0/glib/gtree.h:80: error: expected ')' before '*' token
/home/florian/dev/openwrt/trunk/staging_dir_mipsel/usr/include/glib-2.0/glib/gtree.h:81: error: expected ')' before '*' token
In file included from sshfs.c:34:
cache.h:16: error: storage class specified for parameter 'fuse_cache_dirh_t'
cache.h:17: error: expected ')' before 'h'
cache.h:22: error: expected declaration specifiers or '...' before 'fuse_cache_dirh_t'
cache.h:22: error: expected declaration specifiers or '...' before 'fuse_cache_dirfil_t'
cache.h:23: warning: empty declaration
sshfs.c:107: warning: empty declaration
sshfs.c:112: warning: empty declaration
sshfs.c:114: warning: empty declaration
sshfs.c:115: error: storage class specified for parameter 'request_func'
sshfs.c:126: error: expected specifier-qualifier-list before 'request_func'
sshfs.c:128: warning: empty declaration
sshfs.c:138: warning: empty declaration
sshfs.c:150: warning: empty declaration
sshfs.c:173: error: expected specifier-qualifier-list before 'GHashTable'
sshfs.c:187: warning: empty declaration
sshfs.c:189: error: storage class specified for parameter 'sshfs'
sshfs.c:191: error: storage class specified for parameter 'ssh_opts'
sshfs.c:191: error: parameter 'ssh_opts' is initialized
sshfs.c:192: warning: initialization from incompatible pointer type
sshfs.c:193: warning: excess elements in scalar initializer
sshfs.c:193: warning: (near initialization for 'ssh_opts')
sshfs.c:194: warning: excess elements in scalar initializer
sshfs.c:194: warning: (near initialization for 'ssh_opts')
sshfs.c:195: warning: excess elements in scalar initializer
sshfs.c:195: warning: (near initialization for 'ssh_opts')
sshfs.c:196: warning: excess elements in scalar initializer
sshfs.c:196: warning: (near initialization for 'ssh_opts')
sshfs.c:197: warning: excess elements in scalar initializer
sshfs.c:197: warning: (near initialization for 'ssh_opts')
sshfs.c:198: warning: excess elements in scalar initializer
sshfs.c:198: warning: (near initialization for 'ssh_opts')
sshfs.c:199: warning: excess elements in scalar initializer
sshfs.c:199: warning: (near initialization for 'ssh_opts')
sshfs.c:200: warning: excess elements in scalar initializer
sshfs.c:200: warning: (near initialization for 'ssh_opts')
sshfs.c:201: warning: excess elements in scalar initializer
sshfs.c:201: warning: (near initialization for 'ssh_opts')
sshfs.c:202: warning: excess elements in scalar initializer
sshfs.c:202: warning: (near initialization for 'ssh_opts')
sshfs.c:203: warning: excess elements in scalar initializer
sshfs.c:203: warning: (near initialization for 'ssh_opts')
sshfs.c:204: warning: excess elements in scalar initializer
sshfs.c:204: warning: (near initialization for 'ssh_opts')
sshfs.c:205: warning: excess elements in scalar initializer
sshfs.c:205: warning: (near initialization for 'ssh_opts')
sshfs.c:206: warning: excess elements in scalar initializer
sshfs.c:206: warning: (near initialization for 'ssh_opts')
sshfs.c:207: warning: excess elements in scalar initializer
sshfs.c:207: warning: (near initialization for 'ssh_opts')
sshfs.c:208: warning: excess elements in scalar initializer
sshfs.c:208: warning: (near initialization for 'ssh_opts')
sshfs.c:209: warning: excess elements in scalar initializer
sshfs.c:209: warning: (near initialization for 'ssh_opts')
sshfs.c:210: warning: excess elements in scalar initializer
sshfs.c:210: warning: (near initialization for 'ssh_opts')
sshfs.c:211: warning: excess elements in scalar initializer
sshfs.c:211: warning: (near initialization for 'ssh_opts')
sshfs.c:212: warning: excess elements in scalar initializer
sshfs.c:212: warning: (near initialization for 'ssh_opts')
sshfs.c:213: warning: excess elements in scalar initializer
sshfs.c:213: warning: (near initialization for 'ssh_opts')
sshfs.c:214: warning: excess elements in scalar initializer
sshfs.c:214: warning: (near initialization for 'ssh_opts')
sshfs.c:215: warning: excess elements in scalar initializer
sshfs.c:215: warning: (near initialization for 'ssh_opts')
sshfs.c:216: warning: excess elements in scalar initializer
sshfs.c:216: warning: (near initialization for 'ssh_opts')
sshfs.c:217: warning: excess elements in scalar initializer
sshfs.c:217: warning: (near initialization for 'ssh_opts')
sshfs.c:218: warning: excess elements in scalar initializer
sshfs.c:218: warning: (near initialization for 'ssh_opts')
sshfs.c:219: warning: excess elements in scalar initializer
sshfs.c:219: warning: (near initialization for 'ssh_opts')
sshfs.c:220: warning: excess elements in scalar initializer
sshfs.c:220: warning: (near initialization for 'ssh_opts')
sshfs.c:221: warning: excess elements in scalar initializer
sshfs.c:221: warning: (near initialization for 'ssh_opts')
sshfs.c:222: warning: excess elements in scalar initializer
sshfs.c:222: warning: (near initialization for 'ssh_opts')
sshfs.c:223: warning: excess elements in scalar initializer
sshfs.c:223: warning: (near initialization for 'ssh_opts')
sshfs.c:224: warning: excess elements in scalar initializer
sshfs.c:224: warning: (near initialization for 'ssh_opts')
sshfs.c:225: warning: excess elements in scalar initializer
sshfs.c:225: warning: (near initialization for 'ssh_opts')
sshfs.c:226: warning: excess elements in scalar initializer
sshfs.c:226: warning: (near initialization for 'ssh_opts')
sshfs.c:227: warning: excess elements in scalar initializer
sshfs.c:227: warning: (near initialization for 'ssh_opts')
sshfs.c:228: warning: excess elements in scalar initializer
sshfs.c:228: warning: (near initialization for 'ssh_opts')
sshfs.c:229: warning: excess elements in scalar initializer
sshfs.c:229: warning: (near initialization for 'ssh_opts')
sshfs.c:230: warning: excess elements in scalar initializer
sshfs.c:230: warning: (near initialization for 'ssh_opts')
sshfs.c:231: warning: excess elements in scalar initializer
sshfs.c:231: warning: (near initialization for 'ssh_opts')
sshfs.c:239: warning: empty declaration
sshfs.c:243: error: storage class specified for parameter 'sshfs_opts'
sshfs.c:243: error: parameter 'sshfs_opts' is initialized
sshfs.c:244: warning: braces around scalar initializer
sshfs.c:244: warning: (near initialization for 'sshfs_opts')
sshfs.c:244: warning: initialization from incompatible pointer type
sshfs.c:244: warning: excess elements in scalar initializer
sshfs.c:244: warning: (near initialization for 'sshfs_opts')
sshfs.c:244: warning: excess elements in scalar initializer
sshfs.c:244: warning: (near initialization for 'sshfs_opts')
sshfs.c:245: warning: braces around scalar initializer
sshfs.c:245: warning: (near initialization for 'sshfs_opts')
sshfs.c:245: warning: initialization from incompatible pointer type
sshfs.c:245: warning: excess elements in scalar initializer
sshfs.c:245: warning: (near initialization for 'sshfs_opts')
sshfs.c:245: warning: excess elements in scalar initializer
sshfs.c:245: warning: (near initialization for 'sshfs_opts')
sshfs.c:245: warning: excess elements in scalar initializer
sshfs.c:245: warning: (near initialization for 'sshfs_opts')
sshfs.c:246: warning: braces around scalar initializer
sshfs.c:246: warning: (near initialization for 'sshfs_opts')
sshfs.c:246: warning: initialization from incompatible pointer type
sshfs.c:246: warning: excess elements in scalar initializer
sshfs.c:246: warning: (near initialization for 'sshfs_opts')
sshfs.c:246: warning: excess elements in scalar initializer
sshfs.c:246: warning: (near initialization for 'sshfs_opts')
sshfs.c:246: warning: excess elements in scalar initializer
sshfs.c:246: warning: (near initialization for 'sshfs_opts')
sshfs.c:247: warning: braces around scalar initializer
sshfs.c:247: warning: (near initialization for 'sshfs_opts')
sshfs.c:247: warning: initialization from incompatible pointer type
sshfs.c:247: warning: excess elements in scalar initializer
sshfs.c:247: warning: (near initialization for 'sshfs_opts')
sshfs.c:247: warning: excess elements in scalar initializer
sshfs.c:247: warning: (near initialization for 'sshfs_opts')
sshfs.c:247: warning: excess elements in scalar initializer
sshfs.c:247: warning: (near initialization for 'sshfs_opts')
sshfs.c:248: warning: braces around scalar initializer
sshfs.c:248: warning: (near initialization for 'sshfs_opts')
sshfs.c:248: warning: initialization from incompatible pointer type
sshfs.c:248: warning: excess elements in scalar initializer
sshfs.c:248: warning: (near initialization for 'sshfs_opts')
sshfs.c:248: warning: excess elements in scalar initializer
sshfs.c:248: warning: (near initialization for 'sshfs_opts')
sshfs.c:248: warning: excess elements in scalar initializer
sshfs.c:248: warning: (near initialization for 'sshfs_opts')
sshfs.c:249: warning: braces around scalar initializer
sshfs.c:249: warning: (near initialization for 'sshfs_opts')
sshfs.c:249: warning: initialization from incompatible pointer type
sshfs.c:249: warning: excess elements in scalar initializer
sshfs.c:249: warning: (near initialization for 'sshfs_opts')
sshfs.c:249: warning: excess elements in scalar initializer
sshfs.c:249: warning: (near initialization for 'sshfs_opts')
sshfs.c:249: warning: excess elements in scalar initializer
sshfs.c:249: warning: (near initialization for 'sshfs_opts')
sshfs.c:250: warning: braces around scalar initializer
sshfs.c:250: warning: (near initialization for 'sshfs_opts')
sshfs.c:250: warning: initialization from incompatible pointer type
sshfs.c:250: warning: excess elements in scalar initializer
sshfs.c:250: warning: (near initialization for 'sshfs_opts')
sshfs.c:250: warning: excess elements in scalar initializer
sshfs.c:250: warning: (near initialization for 'sshfs_opts')
sshfs.c:250: warning: excess elements in scalar initializer
sshfs.c:250: warning: (near initialization for 'sshfs_opts')
sshfs.c:251: warning: braces around scalar initializer
sshfs.c:251: warning: (near initialization for 'sshfs_opts')
sshfs.c:251: warning: initialization from incompatible pointer type
sshfs.c:251: warning: excess elements in scalar initializer
sshfs.c:251: warning: (near initialization for 'sshfs_opts')
sshfs.c:251: warning: excess elements in scalar initializer
sshfs.c:251: warning: (near initialization for 'sshfs_opts')
sshfs.c:251: warning: excess elements in scalar initializer
sshfs.c:251: warning: (near initialization for 'sshfs_opts')
sshfs.c:252: warning: braces around scalar initializer
sshfs.c:252: warning: (near initialization for 'sshfs_opts')
sshfs.c:252: warning: initialization from incompatible pointer type
sshfs.c:252: warning: excess elements in scalar initializer
sshfs.c:252: warning: (near initialization for 'sshfs_opts')
sshfs.c:252: warning: excess elements in scalar initializer
sshfs.c:252: warning: (near initialization for 'sshfs_opts')
sshfs.c:252: warning: excess elements in scalar initializer
sshfs.c:252: warning: (near initialization for 'sshfs_opts')
sshfs.c:253: warning: braces around scalar initializer
sshfs.c:253: warning: (near initialization for 'sshfs_opts')
sshfs.c:253: warning: initialization from incompatible pointer type
sshfs.c:253: warning: excess elements in scalar initializer
sshfs.c:253: warning: (near initialization for 'sshfs_opts')
sshfs.c:253: warning: excess elements in scalar initializer
sshfs.c:253: warning: (near initialization for 'sshfs_opts')
sshfs.c:253: warning: excess elements in scalar initializer
sshfs.c:253: warning: (near initialization for 'sshfs_opts')
sshfs.c:254: warning: braces around scalar initializer
sshfs.c:254: warning: (near initialization for 'sshfs_opts')
sshfs.c:254: warning: initialization from incompatible pointer type
sshfs.c:254: warning: excess elements in scalar initializer
sshfs.c:254: warning: (near initialization for 'sshfs_opts')
sshfs.c:254: warning: excess elements in scalar initializer
sshfs.c:254: warning: (near initialization for 'sshfs_opts')
sshfs.c:254: warning: excess elements in scalar initializer
sshfs.c:254: warning: (near initialization for 'sshfs_opts')
sshfs.c:255: warning: braces around scalar initializer
sshfs.c:255: warning: (near initialization for 'sshfs_opts')
sshfs.c:255: warning: initialization from incompatible pointer type
sshfs.c:255: warning: excess elements in scalar initializer
sshfs.c:255: warning: (near initialization for 'sshfs_opts')
sshfs.c:255: warning: excess elements in scalar initializer
sshfs.c:255: warning: (near initialization for 'sshfs_opts')
sshfs.c:255: warning: excess elements in scalar initializer
sshfs.c:255: warning: (near initialization for 'sshfs_opts')
sshfs.c:256: warning: braces around scalar initializer
sshfs.c:256: warning: (near initialization for 'sshfs_opts')
sshfs.c:256: warning: initialization from incompatible pointer type
sshfs.c:256: warning: excess elements in scalar initializer
sshfs.c:256: warning: (near initialization for 'sshfs_opts')
sshfs.c:256: warning: excess elements in scalar initializer
sshfs.c:256: warning: (near initialization for 'sshfs_opts')
sshfs.c:256: warning: excess elements in scalar initializer
sshfs.c:256: warning: (near initialization for 'sshfs_opts')
sshfs.c:257: warning: braces around scalar initializer
sshfs.c:257: warning: (near initialization for 'sshfs_opts')
sshfs.c:257: warning: initialization from incompatible pointer type
sshfs.c:257: warning: excess elements in scalar initializer
sshfs.c:257: warning: (near initialization for 'sshfs_opts')
sshfs.c:257: warning: excess elements in scalar initializer
sshfs.c:257: warning: (near initialization for 'sshfs_opts')
sshfs.c:257: warning: excess elements in scalar initializer
sshfs.c:257: warning: (near initialization for 'sshfs_opts')
sshfs.c:258: warning: braces around scalar initializer
sshfs.c:258: warning: (near initialization for 'sshfs_opts')
sshfs.c:258: warning: initialization from incompatible pointer type
sshfs.c:258: warning: excess elements in scalar initializer
sshfs.c:258: warning: (near initialization for 'sshfs_opts')
sshfs.c:258: warning: excess elements in scalar initializer
sshfs.c:258: warning: (near initialization for 'sshfs_opts')
sshfs.c:258: warning: excess elements in scalar initializer
sshfs.c:258: warning: (near initialization for 'sshfs_opts')
sshfs.c:259: warning: braces around scalar initializer
sshfs.c:259: warning: (near initialization for 'sshfs_opts')
sshfs.c:259: warning: initialization from incompatible pointer type
sshfs.c:259: warning: excess elements in scalar initializer
sshfs.c:259: warning: (near initialization for 'sshfs_opts')
sshfs.c:259: warning: excess elements in scalar initializer
sshfs.c:259: warning: (near initialization for 'sshfs_opts')
sshfs.c:259: warning: excess elements in scalar initializer
sshfs.c:259: warning: (near initialization for 'sshfs_opts')
sshfs.c:261: warning: braces around scalar initializer
sshfs.c:261: warning: (near initialization for 'sshfs_opts')
sshfs.c:261: warning: initialization from incompatible pointer type
sshfs.c:261: warning: excess elements in scalar initializer
sshfs.c:261: warning: (near initialization for 'sshfs_opts')
sshfs.c:261: warning: excess elements in scalar initializer
sshfs.c:261: warning: (near initialization for 'sshfs_opts')
sshfs.c:261: warning: excess elements in scalar initializer
sshfs.c:261: warning: (near initialization for 'sshfs_opts')
sshfs.c:262: warning: braces around scalar initializer
sshfs.c:262: warning: (near initialization for 'sshfs_opts')
sshfs.c:262: warning: initialization from incompatible pointer type
sshfs.c:262: warning: excess elements in scalar initializer
sshfs.c:262: warning: (near initialization for 'sshfs_opts')
sshfs.c:262: warning: excess elements in scalar initializer
sshfs.c:262: warning: (near initialization for 'sshfs_opts')
sshfs.c:262: warning: excess elements in scalar initializer
sshfs.c:262: warning: (near initialization for 'sshfs_opts')
sshfs.c:263: warning: braces around scalar initializer
sshfs.c:263: warning: (near initialization for 'sshfs_opts')
sshfs.c:263: warning: initialization from incompatible pointer type
sshfs.c:263: warning: excess elements in scalar initializer
sshfs.c:263: warning: (near initialization for 'sshfs_opts')
sshfs.c:263: warning: excess elements in scalar initializer
sshfs.c:263: warning: (near initialization for 'sshfs_opts')
sshfs.c:263: warning: excess elements in scalar initializer
sshfs.c:263: warning: (near initialization for 'sshfs_opts')
sshfs.c:264: warning: braces around scalar initializer
sshfs.c:264: warning: (near initialization for 'sshfs_opts')
sshfs.c:264: warning: initialization from incompatible pointer type
sshfs.c:264: warning: excess elements in scalar initializer
sshfs.c:264: warning: (near initialization for 'sshfs_opts')
sshfs.c:264: warning: excess elements in scalar initializer
sshfs.c:264: warning: (near initialization for 'sshfs_opts')
sshfs.c:264: warning: excess elements in scalar initializer
sshfs.c:264: warning: (near initialization for 'sshfs_opts')
sshfs.c:265: warning: braces around scalar initializer
sshfs.c:265: warning: (near initialization for 'sshfs_opts')
sshfs.c:265: warning: initialization from incompatible pointer type
sshfs.c:265: warning: excess elements in scalar initializer
sshfs.c:265: warning: (near initialization for 'sshfs_opts')
sshfs.c:265: warning: excess elements in scalar initializer
sshfs.c:265: warning: (near initialization for 'sshfs_opts')
sshfs.c:265: warning: excess elements in scalar initializer
sshfs.c:265: warning: (near initialization for 'sshfs_opts')
sshfs.c:266: warning: braces around scalar initializer
sshfs.c:266: warning: (near initialization for 'sshfs_opts')
sshfs.c:266: warning: initialization from incompatible pointer type
sshfs.c:266: warning: excess elements in scalar initializer
sshfs.c:266: warning: (near initialization for 'sshfs_opts')
sshfs.c:266: warning: excess elements in scalar initializer
sshfs.c:266: warning: (near initialization for 'sshfs_opts')
sshfs.c:266: warning: excess elements in scalar initializer
sshfs.c:266: warning: (near initialization for 'sshfs_opts')
sshfs.c:267: warning: braces around scalar initializer
sshfs.c:267: warning: (near initialization for 'sshfs_opts')
sshfs.c:267: error: field name not in record or union initializer
sshfs.c:267: error: (near initialization for 'sshfs_opts')
sshfs.c:267: warning: excess elements in scalar initializer
sshfs.c:267: warning: (near initialization for 'sshfs_opts')
sshfs.c:270: error: storage class specified for parameter 'workaround_opts'
sshfs.c:270: error: parameter 'workaround_opts' is initialized
sshfs.c:271: warning: braces around scalar initializer
sshfs.c:271: warning: (near initialization for 'workaround_opts')
sshfs.c:271: warning: initialization from incompatible pointer type
sshfs.c:271: warning: excess elements in scalar initializer
sshfs.c:271: warning: (near initialization for 'workaround_opts')
sshfs.c:271: warning: excess elements in scalar initializer
sshfs.c:271: warning: (near initialization for 'workaround_opts')
sshfs.c:272: warning: braces around scalar initializer
sshfs.c:272: warning: (near initialization for 'workaround_opts')
sshfs.c:272: warning: initialization from incompatible pointer type
sshfs.c:272: warning: excess elements in scalar initializer
sshfs.c:272: warning: (near initialization for 'workaround_opts')
sshfs.c:272: warning: excess elements in scalar initializer
sshfs.c:272: warning: (near initialization for 'workaround_opts')
sshfs.c:272: warning: excess elements in scalar initializer
sshfs.c:272: warning: (near initialization for 'workaround_opts')
sshfs.c:273: warning: braces around scalar initializer
sshfs.c:273: warning: (near initialization for 'workaround_opts')
sshfs.c:273: warning: initialization from incompatible pointer type
sshfs.c:273: warning: excess elements in scalar initializer
sshfs.c:273: warning: (near initialization for 'workaround_opts')
sshfs.c:273: warning: excess elements in scalar initializer
sshfs.c:273: warning: (near initialization for 'workaround_opts')
sshfs.c:273: warning: excess elements in scalar initializer
sshfs.c:273: warning: (near initialization for 'workaround_opts')
sshfs.c:274: warning: braces around scalar initializer
sshfs.c:274: warning: (near initialization for 'workaround_opts')
sshfs.c:274: warning: initialization from incompatible pointer type
sshfs.c:274: warning: excess elements in scalar initializer
sshfs.c:274: warning: (near initialization for 'workaround_opts')
sshfs.c:274: warning: excess elements in scalar initializer
sshfs.c:274: warning: (near initialization for 'workaround_opts')
sshfs.c:274: warning: excess elements in scalar initializer
sshfs.c:274: warning: (near initialization for 'workaround_opts')
sshfs.c:275: warning: braces around scalar initializer
sshfs.c:275: warning: (near initialization for 'workaround_opts')
sshfs.c:275: warning: initialization from incompatible pointer type
sshfs.c:275: warning: excess elements in scalar initializer
sshfs.c:275: warning: (near initialization for 'workaround_opts')
sshfs.c:275: warning: excess elements in scalar initializer
sshfs.c:275: warning: (near initialization for 'workaround_opts')
sshfs.c:275: warning: excess elements in scalar initializer
sshfs.c:275: warning: (near initialization for 'workaround_opts')
sshfs.c:276: warning: braces around scalar initializer
sshfs.c:276: warning: (near initialization for 'workaround_opts')
sshfs.c:276: warning: initialization from incompatible pointer type
sshfs.c:276: warning: excess elements in scalar initializer
sshfs.c:276: warning: (near initialization for 'workaround_opts')
sshfs.c:276: warning: excess elements in scalar initializer
sshfs.c:276: warning: (near initialization for 'workaround_opts')
sshfs.c:276: warning: excess elements in scalar initializer
sshfs.c:276: warning: (near initialization for 'workaround_opts')
sshfs.c:277: warning: braces around scalar initializer
sshfs.c:277: warning: (near initialization for 'workaround_opts')
sshfs.c:277: warning: initialization from incompatible pointer type
sshfs.c:277: warning: excess elements in scalar initializer
sshfs.c:277: warning: (near initialization for 'workaround_opts')
sshfs.c:277: warning: excess elements in scalar initializer
sshfs.c:277: warning: (near initialization for 'workaround_opts')
sshfs.c:277: warning: excess elements in scalar initializer
sshfs.c:277: warning: (near initialization for 'workaround_opts')
sshfs.c:278: warning: braces around scalar initializer
sshfs.c:278: warning: (near initialization for 'workaround_opts')
sshfs.c:278: warning: initialization from incompatible pointer type
sshfs.c:278: warning: excess elements in scalar initializer
sshfs.c:278: warning: (near initialization for 'workaround_opts')
sshfs.c:278: warning: excess elements in scalar initializer
sshfs.c:278: warning: (near initialization for 'workaround_opts')
sshfs.c:278: warning: excess elements in scalar initializer
sshfs.c:278: warning: (near initialization for 'workaround_opts')
sshfs.c:279: warning: braces around scalar initializer
sshfs.c:279: warning: (near initialization for 'workaround_opts')
sshfs.c:279: warning: initialization from incompatible pointer type
sshfs.c:279: warning: excess elements in scalar initializer
sshfs.c:279: warning: (near initialization for 'workaround_opts')
sshfs.c:279: warning: excess elements in scalar initializer
sshfs.c:279: warning: (near initialization for 'workaround_opts')
sshfs.c:279: warning: excess elements in scalar initializer
sshfs.c:279: warning: (near initialization for 'workaround_opts')
sshfs.c:280: warning: braces around scalar initializer
sshfs.c:280: warning: (near initialization for 'workaround_opts')
sshfs.c:280: warning: initialization from incompatible pointer type
sshfs.c:280: warning: excess elements in scalar initializer
sshfs.c:280: warning: (near initialization for 'workaround_opts')
sshfs.c:280: warning: excess elements in scalar initializer
sshfs.c:280: warning: (near initialization for 'workaround_opts')
sshfs.c:280: warning: excess elements in scalar initializer
sshfs.c:280: warning: (near initialization for 'workaround_opts')
sshfs.c:281: warning: braces around scalar initializer
sshfs.c:281: warning: (near initialization for 'workaround_opts')
sshfs.c:281: warning: initialization from incompatible pointer type
sshfs.c:281: warning: excess elements in scalar initializer
sshfs.c:281: warning: (near initialization for 'workaround_opts')
sshfs.c:281: warning: excess elements in scalar initializer
sshfs.c:281: warning: (near initialization for 'workaround_opts')
sshfs.c:281: warning: excess elements in scalar initializer
sshfs.c:281: warning: (near initialization for 'workaround_opts')
sshfs.c:282: warning: braces around scalar initializer
sshfs.c:282: warning: (near initialization for 'workaround_opts')
sshfs.c:282: warning: initialization from incompatible pointer type
sshfs.c:282: warning: excess elements in scalar initializer
sshfs.c:282: warning: (near initialization for 'workaround_opts')
sshfs.c:282: warning: excess elements in scalar initializer
sshfs.c:282: warning: (near initialization for 'workaround_opts')
sshfs.c:282: warning: excess elements in scalar initializer
sshfs.c:282: warning: (near initialization for 'workaround_opts')
sshfs.c:283: warning: braces around scalar initializer
sshfs.c:283: warning: (near initialization for 'workaround_opts')
sshfs.c:283: error: field name not in record or union initializer
sshfs.c:283: error: (near initialization for 'workaround_opts')
sshfs.c:283: warning: excess elements in scalar initializer
sshfs.c:283: warning: (near initialization for 'workaround_opts')
sshfs.c:290: error: expected '=', ',', ';', 'asm' or '__attribute__' before '{' token
sshfs.c:331: error: expected '=', ',', ';', 'asm' or '__attribute__' before '{' token
sshfs.c:337: error: expected '=', ',', ';', 'asm' or '__attribute__' before '{' token
sshfs.c:347: error: expected '=', ',', ';', 'asm' or '__attribute__' before '{' token
sshfs.c:356: error: expected '=', ',', ';', 'asm' or '__attribute__' before '{' token
sshfs.c:361: error: expected '=', ',', ';', 'asm' or '__attribute__' before '{' token
sshfs.c:375: error: expected '=', ',', ';', 'asm' or '__attribute__' before '{' token
sshfs.c:380: error: expected '=', ',', ';', 'asm' or '__attribute__' before '{' token
sshfs.c:385: error: expected '=', ',', ';', 'asm' or '__attribute__' before '{' token
sshfs.c:391: error: expected '=', ',', ';', 'asm' or '__attribute__' before '{' token
sshfs.c:401: error: expected '=', ',', ';', 'asm' or '__attribute__' before '{' token
sshfs.c:414: error: expected '=', ',', ';', 'asm' or '__attribute__' before '{' token
sshfs.c:419: error: expected '=', ',', ';', 'asm' or '__attribute__' before '{' token
sshfs.c:424: error: expected '=', ',', ';', 'asm' or '__attribute__' before '{' token
sshfs.c:429: error: expected '=', ',', ';', 'asm' or '__attribute__' before '{' token
sshfs.c:435: error: expected '=', ',', ';', 'asm' or '__attribute__' before '{' token
sshfs.c:441: error: expected '=', ',', ';', 'asm' or '__attribute__' before '{' token
sshfs.c:447: error: expected '=', ',', ';', 'asm' or '__attribute__' before '{' token
sshfs.c:455: error: expected '=', ',', ';', 'asm' or '__attribute__' before '{' token
sshfs.c:463: error: expected '=', ',', ';', 'asm' or '__attribute__' before '{' token
sshfs.c:472: error: expected '=', ',', ';', 'asm' or '__attribute__' before '{' token
sshfs.c:481: error: expected '=', ',', ';', 'asm' or '__attribute__' before '{' token
sshfs.c:486: error: expected '=', ',', ';', 'asm' or '__attribute__' before '{' token
sshfs.c:495: error: expected '=', ',', ';', 'asm' or '__attribute__' before '{' token
sshfs.c:505: error: expected '=', ',', ';', 'asm' or '__attribute__' before '{' token
sshfs.c:519: error: expected '=', ',', ';', 'asm' or '__attribute__' before '{' token
sshfs.c:529: error: expected '=', ',', ';', 'asm' or '__attribute__' before '{' token
sshfs.c:592: error: expected declaration specifiers or '...' before 'fuse_cache_dirh_t'
sshfs.c:593: error: expected declaration specifiers or '...' before 'fuse_cache_dirfil_t'
sshfs.c:594: error: expected '=', ',', ';', 'asm' or '__attribute__' before '{' token
sshfs.c:625: error: expected '=', ',', ';', 'asm' or '__attribute__' before '{' token
sshfs.c:631: error: expected '=', ',', ';', 'asm' or '__attribute__' before '{' token
sshfs.c:673: error: expected '=', ',', ';', 'asm' or '__attribute__' before '{' token
sshfs.c:727: error: expected '=', ',', ';', 'asm' or '__attribute__' before '{' token
sshfs.c:765: error: expected '=', ',', ';', 'asm' or '__attribute__' before '{' token
sshfs.c:792: error: expected '=', ',', ';', 'asm' or '__attribute__' before '{' token
sshfs.c:798: error: expected '=', ',', ';', 'asm' or '__attribute__' before '{' token
sshfs.c:804: error: expected '=', ',', ';', 'asm' or '__attribute__' before '{' token
sshfs.c:817: error: expected '=', ',', ';', 'asm' or '__attribute__' before '{' token
sshfs.c:840: error: expected '=', ',', ';', 'asm' or '__attribute__' before '{' token
sshfs.c:860: error: expected '=', ',', ';', 'asm' or '__attribute__' before '{' token
sshfs.c:883: error: expected '=', ',', ';', 'asm' or '__attribute__' before '{' token
sshfs.c:890: error: expected '=', ',', ';', 'asm' or '__attribute__' before '{' token
sshfs.c:897: error: expected '=', ',', ';', 'asm' or '__attribute__' before '{' token
sshfs.c:906: error: expected '=', ',', ';', 'asm' or '__attribute__' before '{' token
sshfs.c:913: error: expected '=', ',', ';', 'asm' or '__attribute__' before '{' token
sshfs.c:928: error: expected '=', ',', ';', 'asm' or '__attribute__' before '{' token
sshfs.c:993: error: expected '=', ',', ';', 'asm' or '__attribute__' before '{' token
sshfs.c:1021: error: expected '=', ',', ';', 'asm' or '__attribute__' before '{' token
sshfs.c:1047: error: expected '=', ',', ';', 'asm' or '__attribute__' before '{' token
sshfs.c:1070: error: expected '=', ',', ';', 'asm' or '__attribute__' before '{' token
sshfs.c:1085: error: expected '=', ',', ';', 'asm' or '__attribute__' before '{' token
sshfs.c:1139: error: expected '=', ',', ';', 'asm' or '__attribute__' before '{' token
sshfs.c:1197: error: expected '=', ',', ';', 'asm' or '__attribute__' before '{' token
sshfs.c:1211: error: expected '=', ',', ';', 'asm' or '__attribute__' before '{' token
sshfs.c:1249: error: expected '=', ',', ';', 'asm' or '__attribute__' before '{' token
sshfs.c:1266: error: expected '=', ',', ';', 'asm' or '__attribute__' before '{' token
sshfs.c:1323: error: expected declaration specifiers or '...' before 'request_func'
sshfs.c:1323: error: expected declaration specifiers or '...' before 'request_func'
sshfs.c:1326: error: expected '=', ',', ';', 'asm' or '__attribute__' before '{' token
sshfs.c:1374: error: expected '=', ',', ';', 'asm' or '__attribute__' before '{' token
sshfs.c:1386: error: expected '=', ',', ';', 'asm' or '__attribute__' before '{' token
sshfs.c:1394: error: expected '=', ',', ';', 'asm' or '__attribute__' before '{' token
sshfs.c:1412: error: expected '=', ',', ';', 'asm' or '__attribute__' before '{' token
sshfs.c:1424: error: expected '=', ',', ';', 'asm' or '__attribute__' before '{' token
sshfs.c:1437: error: expected '=', ',', ';', 'asm' or '__attribute__' before '{' token
sshfs.c:1478: error: expected '=', ',', ';', 'asm' or '__attribute__' before '{' token
sshfs.c:1510: error: expected declaration specifiers or '...' before 'fuse_cache_dirh_t'
sshfs.c:1511: error: expected declaration specifiers or '...' before 'fuse_cache_dirfil_t'
sshfs.c:1512: error: expected '=', ',', ';', 'asm' or '__attribute__' before '{' token
sshfs.c:1544: error: expected '=', ',', ';', 'asm' or '__attribute__' before '{' token
sshfs.c:1557: error: expected '=', ',', ';', 'asm' or '__attribute__' before '{' token
sshfs.c:1585: error: expected '=', ',', ';', 'asm' or '__attribute__' before '{' token
sshfs.c:1603: error: expected '=', ',', ';', 'asm' or '__attribute__' before '{' token
sshfs.c:1614: error: expected '=', ',', ';', 'asm' or '__attribute__' before '{' token
sshfs.c:1625: error: expected '=', ',', ';', 'asm' or '__attribute__' before '{' token
sshfs.c:1637: error: expected '=', ',', ';', 'asm' or '__attribute__' before '{' token
sshfs.c:1645: error: expected '=', ',', ';', 'asm' or '__attribute__' before '{' token
sshfs.c:1669: error: expected '=', ',', ';', 'asm' or '__attribute__' before '{' token
sshfs.c:1682: error: expected '=', ',', ';', 'asm' or '__attribute__' before '{' token
sshfs.c:1696: error: storage class specified for parameter 'sshfs_truncate_workaround'
sshfs.c:1699: error: expected '=', ',', ';', 'asm' or '__attribute__' before '{' token
sshfs.c:1717: error: expected '=', ',', ';', 'asm' or '__attribute__' before '{' token
sshfs.c:1731: error: expected '=', ',', ';', 'asm' or '__attribute__' before '{' token
sshfs.c:1737: error: expected '=', ',', ';', 'asm' or '__attribute__' before '{' token
sshfs.c:1809: error: expected '=', ',', ';', 'asm' or '__attribute__' before '{' token
sshfs.c:1814: error: expected '=', ',', ';', 'asm' or '__attribute__' before '{' token
sshfs.c:1819: error: expected '=', ',', ';', 'asm' or '__attribute__' before '{' token
sshfs.c:1849: error: expected '=', ',', ';', 'asm' or '__attribute__' before '{' token
sshfs.c:1855: error: expected '=', ',', ';', 'asm' or '__attribute__' before '{' token
sshfs.c:1870: error: expected '=', ',', ';', 'asm' or '__attribute__' before '{' token
sshfs.c:1899: error: expected '=', ',', ';', 'asm' or '__attribute__' before '{' token
sshfs.c:1933: error: expected '=', ',', ';', 'asm' or '__attribute__' before '{' token
sshfs.c:1940: error: expected '=', ',', ';', 'asm' or '__attribute__' before '{' token
sshfs.c:1957: error: expected '=', ',', ';', 'asm' or '__attribute__' before '{' token
sshfs.c:1974: error: expected '=', ',', ';', 'asm' or '__attribute__' before '{' token
sshfs.c:1992: error: expected '=', ',', ';', 'asm' or '__attribute__' before '{' token
sshfs.c:2003: error: expected '=', ',', ';', 'asm' or '__attribute__' before '{' token
sshfs.c:2053: error: expected '=', ',', ';', 'asm' or '__attribute__' before '{' token
sshfs.c:2067: error: expected '=', ',', ';', 'asm' or '__attribute__' before '{' token
sshfs.c:2073: error: expected '=', ',', ';', 'asm' or '__attribute__' before '{' token
sshfs.c:2091: error: expected '=', ',', ';', 'asm' or '__attribute__' before '{' token
sshfs.c:2122: error: expected '=', ',', ';', 'asm' or '__attribute__' before '{' token
sshfs.c:2151: error: expected '=', ',', ';', 'asm' or '__attribute__' before '{' token
sshfs.c:2157: error: expected '=', ',', ';', 'asm' or '__attribute__' before '{' token
sshfs.c:2184: error: expected '=', ',', ';', 'asm' or '__attribute__' before '{' token
sshfs.c:2208: error: expected '=', ',', ';', 'asm' or '__attribute__' before '{' token
sshfs.c:2221: error: expected '=', ',', ';', 'asm' or '__attribute__' before '{' token
sshfs.c:2226: error: expected '=', ',', ';', 'asm' or '__attribute__' before '{' token
sshfs.c:2273: error: expected '=', ',', ';', 'asm' or '__attribute__' before '{' token
sshfs.c:2308: error: expected '=', ',', ';', 'asm' or '__attribute__' before '{' token
sshfs.c:2330: error: expected '=', ',', ';', 'asm' or '__attribute__' before '{' token
sshfs.c:2341: error: storage class specified for parameter 'sshfs_oper'
sshfs.c:2341: error: parameter 'sshfs_oper' is initialized
sshfs.c:2344: error: 'sshfs_init' undeclared (first use in this function)
sshfs.c:2344: error: (Each undeclared identifier is reported only once
sshfs.c:2344: error: for each function it appears in.)
sshfs.c:2346: error: 'sshfs_getattr' undeclared (first use in this function)
sshfs.c:2347: error: 'sshfs_readlink' undeclared (first use in this function)
sshfs.c:2348: error: 'sshfs_mknod' undeclared (first use in this function)
sshfs.c:2349: error: 'sshfs_mkdir' undeclared (first use in this function)
sshfs.c:2350: error: 'sshfs_symlink' undeclared (first use in this function)
sshfs.c:2351: error: 'sshfs_unlink' undeclared (first use in this function)
sshfs.c:2352: error: 'sshfs_rmdir' undeclared (first use in this function)
sshfs.c:2353: error: 'sshfs_rename' undeclared (first use in this function)
sshfs.c:2354: error: 'sshfs_chmod' undeclared (first use in this function)
sshfs.c:2355: error: 'sshfs_chown' undeclared (first use in this function)
sshfs.c:2356: error: 'sshfs_truncate' undeclared (first use in this function)
sshfs.c:2357: error: 'sshfs_utime' undeclared (first use in this function)
sshfs.c:2358: error: 'sshfs_open' undeclared (first use in this function)
sshfs.c:2359: error: 'sshfs_flush' undeclared (first use in this function)
sshfs.c:2360: error: 'sshfs_fsync' undeclared (first use in this function)
sshfs.c:2361: error: 'sshfs_release' undeclared (first use in this function)
sshfs.c:2362: error: 'sshfs_read' undeclared (first use in this function)
sshfs.c:2363: error: 'sshfs_write' undeclared (first use in this function)
sshfs.c:2364: error: 'sshfs_statfs' undeclared (first use in this function)
sshfs.c:2366: error: 'sshfs_create' undeclared (first use in this function)
sshfs.c:2367: error: 'sshfs_ftruncate' undeclared (first use in this function)
sshfs.c:2368: error: 'sshfs_fgetattr' undeclared (first use in this function)
sshfs.c:2371: error: 'sshfs_getdir' undeclared (first use in this function)
sshfs.c:2375: error: expected '=', ',', ';', 'asm' or '__attribute__' before '{' token
sshfs.c:2416: error: expected '=', ',', ';', 'asm' or '__attribute__' before '{' token
sshfs.c:2431: error: expected '=', ',', ';', 'asm' or '__attribute__' before '{' token
sshfs.c:2441: error: expected '=', ',', ';', 'asm' or '__attribute__' before '{' token
sshfs.c:2494: error: expected '=', ',', ';', 'asm' or '__attribute__' before '{' token
sshfs.c:2501: error: expected '=', ',', ';', 'asm' or '__attribute__' before '{' token
sshfs.c:2537: error: expected '=', ',', ';', 'asm' or '__attribute__' before '{' token
sshfs.c:2546: error: expected '=', ',', ';', 'asm' or '__attribute__' before '{' token
sshfs.c:2646: error: old-style parameter declarations in prototyped function definition
sshfs.c:2646: error: expected '{' at end of input
sshfs.c:2646: warning: no return statement in function returning non-void
make[4]: *** [sshfs-sshfs.o] Error 1
make[4]: Leaving directory `/home/florian/dev/openwrt/trunk/build_mipsel/sshfs-fuse-1.7'
make[3]: *** [all] Error 2
make[3]: Leaving directory `/home/florian/dev/openwrt/trunk/build_mipsel/sshfs-fuse-1.7'
make[2]: *** [/home/florian/dev/openwrt/trunk/build_mipsel/sshfs-fuse-1.7/.built] Error 2
make[2]: Leaving directory `/home/florian/dev/openwrt/packages/net/sshfs'
make[1]: *** [sshfs-compile] Error 2
make[1]: Leaving directory `/home/florian/dev/openwrt/trunk/package'
make: *** [package/sshfs-compile] Error 2
zsh: exit 2 make package/sshfs-compile V=99