All pastes #487490 Raw Edit

mingw32-make errors

public text v1 · immutable
·published 2007-05-14 14:25 UTC
rendered paste body
 from D:/Programs/Qt/4.2.3/include/QtCore/qfile.h:1,
                 from D:/Programs/Qt/4.2.3/include/QtCore/QFile:1,
                 from src\/../header/mainHttp.h:5,
                 from src\projectdialog.cpp:4:
D:/Programs/MinGW/bin/../lib/gcc/mingw32/3.4.2/../../../../include/c++/3.4.2/bit
s/stream_iterator.h: At global scope:
D:/Programs/MinGW/bin/../lib/gcc/mingw32/3.4.2/../../../../include/c++/3.4.2/bit
s/stream_iterator.h:46: error: `ptrdiff_t' has not been declared
In file included from D:/Programs/MinGW/bin/../lib/gcc/mingw32/3.4.2/../../../..
/include/c++/3.4.2/list:71,
                 from D:/Programs/Qt/4.2.3/include/QtCore/../../src/corelib/tool
s/qlist.h:33,
                 from D:/Programs/Qt/4.2.3/include/QtCore/qlist.h:1,
                 from D:/Programs/Qt/4.2.3/include/QtCore/../../src/corelib/kern
el/qobject.h:32,
                 from D:/Programs/Qt/4.2.3/include/QtCore/qobject.h:1,
                 from D:/Programs/Qt/4.2.3/include/QtCore/../../src/corelib/io/q
iodevice.h:28,
                 from D:/Programs/Qt/4.2.3/include/QtCore/qiodevice.h:1,
                 from D:/Programs/Qt/4.2.3/include/QtCore/../../src/corelib/io/q
file.h:27,
                 from D:/Programs/Qt/4.2.3/include/QtCore/qfile.h:1,
                 from D:/Programs/Qt/4.2.3/include/QtCore/QFile:1,
                 from src\/../header/mainHttp.h:5,
                 from src\projectdialog.cpp:4:
D:/Programs/MinGW/bin/../lib/gcc/mingw32/3.4.2/../../../../include/c++/3.4.2/bit
s/stl_list.h:116: error: `ptrdiff_t' does not name a type
D:/Programs/MinGW/bin/../lib/gcc/mingw32/3.4.2/../../../../include/c++/3.4.2/bit
s/stl_list.h:192: error: `ptrdiff_t' does not name a type
D:/Programs/MinGW/bin/../lib/gcc/mingw32/3.4.2/../../../../include/c++/3.4.2/bit
s/stl_list.h:405: error: `ptrdiff_t' does not name a type
In file included from D:/Programs/Qt/4.2.3/include/QtCore/qlist.h:1,
                 from D:/Programs/Qt/4.2.3/include/QtCore/../../src/corelib/kern
el/qobject.h:32,
                 from D:/Programs/Qt/4.2.3/include/QtCore/qobject.h:1,
                 from D:/Programs/Qt/4.2.3/include/QtCore/../../src/corelib/io/q
iodevice.h:28,
                 from D:/Programs/Qt/4.2.3/include/QtCore/qiodevice.h:1,
                 from D:/Programs/Qt/4.2.3/include/QtCore/../../src/corelib/io/q
file.h:27,
                 from D:/Programs/Qt/4.2.3/include/QtCore/qfile.h:1,
                 from D:/Programs/Qt/4.2.3/include/QtCore/QFile:1,
                 from src\/../header/mainHttp.h:5,
                 from src\projectdialog.cpp:4:
D:/Programs/Qt/4.2.3/include/QtCore/../../src/corelib/tools/qlist.h:132: error:
`ptrdiff_t' does not name a type
D:/Programs/Qt/4.2.3/include/QtCore/../../src/corelib/tools/qlist.h:179: error:
`ptrdiff_t' does not name a type
D:/Programs/Qt/4.2.3/include/QtCore/../../src/corelib/tools/qlist.h:255: error:
`ptrdiff_t' does not name a type
In file included from D:/Programs/MinGW/bin/../lib/gcc/mingw32/3.4.2/../../../..
/include/c++/3.4.2/vector:71,
                 from D:/Programs/Qt/4.2.3/include/QtCore/../../src/corelib/tool
s/qvector.h:34,
                 from D:/Programs/Qt/4.2.3/include/QtCore/qvector.h:1,
                 from D:/Programs/Qt/4.2.3/include/QtCore/QVector:1,
                 from src\/../header/GetFile.h:4,
                 from src\/../header/mainHttp.h:6,
                 from src\projectdialog.cpp:4:
D:/Programs/MinGW/bin/../lib/gcc/mingw32/3.4.2/../../../../include/c++/3.4.2/bit
s/stl_vector.h:161: error: `ptrdiff_t' does not name a type
In file included from D:/Programs/MinGW/bin/../lib/gcc/mingw32/3.4.2/../../../..
/include/c++/3.4.2/vector:72,
                 from D:/Programs/Qt/4.2.3/include/QtCore/../../src/corelib/tool
s/qvector.h:34,
                 from D:/Programs/Qt/4.2.3/include/QtCore/qvector.h:1,
                 from D:/Programs/Qt/4.2.3/include/QtCore/QVector:1,
                 from src\/../header/GetFile.h:4,
                 from src\/../header/mainHttp.h:6,
                 from src\projectdialog.cpp:4:
D:/Programs/MinGW/bin/../lib/gcc/mingw32/3.4.2/../../../../include/c++/3.4.2/bit
s/stl_bvector.h:108: error: template argument 3 is invalid
D:/Programs/MinGW/bin/../lib/gcc/mingw32/3.4.2/../../../../include/c++/3.4.2/bit
s/stl_bvector.h:136: error: variable or field `_M_incr' declared void
D:/Programs/MinGW/bin/../lib/gcc/mingw32/3.4.2/../../../../include/c++/3.4.2/bit
s/stl_bvector.h:136: error: expected `;' before '(' token
D:/Programs/MinGW/bin/../lib/gcc/mingw32/3.4.2/../../../../include/c++/3.4.2/bit
s/stl_bvector.h:150: error: expected `;' before "bool"
D:/Programs/MinGW/bin/../lib/gcc/mingw32/3.4.2/../../../../include/c++/3.4.2/bit
s/stl_bvector.h:179: error: expected init-declarator before "operator"
D:/Programs/MinGW/bin/../lib/gcc/mingw32/3.4.2/../../../../include/c++/3.4.2/bit
s/stl_bvector.h:179: error: expected `,' or `;' before "operator"
D:/Programs/MinGW/bin/../lib/gcc/mingw32/3.4.2/../../../../include/c++/3.4.2/bit
s/stl_bvector.h:228: error: declaration of `operator+=' as non-function
D:/Programs/MinGW/bin/../lib/gcc/mingw32/3.4.2/../../../../include/c++/3.4.2/bit
s/stl_bvector.h:228: error: expected `;' before '(' token
D:/Programs/MinGW/bin/../lib/gcc/mingw32/3.4.2/../../../../include/c++/3.4.2/bit
s/stl_bvector.h:234: error: expected `;' before "iterator"
D:/Programs/MinGW/bin/../lib/gcc/mingw32/3.4.2/../../../../include/c++/3.4.2/bit
s/stl_bvector.h:235: error: declaration of `operator-=' as non-function
D:/Programs/MinGW/bin/../lib/gcc/mingw32/3.4.2/../../../../include/c++/3.4.2/bit
s/stl_bvector.h:235: error: expected `;' before '(' token
D:/Programs/MinGW/bin/../lib/gcc/mingw32/3.4.2/../../../../include/c++/3.4.2/bit
s/stl_bvector.h:241: error: expected `;' before "iterator"
D:/Programs/MinGW/bin/../lib/gcc/mingw32/3.4.2/../../../../include/c++/3.4.2/bit
s/stl_bvector.h:242: error: declaration of `operator+' as non-function
D:/Programs/MinGW/bin/../lib/gcc/mingw32/3.4.2/../../../../include/c++/3.4.2/bit
s/stl_bvector.h:242: error: expected `;' before '(' token
D:/Programs/MinGW/bin/../lib/gcc/mingw32/3.4.2/../../../../include/c++/3.4.2/bit
s/stl_bvector.h:248: error: expected `;' before "iterator"
D:/Programs/MinGW/bin/../lib/gcc/mingw32/3.4.2/../../../../include/c++/3.4.2/bit
s/stl_bvector.h:249: error: declaration of `operator-' as non-function
D:/Programs/MinGW/bin/../lib/gcc/mingw32/3.4.2/../../../../include/c++/3.4.2/bit
s/stl_bvector.h:249: error: expected `;' before '(' token
D:/Programs/MinGW/bin/../lib/gcc/mingw32/3.4.2/../../../../include/c++/3.4.2/bit
s/stl_bvector.h:255: error: expected `;' before "reference"
D:/Programs/MinGW/bin/../lib/gcc/mingw32/3.4.2/../../../../include/c++/3.4.2/bit
s/stl_bvector.h:256: error: declaration of `operator[]' as non-function
D:/Programs/MinGW/bin/../lib/gcc/mingw32/3.4.2/../../../../include/c++/3.4.2/bit
s/stl_bvector.h:256: error: expected `;' before '(' token
D:/Programs/MinGW/bin/../lib/gcc/mingw32/3.4.2/../../../../include/c++/3.4.2/bit
s/stl_bvector.h:258: error: expected `;' before '}' token
D:/Programs/MinGW/bin/../lib/gcc/mingw32/3.4.2/../../../../include/c++/3.4.2/bit
s/stl_bvector.h:261: error: declaration of `operator+' as non-function
D:/Programs/MinGW/bin/../lib/gcc/mingw32/3.4.2/../../../../include/c++/3.4.2/bit
s/stl_bvector.h:261: error: `ptrdiff_t' was not declared in this scope
D:/Programs/MinGW/bin/../lib/gcc/mingw32/3.4.2/../../../../include/c++/3.4.2/bit
s/stl_bvector.h:261: error: expected primary-expression before "const"
D:/Programs/MinGW/bin/../lib/gcc/mingw32/3.4.2/../../../../include/c++/3.4.2/bit
s/stl_bvector.h:261: error: expected `,' or `;' before '{' token
D:/Programs/MinGW/bin/../lib/gcc/mingw32/3.4.2/../../../../include/c++/3.4.2/bit
s/stl_bvector.h:312: error: declaration of `operator+=' as non-function
D:/Programs/MinGW/bin/../lib/gcc/mingw32/3.4.2/../../../../include/c++/3.4.2/bit
s/stl_bvector.h:312: error: expected `;' before '(' token
D:/Programs/MinGW/bin/../lib/gcc/mingw32/3.4.2/../../../../include/c++/3.4.2/bit
s/stl_bvector.h:318: error: expected `;' before "const_iterator"
D:/Programs/MinGW/bin/../lib/gcc/mingw32/3.4.2/../../../../include/c++/3.4.2/bit
s/stl_bvector.h:319: error: declaration of `operator-=' as non-function
D:/Programs/MinGW/bin/../lib/gcc/mingw32/3.4.2/../../../../include/c++/3.4.2/bit
s/stl_bvector.h:319: error: expected `;' before '(' token
D:/Programs/MinGW/bin/../lib/gcc/mingw32/3.4.2/../../../../include/c++/3.4.2/bit
s/stl_bvector.h:325: error: expected `;' before "const_iterator"
D:/Programs/MinGW/bin/../lib/gcc/mingw32/3.4.2/../../../../include/c++/3.4.2/bit
s/stl_bvector.h:326: error: declaration of `operator+' as non-function
D:/Programs/MinGW/bin/../lib/gcc/mingw32/3.4.2/../../../../include/c++/3.4.2/bit
s/stl_bvector.h:326: error: expected `;' before '(' token
D:/Programs/MinGW/bin/../lib/gcc/mingw32/3.4.2/../../../../include/c++/3.4.2/bit
s/stl_bvector.h:331: error: expected `;' before "const_iterator"
D:/Programs/MinGW/bin/../lib/gcc/mingw32/3.4.2/../../../../include/c++/3.4.2/bit
s/stl_bvector.h:332: error: declaration of `operator-' as non-function
D:/Programs/MinGW/bin/../lib/gcc/mingw32/3.4.2/../../../../include/c++/3.4.2/bit
s/stl_bvector.h:332: error: expected `;' before '(' token
D:/Programs/MinGW/bin/../lib/gcc/mingw32/3.4.2/../../../../include/c++/3.4.2/bit
s/stl_bvector.h:338: error: expected `;' before "const_reference"
D:/Programs/MinGW/bin/../lib/gcc/mingw32/3.4.2/../../../../include/c++/3.4.2/bit
s/stl_bvector.h:339: error: declaration of `operator[]' as non-function
D:/Programs/MinGW/bin/../lib/gcc/mingw32/3.4.2/../../../../include/c++/3.4.2/bit
s/stl_bvector.h:339: error: expected `;' before '(' token
D:/Programs/MinGW/bin/../lib/gcc/mingw32/3.4.2/../../../../include/c++/3.4.2/bit
s/stl_bvector.h:341: error: expected `;' before '}' token
D:/Programs/MinGW/bin/../lib/gcc/mingw32/3.4.2/../../../../include/c++/3.4.2/bit
s/stl_bvector.h:344: error: declaration of `operator+' as non-function
D:/Programs/MinGW/bin/../lib/gcc/mingw32/3.4.2/../../../../include/c++/3.4.2/bit
s/stl_bvector.h:344: error: `ptrdiff_t' was not declared in this scope
D:/Programs/MinGW/bin/../lib/gcc/mingw32/3.4.2/../../../../include/c++/3.4.2/bit
s/stl_bvector.h:344: error: expected primary-expression before "const"
D:/Programs/MinGW/bin/../lib/gcc/mingw32/3.4.2/../../../../include/c++/3.4.2/bit
s/stl_bvector.h:345: error: expected `,' or `;' before '{' token
D:/Programs/MinGW/bin/../lib/gcc/mingw32/3.4.2/../../../../include/c++/3.4.2/bit
s/stl_bvector.h:420: error: `ptrdiff_t' does not name a type
D:/Programs/MinGW/bin/../lib/gcc/mingw32/3.4.2/../../../../include/c++/3.4.2/bit
s/stl_bvector.h: In member function `void std::vector<bool, _Alloc>::_M_initiali
ze(size_t)':
D:/Programs/MinGW/bin/../lib/gcc/mingw32/3.4.2/../../../../include/c++/3.4.2/bit
s/stl_bvector.h:448: error: there are no arguments to `difference_type' that dep
end on a template parameter, so a declaration of `difference_type' must be avail
able
D:/Programs/MinGW/bin/../lib/gcc/mingw32/3.4.2/../../../../include/c++/3.4.2/bit
s/stl_bvector.h: In member function `void std::vector<bool, _Alloc>::_M_insert_r
ange(std::_Bit_iterator, _ForwardIterator, _ForwardIterator, std::forward_iterat
or_tag)':
D:/Programs/MinGW/bin/../lib/gcc/mingw32/3.4.2/../../../../include/c++/3.4.2/bit
s/stl_bvector.h:516: error: there are no arguments to `difference_type' that dep
end on a template parameter, so a declaration of `difference_type' must be avail
able
D:/Programs/MinGW/bin/../lib/gcc/mingw32/3.4.2/../../../../include/c++/3.4.2/bit
s/stl_bvector.h:518: error: there are no arguments to `difference_type' that dep
end on a template parameter, so a declaration of `difference_type' must be avail
able
D:/Programs/MinGW/bin/../lib/gcc/mingw32/3.4.2/../../../../include/c++/3.4.2/bit
s/stl_bvector.h: In member function `std::_Bit_reference std::vector<bool, _Allo
c>::operator[](size_t)':
D:/Programs/MinGW/bin/../lib/gcc/mingw32/3.4.2/../../../../include/c++/3.4.2/bit
s/stl_bvector.h:573: error: there are no arguments to `difference_type' that dep
end on a template parameter, so a declaration of `difference_type' must be avail
able
D:/Programs/MinGW/bin/../lib/gcc/mingw32/3.4.2/../../../../include/c++/3.4.2/bit
s/stl_bvector.h: In member function `bool std::vector<bool, _Alloc>::operator[](
size_t) const':
D:/Programs/MinGW/bin/../lib/gcc/mingw32/3.4.2/../../../../include/c++/3.4.2/bit
s/stl_bvector.h:576: error: there are no arguments to `difference_type' that dep
end on a template parameter, so a declaration of `difference_type' must be avail
able
D:/Programs/MinGW/bin/../lib/gcc/mingw32/3.4.2/../../../../include/c++/3.4.2/bit
s/stl_bvector.h: In member function `std::_Bit_iterator std::vector<bool, _Alloc
>::insert(std::_Bit_iterator, bool)':
D:/Programs/MinGW/bin/../lib/gcc/mingw32/3.4.2/../../../../include/c++/3.4.2/bit
s/stl_bvector.h:779: error: `difference_type' does not name a type
D:/Programs/MinGW/bin/../lib/gcc/mingw32/3.4.2/../../../../include/c++/3.4.2/bit
s/stl_bvector.h:785: error: `__n' undeclared (first use this function)
D:/Programs/MinGW/bin/../lib/gcc/mingw32/3.4.2/../../../../include/c++/3.4.2/bit
s/stl_bvector.h: In member function `void std::vector<bool, _Alloc>::_M_fill_ins
ert(std::_Bit_iterator, size_t, bool)':
D:/Programs/MinGW/bin/../lib/gcc/mingw32/3.4.2/../../../../include/c++/3.4.2/bit
s/stl_bvector.h:817: error: there are no arguments to `difference_type' that dep
end on a template parameter, so a declaration of `difference_type' must be avail
able
D:/Programs/MinGW/bin/../lib/gcc/mingw32/3.4.2/../../../../include/c++/3.4.2/bit
s/stl_bvector.h:818: error: there are no arguments to `difference_type' that dep
end on a template parameter, so a declaration of `difference_type' must be avail
able
D:/Programs/MinGW/bin/../lib/gcc/mingw32/3.4.2/../../../../include/c++/3.4.2/bit
s/stl_bvector.h:819: error: there are no arguments to `difference_type' that dep
end on a template parameter, so a declaration of `difference_type' must be avail
able
D:/Programs/MinGW/bin/../lib/gcc/mingw32/3.4.2/../../../../include/c++/3.4.2/bit
s/stl_bvector.h:828: error: there are no arguments to `difference_type' that dep
end on a template parameter, so a declaration of `difference_type' must be avail
able
D:/Programs/MinGW/bin/../lib/gcc/mingw32/3.4.2/../../../../include/c++/3.4.2/bit
s/stl_bvector.h: In member function `std::_Bit_iterator std::vector<bool, _Alloc
>::erase(std::_Bit_iterator)':
D:/Programs/MinGW/bin/../lib/gcc/mingw32/3.4.2/../../../../include/c++/3.4.2/bit
s/stl_bvector.h:844: error: no match for 'operator+' in '__position + 1'
D:/Programs/MinGW/bin/../lib/gcc/mingw32/3.4.2/../../../../include/c++/3.4.2/bit
s/stl_bvector.h:845: error: no match for 'operator+' in '__position + 1'
D:/Programs/MinGW/bin/../lib/gcc/mingw32/3.4.2/../../../../include/c++/3.4.2/bit
s/stl_bvector.h: In member function `void std::vector<bool, _Alloc>::resize(size
_t, bool)':
D:/Programs/MinGW/bin/../lib/gcc/mingw32/3.4.2/../../../../include/c++/3.4.2/bit
s/stl_bvector.h:859: error: there are no arguments to `difference_type' that dep
end on a template parameter, so a declaration of `difference_type' must be avail
able
In file included from D:/Programs/Qt/4.2.3/include/QtCore/qvector.h:1,
                 from D:/Programs/Qt/4.2.3/include/QtCore/QVector:1,
                 from src\/../header/GetFile.h:4,
                 from src\/../header/mainHttp.h:6,
                 from src\projectdialog.cpp:4:
D:/Programs/Qt/4.2.3/include/QtCore/../../src/corelib/tools/qvector.h: At global
 scope:
D:/Programs/Qt/4.2.3/include/QtCore/../../src/corelib/tools/qvector.h:219: error
: `ptrdiff_t' does not name a type
In file included from D:/Programs/MinGW/bin/../lib/gcc/mingw32/3.4.2/../../../..
/include/c++/3.4.2/map:66,
                 from D:/Programs/Qt/4.2.3/include/QtCore/../../src/corelib/tool
s/qmap.h:32,
                 from D:/Programs/Qt/4.2.3/include/QtCore/qmap.h:1,
                 from D:/Programs/Qt/4.2.3/include/QtNetwork/../../src/network/q
http.h:29,
                 from D:/Programs/Qt/4.2.3/include/QtNetwork/qhttp.h:1,
                 from D:/Programs/Qt/4.2.3/include/QtNetwork/QHttp:1,
                 from src\/../header/GetFile.h:8,
                 from src\/../header/mainHttp.h:6,
                 from src\projectdialog.cpp:4:
D:/Programs/MinGW/bin/../lib/gcc/mingw32/3.4.2/../../../../include/c++/3.4.2/bit
s/stl_tree.h:158: error: `ptrdiff_t' does not name a type
D:/Programs/MinGW/bin/../lib/gcc/mingw32/3.4.2/../../../../include/c++/3.4.2/bit
s/stl_tree.h:228: error: `ptrdiff_t' does not name a type
D:/Programs/MinGW/bin/../lib/gcc/mingw32/3.4.2/../../../../include/c++/3.4.2/bit
s/stl_tree.h:344: error: `ptrdiff_t' does not name a type
In file included from D:/Programs/Qt/4.2.3/include/QtCore/qmap.h:1,
                 from D:/Programs/Qt/4.2.3/include/QtNetwork/../../src/network/q
http.h:29,
                 from D:/Programs/Qt/4.2.3/include/QtNetwork/qhttp.h:1,
                 from D:/Programs/Qt/4.2.3/include/QtNetwork/QHttp:1,
                 from src\/../header/GetFile.h:8,
                 from src\/../header/mainHttp.h:6,
                 from src\projectdialog.cpp:4:
D:/Programs/Qt/4.2.3/include/QtCore/../../src/corelib/tools/qmap.h:184: error: `
ptrdiff_t' does not name a type
D:/Programs/Qt/4.2.3/include/QtCore/../../src/corelib/tools/qmap.h:251: error: `
ptrdiff_t' does not name a type
D:/Programs/Qt/4.2.3/include/QtCore/../../src/corelib/tools/qmap.h:354: error: `
ptrdiff_t' does not name a type
src\projectdialog.cpp: In constructor `ProjectDialog::ProjectDialog(QWidget*)':
src\projectdialog.cpp:15: error: invalid use of undefined type `struct QTimer'
D:/Programs/Qt/4.2.3/include/QtGui/../../src/gui/kernel/qwindowdefs.h:63: error:
 forward declaration of `struct QTimer'
src\projectdialog.cpp:18: error: no matching function for call to `ProjectDialog
::connect(QTimer*&, const char[11], ProjectDialog* const, const char[12])'
D:/Programs/Qt/4.2.3/include/QtCore/../../src/corelib/kernel/qobject.h:181: note
: candidates are: static bool QObject::connect(const QObject*, const char*, cons
t QObject*, const char*, Qt::ConnectionType)
D:/Programs/Qt/4.2.3/include/QtCore/../../src/corelib/kernel/qobject.h:283: note
:                 bool QObject::connect(const QObject*, const char*, const char*
, Qt::ConnectionType) const
src\projectdialog.cpp: In member function `void ProjectDialog::slOnBrowse()':
src\projectdialog.cpp:36: error: `QFileDialog' has not been declared
src\projectdialog.cpp:36: error: `getSaveFileName' undeclared (first use this fu
nction)
src\projectdialog.cpp: In member function `void ProjectDialog::slDataReadProgres
s(int, int)':
src\projectdialog.cpp:96: error: invalid use of undefined type `struct QTimer'
D:/Programs/Qt/4.2.3/include/QtGui/../../src/gui/kernel/qwindowdefs.h:63: error:
 forward declaration of `struct QTimer'
mingw32-make[1]: *** [release\projectdialog.o] Error 1
mingw32-make[1]: Leaving directory `E:/My Projects/QT_pro_new'
mingw32-make: *** [release] Error 2