All pastes #486337 Raw Edit

Mine

public shellscript v1 · immutable
·published 2007-05-13 21:20 UTC
rendered paste body
alpha ~ # emerge net-wireless/orinoco-usbCalculating dependencies... done!>>> Emerging (1 of 1) net-wireless/orinoco-usb-9999 to / * checking ebuild checksums ;-) ...                                      [ ok ] * checking auxfile checksums ;-) ...                                     [ ok ] * checking miscfile checksums ;-) ...                                    [ ok ] * Determining the location of the kernel source code * Found kernel source directory: *     /usr/src/linux * Found kernel object directory: *     /lib/modules/2.6.20-gentoo-r8/build * Found sources for kernel version: *     2.6.20-gentoo-r8 * Checking for suitable kernel configuration options...                  [ ok ]>>> Unpacking source...--- Invalid atom in /etc/portage/package.keywords: -*--- Invalid atom in /etc/portage/package.keywords: *---- Invalid atom in /etc/portage/package.keywords: net-wireless/orinoco-usb-9999 * subversion update start --> *      repository: http://orinoco.svn.sourceforge.net/svnroot/orinoco/branches/usbAt revision 1276. *    working copy: /usr/portage/distfiles/svn-src/orinoco-usb/usb>>> Source unpacked.>>> Compiling source in /var/tmp/portage/net-wireless/orinoco-usb-9999/work/orinoco-usb-9999 ... * Preparing orinoco modulemake -C /lib/modules/2.6.20-gentoo-r8/build M=/var/tmp/portage/net-wireless/orinoco-usb-9999/work/orinoco-usb-9999 KERNELRELEASE=2.6.20-gentoo-r8 modulesmake[1]: Entering directory `/usr/src/linux-2.6.20-gentoo-r8'  CC [M]  /var/tmp/portage/net-wireless/orinoco-usb-9999/work/orinoco-usb-9999/orinoco.o  CC [M]  /var/tmp/portage/net-wireless/orinoco-usb-9999/work/orinoco-usb-9999/orinoco_usb.o/var/tmp/portage/net-wireless/orinoco-usb-9999/work/orinoco-usb-9999/orinoco.c: In function 'orinoco_get_drvinfo':/var/tmp/portage/net-wireless/orinoco-usb-9999/work/orinoco-usb-9999/orinoco.c:4287: error: 'struct net_device' has no member named 'dev'/var/tmp/portage/net-wireless/orinoco-usb-9999/work/orinoco-usb-9999/orinoco.c:4288: error: 'struct net_device' has no member named 'dev'make[2]: *** [/var/tmp/portage/net-wireless/orinoco-usb-9999/work/orinoco-usb-9999/orinoco.o] Error 1make[2]: *** Waiting for unfinished jobs....make[1]: *** [_module_/var/tmp/portage/net-wireless/orinoco-usb-9999/work/orinoco-usb-9999] Error 2make[1]: Leaving directory `/usr/src/linux-2.6.20-gentoo-r8'make: *** [modules] Error 2!!! ERROR: net-wireless/orinoco-usb-9999 failed.Call stack:  ebuild.sh, line 1614:   Called dyn_compile  ebuild.sh, line 971:   Called qa_call 'src_compile'  environment, line 4033:   Called src_compile  ebuild.sh, line 1304:   Called linux-mod_src_compile  linux-mod.eclass, line 516:   Called die!!! Unable to make  KERNEL_PATH=/lib/modules/2.6.20-gentoo-r8/build all.!!! If you need support, post the topmost build error, and the call stack if relevant.!!! A complete build log is located at '/var/tmp/portage/net-wireless/orinoco-usb-9999/temp/build.log'.