PIC -o .libs/libcontainer_folder_la-libcontainer_folder.o
../../../src/library.hh:94: error: Track has not been declared
../../../src/library.hh:125: error: Track was not declared in this scope
../../../src/library.hh:125: error: template argument 2 is invalid
../../../src/library.hh:170: error: Track has not been declared
../../../src/library.hh:171: error: TrackV has not been declared
../../../src/library.hh:200: error: Track has not been declared
../../../src/library.hh:205: error: QuadTUIDMapT does not name a type
../../../src/library.hh:206: error: TripleTUIDMapT does not name a type
../../../src/library.hh:207: error: Quad2TUIDMapT does not name a type
../../../src/library.hh:220: error: AlbumArtist has not been declared
../../../src/library.hh:222: error: Track has not been declared
make[4]: *** [libcontainer_folder_la-libcontainer_folder.lo] Error 1