i586-mandrake-linux-gnu-gcc -DHAVE_CONFIG_H -I. -I. -I.. -I../include -I../lib -I../sasldb -I../include -I-L/usr/lib/mysql -Wall -W -O2 -fomit-frame-pointer -pipe -march=i586 -mtune=pentiumpro -fno-omit-frame-pointer -MT sql.lo -MD -MP -MF .deps/sql.Tpo -c sql.c -fPIC -DPIC -o .libs/sql.o
sql.c:65:19: mysql.h: No such file or directory
sql.c: In function `_mysql_open':
sql.c:71: error: `MYSQL' undeclared (first use in this function)
sql.c:71: error: (Each undeclared identifier is reported only once
sql.c:71: error: for each function it appears in.)
sql.c:71: error: `mysql' undeclared (first use in this function)
sql.c:73: warning: implicit declaration of function `mysql_init'
sql.c:79: warning: implicit declaration of function `mysql_real_connect'
sql.c:81: error: `CLIENT_SSL' undeclared (first use in this function)
sql.c:81: warning: return makes pointer from integer without a cast
sql.c: In function `_mysql_escape_str':
sql.c:86: warning: implicit declaration of function `mysql_escape_string'
sql.c: In function `_mysql_exec':
sql.c:92: error: `MYSQL_RES' undeclared (first use in this function)
sql.c:92: error: `result' undeclared (first use in this function)
sql.c:93: error: `MYSQL_ROW' undeclared (first use in this function)
sql.c:93: error: syntax error before "row"
sql.c:101: warning: implicit declaration of function `mysql_real_query'
sql.c:103: warning: implicit declaration of function `mysql_error'
sql.c:108: warning: implicit declaration of function `mysql_field_count'
sql.c:114: warning: implicit declaration of function `mysql_store_result'
sql.c:122: warning: implicit declaration of function `mysql_num_rows'
sql.c:125: warning: implicit declaration of function `mysql_free_result'
sql.c:136: error: `row' undeclared (first use in this function)
sql.c:136: warning: implicit declaration of function `mysql_fetch_row'
sql.c: In function `_mysql_close':
sql.c:178: warning: implicit declaration of function `mysql_close'
make[2]: *** [sql.lo] Error 1
make[2]: *** Waiting for unfinished jobs....
i586-mandrake-linux-gnu-gcc -DHAVE_CONFIG_H -I. -I. -I.. -I../include -I../lib -I../sasldb -I../include -I-L/usr/lib/mysql -Wall -W -O2 -fomit-frame-pointer -pipe -march=i586 -mtune=pentiumpro -fno-omit-frame-pointer -MT ntlm.lo -MD -MP -MF .deps/ntlm.Tpo -c ntlm.c -o ntlm.o >/dev/null 2>&1
make[2]: Leaving directory `/usr/src/RPM/BUILD/cyrus-sasl-2.1.19/plugins'
make[1]: *** [all-recursive] Error 1
make[1]: Leaving directory `/usr/src/RPM/BUILD/cyrus-sasl-2.1.19'
make: *** [all] Error 2
error: Bad exit status from /var/tmp/rpm-tmp.93868 (%build)
RPM build errors:
Bad exit status from /var/tmp/rpm-tmp.93868 (%build)