- evfs ....................... ERROR!
--------------------------------------------------------------------------------
----------------------------------- Last loglines ------------------------------
evfs_fs_bzip2.c:189: error: 'bzip2_file' has no member named 'stream'
evfs_fs_bzip2.c:190: error: 'bzip2_file' has no member named 'stream'
evfs_fs_bzip2.c:192: error: 'bzip2_file' has no member named 'stream'
evfs_fs_bzip2.c:197: error: 'bzip2_file' has no member named 'stream'
evfs_fs_bzip2.c:210: error: 'bzip2_file' has no member named 'stream'
evfs_fs_bzip2.c:214: error: 'bzip2_file' has no member named 'stream'
evfs_fs_bzip2.c:214: error: 'bzip2_file' has no member named 'stream'
evfs_fs_bzip2.c:216: error: 'bzip2_file' has no member named 'stream'
evfs_fs_bzip2.c:218: error: 'bzip2_file' has no member named 'stream'
evfs_fs_bzip2.c: In function 'evfs_file_close':
evfs_fs_bzip2.c:231: error: 'bzip2_file' has no member named 'stream'
evfs_fs_bzip2.c:231: error: 'BZ_OK' undeclared (first use in this function)
evfs_fs_bzip2.c:236: error: 'bzip2_file' has no member named 'buffer'
make[4]: *** [bzip2_la-evfs_fs_bzip2.lo] Error 1
make[4]: *** Waiting for unfinished jobs....
gcc -DHAVE_CONFIG_H -I. -I. -I../../.. -I. -I../../.. -I../../../src/include -I/usr/local/include -I/usr/local/include -I/usr/local/include -g -O2 -D_FILE_OFFSET_BITS=64 -MT bzip2_la-evfs_debug.lo -MD -MP -MF .deps/bzip2_la-evfs_debug.Tpo -c ../../../src/common/evfs_debug.c -fPIC -DPIC -o .libs/bzip2_la-evfs_debug.o
gcc -DHAVE_CONFIG_H -I. -I. -I../../.. -I. -I../../.. -I../../../src/include -I/usr/local/include -I/usr/local/include -I/usr/local/include -g -O2 -D_FILE_OFFSET_BITS=64 -MT bzip2_la-evfs_debug.lo -MD -MP -MF .deps/bzip2_la-evfs_debug.Tpo -c ../../../src/common/evfs_debug.c -o bzip2_la-evfs_debug.o >/dev/null 2>&1
make[4]: Leaving directory `/root/e17_cvs/e17/apps/evfs/src/plugins/file'
make[3]: *** [all-recursive] Error 1
make[3]: Leaving directory `/root/e17_cvs/e17/apps/evfs/src/plugins'
make[2]: *** [all-recursive] Error 1
make[2]: Leaving directory `/root/e17_cvs/e17/apps/evfs/src'
make[1]: *** [all-recursive] Error 1
make[1]: Leaving directory `/root/e17_cvs/e17/apps/evfs'
make: *** [all] Error 2