All pastes #484719 Raw Edit

Someone

public text v1 · immutable
·published 2007-05-12 11:18 UTC
rendered paste body
make  all-recursive
make[1]: Entering directory `/home/damien/librapi2-0.10.0'
Making all in src
make[2]: Entering directory `/home/damien/librapi2-0.10.0/src'
Making all in support
make[3]: Entering directory `/home/damien/librapi2-0.10.0/src/support'
if /bin/sh ../../libtool --tag=CC --mode=compile gcc -DHAVE_CONFIG_H -I. -I. -I../.. -I../../src   -Wall -Wsign-compare -Wno-long-long  -MT rapi_buffer.lo -MD -MP -MF ".deps/rapi_buffer.Tpo" -c -o rapi_buffer.lo rapi_buffer.c; \
then mv -f ".deps/rapi_buffer.Tpo" ".deps/rapi_buffer.Plo"; else rm -f ".deps/rapi_buffer.Tpo"; exit 1; fi
 gcc -DHAVE_CONFIG_H -I. -I. -I../.. -I../../src -Wall -Wsign-compare -Wno-long-long -MT rapi_buffer.lo -MD -MP -MF .deps/rapi_buffer.Tpo -c rapi_buffer.c  -fPIC -DPIC -o .libs/rapi_buffer.o
In file included from rapi_buffer.h:7,
                 from rapi_buffer.c:3:
../../src/rapi.h:190: error: expected declaration specifiers or '...' before 'PLONG'
make[3]: *** [rapi_buffer.lo] Error 1
make[3]: Leaving directory `/home/damien/librapi2-0.10.0/src/support'
make[2]: *** [all-recursive] Error 1
make[2]: Leaving directory `/home/damien/librapi2-0.10.0/src'
make[1]: *** [all-recursive] Error 1
make[1]: Leaving directory `/home/damien/librapi2-0.10.0'
make: *** [all] Error 2