if /bin/sh ../libtool --tag=CXX --mode=compile ccache g++ -DHAVE_CONFIG_H -I. -I. -I.. -I/usr/local/include/poppler -I/usr/X11/include -pipe -Wall -fno-exceptions -Wno-unused-value -g -Os -fno-omit-frame-pointer -MT main.lo -MD -MP -MF ".deps/main.Tpo" -c -o main.lo main.cpp; \
then mv -f ".deps/main.Tpo" ".deps/main.Plo"; else rm -f ".deps/main.Tpo"; exit 1; fi
mkdir .libs
ccache g++ -DHAVE_CONFIG_H -I. -I. -I.. -I/usr/local/include/poppler -I/usr/X11/include -pipe -Wall -fno-exceptions -Wno-unused-value -g -Os -fno-omit-frame-pointer -MT main.lo -MD -MP -MF .deps/main.Tpo -c main.cpp -fPIC -DPIC -o .libs/main.o
In file included from main.cpp:28:
CPdfDocument.h:35:20: PDFDoc.h: No such file or directory
CPdfDocument.h:36:29: SplashOutputDev.h: No such file or directory
CPdfDocument.h:37:18: Page.h: No such file or directory
CPdfDocument.h:38:25: goo/GooList.h: No such file or directory
In file included from main.cpp:28:
CPdfDocument.h:69: error: ISO C++ forbids declaration of `PDFDoc' with no type
CPdfDocument.h:69: error: expected `;' before '*' token
CPdfDocument.h:70: error: ISO C++ forbids declaration of `SplashOutputDev' with no type
CPdfDocument.h:70: error: expected `;' before '*' token
CPdfDocument.h:71: error: ISO C++ forbids declaration of `Page' with no type
CPdfDocument.h:71: error: expected `;' before '*' token
CPdfDocument.h:72: error: ISO C++ forbids declaration of `GooList' with no type
CPdfDocument.h:72: error: expected `;' before '*' token
main.cpp:33:26: GlobalParams.h: No such file or directory
main.cpp: In function `int GB_INIT()':
main.cpp:60: error: `globalParams' was not declared in this scope
main.cpp:62: error: `GlobalParams' has not been declared
make[4]: *** [main.lo] Error 1
make[4]: Leaving directory `/home/joe1962/packaging/1-build/gambas2-1.9.48/gb.pdf/src'
make[3]: *** [all-recursive] Error 1
make[3]: Leaving directory `/home/joe1962/packaging/1-build/gambas2-1.9.48/gb.pdf'
make[2]: *** [all] Error 2
make[2]: Leaving directory `/home/joe1962/packaging/1-build/gambas2-1.9.48/gb.pdf'
make[1]: *** [all-recursive] Error 1
make[1]: Leaving directory `/home/joe1962/packaging/1-build/gambas2-1.9.48'
make: *** [all] Error 2
sh-3.1#