if /bin/sh ../libtool --tag=CXX --mode=compile ccache g++ -DHAVE_CONFIG_H -I. -I. -I.. -I/usr/include/SDL/ -I/usr/include/SDL -D_GNU_SOURCE=1 -D_REENTRANT -I/usr/include/freetype2 -pipe -Wall -fno-exceptions -Wno-unused-value -g -Os -fno-omit-frame-pointer -MT SDLfont.lo -MD -MP -MF ".deps/SDLfont.Tpo" -c -o SDLfont.lo SDLfont.cpp; \
then mv -f ".deps/SDLfont.Tpo" ".deps/SDLfont.Plo"; else rm -f ".deps/SDLfont.Tpo"; exit 1; fi
ccache g++ -DHAVE_CONFIG_H -I. -I. -I.. -I/usr/include/SDL/ -I/usr/include/SDL -D_GNU_SOURCE=1 -D_REENTRANT -I/usr/include/freetype2 -pipe -Wall -fno-exceptions -Wno-unused-value -g -Os -fno-omit-frame-pointer -MT SDLfont.lo -MD -MP -MF .deps/SDLfont.Tpo -c SDLfont.cpp -fPIC -DPIC -o .libs/SDLfont.o
In file included from SDLfont.h:30,
from SDLfont.cpp:26:
/usr/include/X11/Xft/Xft.h:43:35: fontconfig/fontconfig.h: No such file or directory
In file included from /usr/include/X11/Xft/Xft.h:53,
from SDLfont.h:30,
from SDLfont.cpp:26:
/usr/include/X11/Xft/XftCompat.h:33: error: `FcChar8' does not name a type
/usr/include/X11/Xft/XftCompat.h:34: error: `FcChar16' does not name a type
/usr/include/X11/Xft/XftCompat.h:35: error: `FcChar32' does not name a type
/usr/include/X11/Xft/XftCompat.h:89: error: `FcType' does not name a type
/usr/include/X11/Xft/XftCompat.h:91: error: `FcMatrix' does not name a type
/usr/include/X11/Xft/XftCompat.h:95: error: `FcResult' does not name a type
/usr/include/X11/Xft/XftCompat.h:102: error: `FcValue' does not name a type
/usr/include/X11/Xft/XftCompat.h:103: error: `FcPattern' does not name a type
/usr/include/X11/Xft/XftCompat.h:104: error: `FcFontSet' does not name a type
/usr/include/X11/Xft/XftCompat.h:105: error: `FcObjectSet' does not name a type
/usr/include/X11/Xft/XftCompat.h:160: error: `FcBool' does not name a type
In file included from SDLfont.h:30,
from SDLfont.cpp:26:
/usr/include/X11/Xft/Xft.h:71: error: expected `;' before '*' token
/usr/include/X11/Xft/Xft.h:72: error: expected `;' before '*' token
/usr/include/X11/Xft/Xft.h:83: error: `FcChar32' does not name a type
/usr/include/X11/Xft/Xft.h:90: error: `FcChar32' does not name a type
/usr/include/X11/Xft/Xft.h:136: error: `FcBool' does not name a type
/usr/include/X11/Xft/Xft.h:139: error: `FcBool' does not name a type
/usr/include/X11/Xft/Xft.h:147: error: `FcPattern' has not been declared
/usr/include/X11/Xft/Xft.h:150: error: `FcPattern' has not been declared
/usr/include/X11/Xft/Xft.h:209: error: expected `,' or `...' before '*' token
/usr/include/X11/Xft/Xft.h:218: error: expected `,' or `...' before '*' token
/usr/include/X11/Xft/Xft.h:227: error: expected `,' or `...' before '*' token
/usr/include/X11/Xft/Xft.h:236: error: expected `,' or `...' before '*' token
/usr/include/X11/Xft/Xft.h:245: error: expected `,' or `...' before '*' token
/usr/include/X11/Xft/Xft.h:312: error: expected `,' or `...' before '*' token
/usr/include/X11/Xft/Xft.h:319: error: expected `,' or `...' before '*' token
/usr/include/X11/Xft/Xft.h:326: error: expected `,' or `...' before '*' token
/usr/include/X11/Xft/Xft.h:333: error: expected `,' or `...' before '*' token
/usr/include/X11/Xft/Xft.h:340: error: expected `,' or `...' before '*' token
/usr/include/X11/Xft/Xft.h:346: error: expected constructor, destructor, or type conversion before '*' token
/usr/include/X11/Xft/Xft.h:370: error: expected `,' or `...' before '*' token
/usr/include/X11/Xft/Xft.h:375: error: `FcChar32' does not name a type
/usr/include/X11/Xft/Xft.h:378: error: `FcBool' does not name a type
/usr/include/X11/Xft/Xft.h:383: error: `FcPattern' has not been declared
/usr/include/X11/Xft/Xft.h:387: error: `FcPattern' has not been declared
/usr/include/X11/Xft/Xft.h:395: error: `FcBool' does not name a type
/usr/include/X11/Xft/Xft.h:402: error: `FcBool' has not been declared
/usr/include/X11/Xft/Xft.h:414: error: `FcBool' does not name a type
/usr/include/X11/Xft/Xft.h:422: error: `FcBool' does not name a type
/usr/include/X11/Xft/Xft.h:430: error: `FcChar32' has not been declared
/usr/include/X11/Xft/Xft.h:435: error: `FcBool' does not name a type
/usr/include/X11/Xft/Xft.h:445: error: expected constructor, destructor, or type conversion before '*' token
/usr/include/X11/Xft/Xft.h:456: error: expected constructor, destructor, or type conversion before '*' token
/usr/include/X11/Xft/Xft.h:526: error: expected `,' or `...' before '*' token
/usr/include/X11/Xft/Xft.h:539: error: expected `,' or `...' before '*' token
/usr/include/X11/Xft/Xft.h:552: error: expected `,' or `...' before '*' token
/usr/include/X11/Xft/Xft.h:565: error: expected `,' or `...' before '*' token
/usr/include/X11/Xft/Xft.h:578: error: expected `,' or `...' before '*' token
/usr/include/X11/Xft/Xft.h:591: error: expected `,' or `...' before '*' token
/usr/include/X11/Xft/Xft.h:604: error: expected `,' or `...' before '*' token
/usr/include/X11/Xft/Xft.h:617: error: expected `,' or `...' before '*' token
/usr/include/X11/Xft/Xft.h:630: error: expected `,' or `...' before '*' token
/usr/include/X11/Xft/Xft.h:637: error: expected constructor, destructor, or type conversion before '*' token
SDLfont.cpp: In static member function `static StringList SDLfont::GetFontList()':
SDLfont.cpp:49: error: `XftFontSet' was not declared in this scope
SDLfont.cpp:49: error: `hSet' was not declared in this scope
SDLfont.cpp:49: error: `FC_FAMILY' was not declared in this scope
SDLfont.cpp:49: error: `XftListFonts' was not declared in this scope
SDLfont.cpp:55: error: `XftResult' was not declared in this scope
SDLfont.cpp:55: error: expected `;' before "res"
SDLfont.cpp:55: warning: unused variable 'XftResult'
SDLfont.cpp:49: warning: unused variable 'XftFontSet'
SDLfont.cpp:49: warning: unused variable 'FC_FAMILY'
SDLfont.cpp:49: warning: unused variable 'XftListFonts'
make[4]: *** [SDLfont.lo] Error 1
make[4]: Leaving directory `/home/joe1962/packaging/1-build/gambas2-1.9.48/gb.sdl/src'
make[3]: *** [all-recursive] Error 1
make[3]: Leaving directory `/home/joe1962/packaging/1-build/gambas2-1.9.48/gb.sdl'
make[2]: *** [all] Error 2
make[2]: Leaving directory `/home/joe1962/packaging/1-build/gambas2-1.9.48/gb.sdl'
make[1]: *** [all-recursive] Error 1
make[1]: Leaving directory `/home/joe1962/packaging/1-build/gambas2-1.9.48'
make: *** [all] Error 2
sh-3.1#