All pastes #483480 Raw Edit

bmpx compiling probl

public text v1 · immutable
·published 2007-05-11 19:13 UTC
rendered paste body
 g++ -DHAVE_CONFIG_H -I. -I. -I../../.. -I../../.. -I../../../libhal++ -I../../../sqlite -I../../../include -I/usr/include/libxml2 -pthread -I/usr/include/glib-2.0 -I/usr/lib/glib-2.0/include -DG_LOG_DOMAIN=\"BMP\" -DPREFIX=\"/usr\" -DPLUGIN_DIR=\"/usr/lib/bmpx/plugins\" -DDATA_DIR=\"/usr/share/bmpx\" -DLOCALE_DIR=\"/usr/share/locale\" -DBMP_PLUGIN_BUILD -I/usr/include/glibmm-2.4 -I/usr/lib/glibmm-2.4/include -I/usr/include/sigc++-2.0 -I/usr/lib/sigc++-2.0/include -I/usr/include/glib-2.0 -I/usr/lib/glib-2.0/include -I/usr/include/gtkmm-2.4 -I/usr/lib/gtkmm-2.4/include -I/usr/include/glibmm-2.4 -I/usr/lib/glibmm-2.4/include -I/usr/include/gdkmm-2.4 -I/usr/lib/gdkmm-2.4/include -I/usr/include/pangomm-1.4 -I/usr/include/atkmm-1.6 -I/usr/include/gtk-2.0 -I/usr/include/sigc++-2.0 -I/usr/lib/sigc++-2.0/include -I/usr/include/glib-2.0 -I/usr/lib/glib-2.0/include -I/usr/lib/gtk-2.0/include -I/usr/include/cairomm-1.0 -I/usr/include/pango-1.0 -I/usr/include/cairo -I/usr/include/freetype2 -I/usr/include/libpng12 -I/usr/include/atk-1.0 -g -O2 -MT libcontainer_folder_la-libcontainer_folder.lo -MD -MP -MF .deps/libcontainer_folder_la-libcontainer_folder.Tpo -c libcontainer_folder.cc  -fPIC -DPIC -o .libs/libcontainer_folder_la-libcontainer_folder.o
../../../src/library.hh:94: error: 'Track' has not been declared
../../../src/library.hh:125: error: 'Track' was not declared in this scope
../../../src/library.hh:125: error: template argument 2 is invalid
../../../src/library.hh:170: error: 'Track' has not been declared
../../../src/library.hh:171: error: 'TrackV' has not been declared
../../../src/library.hh:200: error: 'Track' has not been declared
../../../src/library.hh:205: error: 'QuadTUIDMapT' does not name a type
../../../src/library.hh:206: error: 'TripleTUIDMapT' does not name a type
../../../src/library.hh:207: error: 'Quad2TUIDMapT' does not name a type
../../../src/library.hh:220: error: 'AlbumArtist' has not been declared
../../../src/library.hh:222: error: 'Track' has not been declared
make[4]: *** [libcontainer_folder_la-libcontainer_folder.lo] Error 1
make[4]: Leaving directory `/home/andy80/download/bmpx/plugins/vfs/container'
make[3]: *** [all-recursive] Error 1
make[3]: Leaving directory `/home/andy80/download/bmpx/plugins/vfs'
make[2]: *** [all-recursive] Error 1
make[2]: Leaving directory `/home/andy80/download/bmpx/plugins'
make[1]: *** [all-recursive] Error 1
make[1]: Leaving directory `/home/andy80/download/bmpx'
make: *** [all] Error 2