updating cache ./config.cache
creating ./config.status
creating Makefile
creating plugins/Makefile
creating config.h
+ make
gcc -g -O2 -Wall -DDEFAULT_PATH=\"/usr/local/share/cheops\" -DLIB_PATH=\"/usr/local/lib/cheops\" -I/usr/include/gtk-1.2 -I/usr/include/glib-1.2 -I/usr/lib64/glib/include -I/usr/X11R6/include -I/usr/include/ucd-snmp -DSNMP -DHAS_GMODULE -c -o browser.o browser.c
In file included from browser.c:18:
/usr/include/ucd-snmp/asn1.h:7:2: error: #error "Please update your headers or configure using --enable-ucd-snmp-compatibility"
In file included from browser.c:19:
/usr/include/ucd-snmp/mib.h:7:2: error: #error "Please update your headers or configure using --enable-ucd-snmp-compatibility"
In file included from browser.c:20:
/usr/include/ucd-snmp/parse.h:7:2: error: #error "Please update your headers or configure using --enable-ucd-snmp-compatibility"
In file included from browser.c:21:
/usr/include/ucd-snmp/snmp_api.h:7:2: error: #error "Please update your headers or configure using --enable-ucd-snmp-compatibility"
In file included from browser.c:22:
/usr/include/ucd-snmp/snmp_client.h:7:2: error: #error "Please update your headers or configure using --enable-ucd-snmp-compatibility"
In file included from browser.c:23:
/usr/include/ucd-snmp/snmp.h:7:2: error: #error "Please update your headers or configure using --enable-ucd-snmp-compatibility"
In file included from browser.c:24:
/usr/include/ucd-snmp/snmp_impl.h:9:2: error: #error "Please update your headers or configure using --enable-ucd-snmp-compatibility"
browser.c: In function status2str:
browser.c:59: error: MIB_STATUS_MANDATORY undeclared (first use in this function)
browser.c:59: error: (Each undeclared identifier is reported only once
browser.c:59: error: for each function it appears in.)
browser.c:61: error: MIB_STATUS_OPTIONAL undeclared (first use in this function)
browser.c:63: error: MIB_STATUS_OBSOLETE undeclared (first use in this function)
browser.c:65: error: MIB_STATUS_DEPRECATED undeclared (first use in this function)
browser.c:67: error: MIB_STATUS_CURRENT undeclared (first use in this function)
browser.c: In function access2str:
browser.c:105: error: MIB_ACCESS_READONLY undeclared (first use in this function)
browser.c:107: error: MIB_ACCESS_READWRITE undeclared (first use in this function)
browser.c:109: error: MIB_ACCESS_NOACCESS undeclared (first use in this function)
browser.c:111: error: MIB_ACCESS_NOTIFY undeclared (first use in this function)
browser.c:113: error: MIB_ACCESS_CREATE undeclared (first use in this function)
browser.c: In function type2type:
browser.c:125: error: ASN_OBJECT_ID undeclared (first use in this function)
browser.c:127: error: ASN_OCTET_STR undeclared (first use in this function)
browser.c:129: error: ASN_INTEGER undeclared (first use in this function)
browser.c:131: error: ASN_IPADDRESS undeclared (first use in this function)
browser.c:133: error: ASN_COUNTER undeclared (first use in this function)
browser.c:135: error: ASN_GAUGE undeclared (first use in this function)
browser.c:137: error: ASN_TIMETICKS undeclared (first use in this function)
browser.c: In function type2str:
browser.c:147: error: ASN_IPADDRESS undeclared (first use in this function)
browser.c:149: error: ASN_COUNTER undeclared (first use in this function)
browser.c:151: error: ASN_GAUGE undeclared (first use in this function)
browser.c:153: error: ASN_OPAQUE undeclared (first use in this function)
browser.c:155: error: ASN_BOOLEAN undeclared (first use in this function)
browser.c:157: error: ASN_INTEGER undeclared (first use in this function)
browser.c:159: error: ASN_BIT_STR undeclared (first use in this function)
browser.c:161: error: ASN_OCTET_STR undeclared (first use in this function)
browser.c:163: error: ASN_NULL undeclared (first use in this function)
browser.c:165: error: ASN_OBJECT_ID undeclared (first use in this function)
browser.c:167: error: ASN_SEQUENCE undeclared (first use in this function)
browser.c:169: error: ASN_SET undeclared (first use in this function)
browser.c:171: error: ASN_TIMETICKS undeclared (first use in this function)
browser.c: In function show_value:
browser.c:206: error: oid undeclared (first use in this function)
browser.c:206: error: syntax error before name
browser.c:217: error: name undeclared (first use in this function)
browser.c:219: warning: implicit declaration of function read_objid
browser.c:220: warning: implicit declaration of function get_tree_head
browser.c:220: warning: assignment makes pointer from integer without a cast
browser.c:221: warning: implicit declaration of function get_tree
browser.c:221: warning: assignment makes pointer from integer without a cast
browser.c:223: error: dereferencing pointer to incomplete type
browser.c:246: error: dereferencing pointer to incomplete type
browser.c:246: error: MIB_ACCESS_READWRITE undeclared (first use in this function)
browser.c:274: error: dereferencing pointer to incomplete type
browser.c:274: error: dereferencing pointer to incomplete type
browser.c:289: error: dereferencing pointer to incomplete type
browser.c:303: error: dereferencing pointer to incomplete type
browser.c:322: error: dereferencing pointer to incomplete type
make: *** [browser.o] Error 1
error: Bad exit status from /var/tmp/rpm-tmp.97754 (%build)
RPM build errors:
Bad exit status from /var/tmp/rpm-tmp.97754 (%build)