All pastes #481463 Raw Edit

Unnamed

public text v1 · immutable
·published 2007-05-10 20:56 UTC
rendered paste body
mars:/usr/local/src# m-a a-b -t --apt-search drbd0.7-module-source -k /usr/local/src/linux-2.6.18.8/
Extracting the package tarball, /usr/src/drbd0.7.tar.gz
dpatch  deapply-all
rm -rf patch-stamp patch-stampT debian/patched
dh_clean
/usr/bin/make -C drbd clean
grep: /lib/modules/2.6.19.7-sata-support/build/Makefile: No such file or directory
grep: /lib/modules/2.6.19.7-sata-support/build/Makefile: No such file or directory
make[1]: Entering directory `/usr/src/modules/drbd/drbd'
rm -f *.[oas] *.ko .*.cmd .*.d .*.tmp *.mod.c .*.flags .depend .kernel*
make[1]: Leaving directory `/usr/src/modules/drbd/drbd'
/usr/bin/make  -f debian/rules kdist_clean kdist_config binary-modules
make[1]: Entering directory `/usr/src/modules/drbd'
dpatch  deapply-all
rm -rf patch-stamp patch-stampT debian/patched
dh_clean
/usr/bin/make -C drbd clean
grep: /lib/modules/2.6.19.7-sata-support/build/Makefile: No such file or directory
grep: /lib/modules/2.6.19.7-sata-support/build/Makefile: No such file or directory
make[2]: Entering directory `/usr/src/modules/drbd/drbd'
rm -f *.[oas] *.ko .*.cmd .*.d .*.tmp *.mod.c .*.flags .depend .kernel*
make[2]: Leaving directory `/usr/src/modules/drbd/drbd'
for templ in /usr/src/modules/drbd/debian/drbd0.7-module-_KVERS_.postinst /usr/src/modules/drbd/debian/drbd0.7-module-_KVERS_.postinst.backup /usr/src/modules/drbd/debian/drbd0.7-module-_KVERS_.postinst.modules.in; do \
    cp $templ `echo $templ | sed -e 's/_KVERS_//g'` ; \
  done
for templ in `ls debian/*.modules.in` ; do \
    test -e ${templ%.modules.in}.backup || cp ${templ%.modules.in} ${templ%.modules.in}.backup 2>/dev/null || true; \
    sed -e 's/##KVERS##//g ;s/#KVERS#//g ; s/_KVERS_//g ; s/##KDREV##/10.00.Custom/g ; s/#KDREV#/10.00.Custom/g ; s/_KDREV_/10.00.Custom/g' < $templ > ${templ%.modules.in}; \
  done
dh_testdir
dh_testroot
dh_clean -k
/usr/bin/make -C drbd KERNEL_SOURCES=/usr/local/src/linux-2.6.18.8/ MODVERSIONS=detect KERNEL=linux- KDIR=/usr/local/src/linux-2.6.18.8/
make[2]: Entering directory `/usr/src/modules/drbd/drbd'

    Calling toplevel makefile of kernel source tree, which I believe is in
    KDIR=/usr/local/src/linux-2.6.18.8/

test -f ../scripts/adjust_drbd_config_h.sh && \
 KDIR=/usr/local/src/linux-2.6.18.8/ /bin/sh ../scripts/adjust_drbd_config_h.sh

  Using unmodified drbd_config.h

/usr/bin/make -C /usr/local/src/linux-2.6.18.8/ SUBDIRS=/usr/src/modules/drbd/drbd  modules
make[3]: Entering directory `/usr/local/src/linux-2.6.18.8'
  CC [M]  /usr/src/modules/drbd/drbd/drbd_sizeof_sanity_check.o
  CC [M]  /usr/src/modules/drbd/drbd/drbd_buildtag.o
  CC [M]  /usr/src/modules/drbd/drbd/drbd_bitmap.o
In file included from /usr/src/modules/drbd/drbd/drbd_bitmap.c:34:
/usr/src/modules/drbd/drbd/drbd_int.h:1104:5: warning: "USE_RW_WAIT_QUEUE_SPINLOCK" is not defined
  CC [M]  /usr/src/modules/drbd/drbd/drbd_fs.o
In file included from /usr/src/modules/drbd/drbd/drbd_fs.c:43:
/usr/src/modules/drbd/drbd/drbd_int.h:1104:5: warning: "USE_RW_WAIT_QUEUE_SPINLOCK" is not defined
/usr/src/modules/drbd/drbd/drbd_fs.c: In function `drbd_ioctl_set_disk':
/usr/src/modules/drbd/drbd/drbd_fs.c:432: warning: comparison of distinct pointer types lacks a cast
  CC [M]  /usr/src/modules/drbd/drbd/drbd_proc.o
In file included from /usr/src/modules/drbd/drbd/drbd_proc.c:39:
/usr/src/modules/drbd/drbd/drbd_int.h:1104:5: warning: "USE_RW_WAIT_QUEUE_SPINLOCK" is not defined
  CC [M]  /usr/src/modules/drbd/drbd/drbd_worker.o
In file included from /usr/src/modules/drbd/drbd/drbd_worker.c:43:
/usr/src/modules/drbd/drbd/drbd_int.h:1104:5: warning: "USE_RW_WAIT_QUEUE_SPINLOCK" is not defined
  CC [M]  /usr/src/modules/drbd/drbd/drbd_receiver.o
In file included from /usr/src/modules/drbd/drbd/drbd_receiver.c:53:
/usr/src/modules/drbd/drbd/drbd_int.h:1104:5: warning: "USE_RW_WAIT_QUEUE_SPINLOCK" is not defined
/usr/src/modules/drbd/drbd/drbd_receiver.c: In function `drbd_accept':
/usr/src/modules/drbd/drbd/drbd_receiver.c:496: error: `IPPROTO_TCP' undeclared (first use in this function)
/usr/src/modules/drbd/drbd/drbd_receiver.c:496: error: (Each undeclared identifier is reported only once
/usr/src/modules/drbd/drbd/drbd_receiver.c:496: error: for each function it appears in.)
make[4]: *** [/usr/src/modules/drbd/drbd/drbd_receiver.o] Error 1
make[3]: *** [_module_/usr/src/modules/drbd/drbd] Error 2
make[3]: Leaving directory `/usr/local/src/linux-2.6.18.8'
make[2]: *** [kbuild] Error 2
make[2]: Leaving directory `/usr/src/modules/drbd/drbd'
make[1]: *** [binary-modules] Error 2
make[1]: Leaving directory `/usr/src/modules/drbd'
make: *** [kdist_build] Error 2
BUILD FAILED!
See /var/cache/modass/drbd0.7-module-source.buildlog..1178830289 for details.
Build failed. Press Return to continue...

mars:/usr/local/src#