structure.cpp:24:25: kartsserver.h: No such file or directory
structure.cpp: In member function `virtual bool Structure::startExecute()':
structure.cpp:109: error: `KArtsServer' undeclared (first use this function)
structure.cpp:109: error: (Each undeclared identifier is reported only once for each function it appears in.)
main.cpp:56:25: kartsserver.h: No such file or directory
make[4]: *** [structure.o] Error 1
make[4]: *** Waiting for unfinished jobs....
main.cpp: In member function `bool ArtsBuilderWindow::save(QString)':
main.cpp:605: error: `KArtsServer' undeclared (first use this function)
main.cpp:605: error: (Each undeclared identifier is reported only once for each function it appears in.)
make[4]: *** [main.o] Error 1
make[4]: Leaving directory `/var/tmp/portage/kdemultimedia-3.3.2/work/kdemultimedia-3.3.2/arts/builder'
make[3]: *** [all-recursive] Error 1
make[3]: Leaving directory `/var/tmp/portage/kdemultimedia-3.3.2/work/kdemultimedia-3.3.2/arts/builder'
make[2]: *** [all-recursive] Error 1
make[2]: Leaving directory `/var/tmp/portage/kdemultimedia-3.3.2/work/kdemultimedia-3.3.2/arts'
make[1]: *** [all-recursive] Error 1
make[1]: Leaving directory `/var/tmp/portage/kdemultimedia-3.3.2/work/kdemultimedia-3.3.2'
make: *** [all] Error 2
!!! ERROR: kde-base/kdemultimedia-3.3.2 failed.
!!! Function kde_src_compile, Line 142, Exitcode 2
!!! died running emake, kde_src_compile:make
!!! If you need support, post the topmost build error, NOT this status message.